{"receipt_id":"base-1","seq":1,"branch_id":"base","kind":"command","cmd":"python -c 'import base64; from pathlib import Path; Path('\"'\"'/tmp/receipts-robotframework__seleniumlibrary-1431-test.patch'\"'\"').write_bytes(base64.b64decode('\"'\"'ZGlmZiAtLWdpdCBhL3V0ZXN0L3Rlc3QvYXBpL3BsdWdpbl93aXRoX2V2ZW50X2ZpcmluZ193ZWJkcml2ZXIucHkgYi91dGVzdC90ZXN0L2FwaS9wbHVnaW5fd2l0aF9ldmVudF9maXJpbmdfd2ViZHJpdmVyLnB5Cm5ldyBmaWxlIG1vZGUgMTAwNjQ0CmluZGV4IDAwMDAwMDAwLi44ZGJmMTNjNwotLS0gL2Rldi9udWxsCisrKyBiL3V0ZXN0L3Rlc3QvYXBpL3BsdWdpbl93aXRoX2V2ZW50X2ZpcmluZ193ZWJkcml2ZXIucHkKQEAgLTAsMCArMSwxMiBAQAorZnJvbSBTZWxlbml1bUxpYnJhcnkuYmFzZSBpbXBvcnQgTGlicmFyeUNvbXBvbmVudCwga2V5d29yZAorCisKK2NsYXNzIHBsdWdpbl93aXRoX2V2ZW50X2ZpcmluZ193ZWJkcml2ZXIoTGlicmFyeUNvbXBvbmVudCk6CisKKyAgICBkZWYgX19pbml0X18oc2VsZiwgY3R4KToKKyAgICAgICAgTGlicmFyeUNvbXBvbmVudC5fX2luaXRfXyhzZWxmLCBjdHgpCisgICAgICAgIHNlbGYuZXZlbnRfZmlyaW5nX3dlYmRyaXZlciA9ICdldmVudF9maXJpbmdfd2ViZHJpdmVyJworCisgICAgQGtleXdvcmQKKyAgICBkZWYgdGlkaWkoc2VsZik6CisgICAgICAgIHNlbGYuaW5mbygnZm9vJykKZGlmZiAtLWdpdCBhL3V0ZXN0L3Rlc3QvYXBpL3Rlc3RfcGx1Z2lucy5weSBiL3V0ZXN0L3Rlc3QvYXBpL3Rlc3RfcGx1Z2lucy5weQppbmRleCBkODRhOGQxNi4uYjlhYTRjYjQgMTAwNjQ0Ci0tLSBhL3V0ZXN0L3Rlc3QvYXBpL3Rlc3RfcGx1Z2lucy5weQorKysgYi91dGVzdC90ZXN0L2FwaS90ZXN0X3BsdWdpbnMucHkKQEAgLTEwOSwzICsxMDksOSBAQCBjbGFzcyBFeHRlbmRpbmdTZWxlbml1bUxpYnJhcnkodW5pdHRlc3QuVGVzdENhc2UpOgogICAgICAgICBldmVudF9maXJpbmdfd2QgPSBvcy5wYXRoLmpvaW4oc2VsZi5yb290X2RpciwgJ015TGlzdGVuZXIucHknKQogICAgICAgICBzbCA9IFNlbGVuaXVtTGlicmFyeShwbHVnaW5zPXBsdWdpbl9maWxlLCBldmVudF9maXJpbmdfd2ViZHJpdmVyPWV2ZW50X2ZpcmluZ193ZCkKICAgICAgICAgc2VsZi5hc3NlcnRFcXVhbChzbC5ldmVudF9maXJpbmdfd2ViZHJpdmVyLCAnc2hvdWxkIGJlIGxhc3QnKQorCisgICAgZGVmIHRlc3RfZWFzaWVyX2V2ZW50X2ZpcmluZ193ZWJkcml2ZXJfZnJvbV9wbHVnaW4oc2VsZik6CisgICAgICAgIHBsdWdpbl9maWxlID0gb3MucGF0aC5qb2luKHNlbGYucm9vdF9kaXIsICdwbHVnaW5fd2l0aF9ldmVudF9maXJpbmdfd2ViZHJpdmVyLnB5JykKKyAgICAgICAgc2wgPSBTZWxlbml1bUxpYnJhcnkocGx1Z2lucz1wbHVnaW5fZmlsZSkKKyAgICAgICAgc2VsZi5hc3NlcnRFcXVhbChzbC5fcGx1Z2luX2tleXdvcmRzLCBbJ3RpZGlpJ10pCisgICAgICAgIHNlbGYuYXNzZXJ0RXF1YWwoc2wuZXZlbnRfZmlyaW5nX3dlYmRyaXZlciwgJ2V2ZW50X2ZpcmluZ193ZWJkcml2ZXInKQo='\"'\"'))'","path":null,"exit_code":0,"stdout_tail":"","stderr_tail":"","stdout_sha256":"e3b0c44298fc1c149afbf4c8996fb92427ae41e4649b934ca495991b7852b855","log_path":"~/dev/nebius-hackathon/pilot/v2-arm-lightning/robotframework__seleniumlibrary-1431/runs/pilot-robotframework__seleniumlibrary-1431-86cdd86202/logs/base/base-1.log","tree_digest":null,"tree_download_s":null,"started_at":"2026-10-03T22:10:44.729447Z","duration_s":0.022529,"timed_out":false,"image_before":"5495afdc-7eb3-37c0-b57a-3e90cb2fbc76","image_after":"949279bb-bc29-4ebc-90cb-65e3260ceded","junit":null,"diff":null,"patch_sha256":null,"dropped_paths":[],"snapshot_sha":null}
{"receipt_id":"base-2","seq":2,"branch_id":"base","kind":"command","cmd":"git apply /tmp/receipts-robotframework__seleniumlibrary-1431-test.patch","path":null,"exit_code":0,"stdout_tail":"","stderr_tail":"","stdout_sha256":"e3b0c44298fc1c149afbf4c8996fb92427ae41e4649b934ca495991b7852b855","log_path":"~/dev/nebius-hackathon/pilot/v2-arm-lightning/robotframework__seleniumlibrary-1431/runs/pilot-robotframework__seleniumlibrary-1431-86cdd86202/logs/base/base-2.log","tree_digest":null,"tree_download_s":null,"started_at":"2026-10-03T22:10:46.624364Z","duration_s":0.003719,"timed_out":false,"image_before":"949279bb-bc29-4ebc-90cb-65e3260ceded","image_after":"e8462cc8-cb4e-414f-aca0-9d19647d73c3","junit":null,"diff":null,"patch_sha256":null,"dropped_paths":[],"snapshot_sha":null}
{"receipt_id":"base-3","seq":3,"branch_id":"base","kind":"command","cmd":"/opt/receipts-a66dc50e06c64b1b88e43776993642f4/bin/busybox mkdir -p /opt/receipts/reports && python -I /opt/receipts-a66dc50e06c64b1b88e43776993642f4/receipts_pytest.py --no-header -rA --tb=line --color=no -p no:cacheprovider -W ignore::DeprecationWarning utest/test/api/plugin_with_event_firing_webdriver.py utest/test/api/test_plugins.py -o junit_family=xunit1 -p no:cacheprovider -rA --continue-on-collection-errors --junitxml=/opt/receipts/reports/base-3.xml","path":null,"exit_code":1,"stdout_tail":"============================= test session starts ==============================\ncollected 13 items\n\nutest/test/api/test_plugins.py ..F..........                             [100%]\n\n=================================== FAILURES ===================================\n/usr/local/lib/python3.7/unittest/case.py:845: AssertionError: None != 'event_firing_webdriver'\n==================================== PASSES ====================================\n------------- generated xml file: /opt/receipts/reports/base-3.xml -------------\n=========================== short test summary info ============================\nPASSED utest/test/api/test_plugins.py::ExtendingSeleniumLibrary::test_comma_and_space\nPASSED utest/test/api/test_plugins.py::ExtendingSeleniumLibrary::test_comma_and_space_with_arg\nPASSED utest/test/api/test_plugins.py::ExtendingSeleniumLibrary::test_no_libraries\nPASSED utest/test/api/test_plugins.py::ExtendingSeleniumLibrary::test_no_library_component_inherit\nPASSED utest/test/api/test_plugins.py::ExtendingSeleniumLibrary::test_parse_libraries\nPASSED utest/test/api/test_plugins.py::ExtendingSeleniumLibrary::test_parse_library\nPASSED utest/test/api/test_plugins.py::ExtendingSeleniumLibrary::test_parse_library_with_args\nPASSED utest/test/api/test_plugins.py::ExtendingSeleniumLibrary::test_parse_plugin_with_kw_args\nPASSED utest/test/api/test_plugins.py::ExtendingSeleniumLibrary::test_plugin_as_last_in_init\nPASSED utest/test/api/test_plugins.py::ExtendingSeleniumLibrary::test_plugin_does_not_exist\nPASSED utest/test/api/test_plugins.py::ExtendingSeleniumLibrary::test_plugin_wrong_import_with_path\nPASSED utest/test/api/test_plugins.py::ExtendingSeleniumLibrary::test_sl_with_kw_args_plugin\nFAILED utest/test/api/test_plugins.py::ExtendingSeleniumLibrary::test_easier_event_firing_webdriver_from_plugin\n========================= 1 failed, 12 passed in 0.34s =========================\n","stderr_tail":"","stdout_sha256":"54d20c2119eaf8c13b7b001cf25af085bd8a002c66072f61ce430fe6ffe651e4","log_path":"~/dev/nebius-hackathon/pilot/v2-arm-lightning/robotframework__seleniumlibrary-1431/runs/pilot-robotframework__seleniumlibrary-1431-86cdd86202/logs/base/base-3.log","tree_digest":"f303c4bb9f271f7a5d972ff5ebd897b964e8a143b64ad7fde3af5a3b3255ad2d","tree_download_s":3.3111625409219414,"started_at":"2026-10-03T22:10:47.881168Z","duration_s":0.390795,"timed_out":false,"image_before":"e8462cc8-cb4e-414f-aca0-9d19647d73c3","image_after":"d6fa6cc4-8bb9-41e5-84ed-f1a8245bcf6e","junit":{"passed":["utest/test/api/test_plugins.py::ExtendingSeleniumLibrary::test_comma_and_space","utest/test/api/test_plugins.py::ExtendingSeleniumLibrary::test_comma_and_space_with_arg","utest/test/api/test_plugins.py::ExtendingSeleniumLibrary::test_no_libraries","utest/test/api/test_plugins.py::ExtendingSeleniumLibrary::test_no_library_component_inherit","utest/test/api/test_plugins.py::ExtendingSeleniumLibrary::test_parse_libraries","utest/test/api/test_plugins.py::ExtendingSeleniumLibrary::test_parse_library","utest/test/api/test_plugins.py::ExtendingSeleniumLibrary::test_parse_library_with_args","utest/test/api/test_plugins.py::ExtendingSeleniumLibrary::test_parse_plugin_with_kw_args","utest/test/api/test_plugins.py::ExtendingSeleniumLibrary::test_plugin_as_last_in_init","utest/test/api/test_plugins.py::ExtendingSeleniumLibrary::test_plugin_does_not_exist","utest/test/api/test_plugins.py::ExtendingSeleniumLibrary::test_plugin_wrong_import_with_path","utest/test/api/test_plugins.py::ExtendingSeleniumLibrary::test_sl_with_kw_args_plugin"],"failed":["utest/test/api/test_plugins.py::ExtendingSeleniumLibrary::test_easier_event_firing_webdriver_from_plugin"],"errors":[],"skipped":[],"collection_errors":[],"failure_text":{"utest/test/api/test_plugins.py::ExtendingSeleniumLibrary::test_easier_event_firing_webdriver_from_plugin":"AssertionError: None != 'event_firing_webdriver'\nE   AssertionError: None != 'event_firing_webdriver'"}},"diff":null,"patch_sha256":null,"dropped_paths":[],"snapshot_sha":null}
{"receipt_id":"base-4","seq":4,"branch_id":"base","kind":"command","cmd":"/opt/receipts-ac51999ef4bf4f7b8ffdd602d7dc4f89/bin/busybox mkdir -p /opt/receipts/reports && python -I /opt/receipts-ac51999ef4bf4f7b8ffdd602d7dc4f89/receipts_pytest.py --no-header -rA --tb=line --color=no -p no:cacheprovider -W ignore::DeprecationWarning utest/test/api/plugin_with_event_firing_webdriver.py utest/test/api/test_plugins.py -o junit_family=xunit1 -p no:cacheprovider -rA --continue-on-collection-errors --junitxml=/opt/receipts/reports/base-4.xml","path":null,"exit_code":1,"stdout_tail":"============================= test session starts ==============================\ncollected 13 items\n\nutest/test/api/test_plugins.py ..F..........                             [100%]\n\n=================================== FAILURES ===================================\n/usr/local/lib/python3.7/unittest/case.py:845: AssertionError: None != 'event_firing_webdriver'\n==================================== PASSES ====================================\n------------- generated xml file: /opt/receipts/reports/base-4.xml -------------\n=========================== short test summary info ============================\nPASSED utest/test/api/test_plugins.py::ExtendingSeleniumLibrary::test_comma_and_space\nPASSED utest/test/api/test_plugins.py::ExtendingSeleniumLibrary::test_comma_and_space_with_arg\nPASSED utest/test/api/test_plugins.py::ExtendingSeleniumLibrary::test_no_libraries\nPASSED utest/test/api/test_plugins.py::ExtendingSeleniumLibrary::test_no_library_component_inherit\nPASSED utest/test/api/test_plugins.py::ExtendingSeleniumLibrary::test_parse_libraries\nPASSED utest/test/api/test_plugins.py::ExtendingSeleniumLibrary::test_parse_library\nPASSED utest/test/api/test_plugins.py::ExtendingSeleniumLibrary::test_parse_library_with_args\nPASSED utest/test/api/test_plugins.py::ExtendingSeleniumLibrary::test_parse_plugin_with_kw_args\nPASSED utest/test/api/test_plugins.py::ExtendingSeleniumLibrary::test_plugin_as_last_in_init\nPASSED utest/test/api/test_plugins.py::ExtendingSeleniumLibrary::test_plugin_does_not_exist\nPASSED utest/test/api/test_plugins.py::ExtendingSeleniumLibrary::test_plugin_wrong_import_with_path\nPASSED utest/test/api/test_plugins.py::ExtendingSeleniumLibrary::test_sl_with_kw_args_plugin\nFAILED utest/test/api/test_plugins.py::ExtendingSeleniumLibrary::test_easier_event_firing_webdriver_from_plugin\n========================= 1 failed, 12 passed in 0.33s =========================\n","stderr_tail":"","stdout_sha256":"906824b92a0971240ea078151d57220262f1993bed95c979f1a9096991b81897","log_path":"~/dev/nebius-hackathon/pilot/v2-arm-lightning/robotframework__seleniumlibrary-1431/runs/pilot-robotframework__seleniumlibrary-1431-86cdd86202/logs/base/base-4.log","tree_digest":"f303c4bb9f271f7a5d972ff5ebd897b964e8a143b64ad7fde3af5a3b3255ad2d","tree_download_s":1.819324041949585,"started_at":"2026-10-03T22:10:54.459825Z","duration_s":0.395227,"timed_out":false,"image_before":"d6fa6cc4-8bb9-41e5-84ed-f1a8245bcf6e","image_after":"f8aba161-d47e-4be3-8947-7b0dd0217e68","junit":{"passed":["utest/test/api/test_plugins.py::ExtendingSeleniumLibrary::test_comma_and_space","utest/test/api/test_plugins.py::ExtendingSeleniumLibrary::test_comma_and_space_with_arg","utest/test/api/test_plugins.py::ExtendingSeleniumLibrary::test_no_libraries","utest/test/api/test_plugins.py::ExtendingSeleniumLibrary::test_no_library_component_inherit","utest/test/api/test_plugins.py::ExtendingSeleniumLibrary::test_parse_libraries","utest/test/api/test_plugins.py::ExtendingSeleniumLibrary::test_parse_library","utest/test/api/test_plugins.py::ExtendingSeleniumLibrary::test_parse_library_with_args","utest/test/api/test_plugins.py::ExtendingSeleniumLibrary::test_parse_plugin_with_kw_args","utest/test/api/test_plugins.py::ExtendingSeleniumLibrary::test_plugin_as_last_in_init","utest/test/api/test_plugins.py::ExtendingSeleniumLibrary::test_plugin_does_not_exist","utest/test/api/test_plugins.py::ExtendingSeleniumLibrary::test_plugin_wrong_import_with_path","utest/test/api/test_plugins.py::ExtendingSeleniumLibrary::test_sl_with_kw_args_plugin"],"failed":["utest/test/api/test_plugins.py::ExtendingSeleniumLibrary::test_easier_event_firing_webdriver_from_plugin"],"errors":[],"skipped":[],"collection_errors":[],"failure_text":{"utest/test/api/test_plugins.py::ExtendingSeleniumLibrary::test_easier_event_firing_webdriver_from_plugin":"AssertionError: None != 'event_firing_webdriver'\nE   AssertionError: None != 'event_firing_webdriver'"}},"diff":null,"patch_sha256":null,"dropped_paths":[],"snapshot_sha":null}
{"receipt_id":"base-5","seq":5,"branch_id":"base","kind":"command","cmd":"python -c 'import base64\nimport hashlib\nimport json\nimport os\nfrom pathlib import Path\n\npayload = json.loads(base64.b64decode('\"'\"'eyJ0ZXN0X2ZpbGVzIjpbInV0ZXN0L3Rlc3QvYXBpL3Rlc3RfcGx1Z2lucy5weSJdLCJ0ZXN0X3Jvb3RzIjpbInV0ZXN0L3Rlc3QvYXBpIl0sImNvbmZpZ19uYW1lcyI6WyIucHl0ZXN0LnRvbWwiLCJjb25mdGVzdC5weSIsInB5cHJvamVjdC50b21sIiwicHl0ZXN0LmluaSIsInB5dGVzdC50b21sIiwic2V0dXAuY2ZnIiwidG94LmluaSJdfQ=='\"'\"'))\nexcluded = {'\"'\"'.git'\"'\"', '\"'\"'.venv'\"'\"', '\"'\"'__pycache__'\"'\"', '\"'\"'site-packages'\"'\"'}\n\ndef digest(path):\n    return hashlib.sha256(path.read_bytes()).hexdigest()\n\ntests = {}\nfor item in payload['\"'\"'test_files'\"'\"']:\n    path = Path(item)\n    if path.is_file():\n        tests[path.as_posix()] = digest(path)\nfor item in payload['\"'\"'test_roots'\"'\"']:\n    root = Path(item)\n    if not root.is_dir():\n        continue\n    for directory, names, filenames in os.walk(root, followlinks=False):\n        names[:] = sorted(name for name in names if name not in excluded)\n        for filename in sorted(filenames):\n            path = Path(directory, filename)\n            if path.is_file():\n                tests[path.as_posix()] = digest(path)\n\nconfigs = {}\nfor directory, names, filenames in os.walk('\"'\"'.'\"'\"', followlinks=False):\n    names[:] = sorted(name for name in names if name not in excluded)\n    for filename in sorted(filenames):\n        if filename not in payload['\"'\"'config_names'\"'\"']:\n            continue\n        path = Path(directory, filename)\n        rendered = path.as_posix()\n        rendered = rendered[2:] if rendered.startswith('\"'\"'./'\"'\"') else rendered\n        configs[rendered] = digest(path)\n\nprint(json.dumps({'\"'\"'test_digests'\"'\"': tests, '\"'\"'pytest_config_digests'\"'\"': configs}, sort_keys=True))\n'","path":null,"exit_code":0,"stdout_tail":"{\"pytest_config_digests\": {}, \"test_digests\": {\"utest/test/api/MyListener.py\": \"343db61dfa0f73cc88b819c48ae55a26e827d2582cee651bebb4911c9485a6b5\", \"utest/test/api/MyListenerWrongName.py\": \"343db61dfa0f73cc88b819c48ae55a26e827d2582cee651bebb4911c9485a6b5\", \"utest/test/api/__init__.py\": \"e3b0c44298fc1c149afbf4c8996fb92427ae41e4649b934ca495991b7852b855\", \"utest/test/api/my_lib.py\": \"96912596d799d228dbb6c811a0f0c054c397b61b3674427f234668601c6e9e4d\", \"utest/test/api/my_lib_args.py\": \"668fbc68979f6ebabb8164e07ea4f948cae03dd55c9da42c001fa40dda4e0f72\", \"utest/test/api/my_lib_not_inherit.py\": \"1d8cc44081a7fc2737501993dd0d2dde428a245850f7d77a29b985eb1b636d2b\", \"utest/test/api/my_lib_wrong_name.py\": \"0ed9b107bbf1e2f2cc259995ea8d03b595a88fe347546763ce32e83608c72ffb\", \"utest/test/api/plugin_tester.py\": \"f371ee47fc31cdb85fedca23bef612aed03b3c213b0d0d1c103529bcfe06d71b\", \"utest/test/api/plugin_with_event_firing_webdriver.py\": \"88dd89168d3c6af7f0ef37a8bca095fc069bf2ff21bbc96e1c78b2eb34af004c\", \"utest/test/api/test_accessing_keywod_methods.py\": \"57c732c4834d0919302c989495dc755ef43f0e0a3e33df99e28e87b716f51a2d\", \"utest/test/api/test_event_firing_webdriver.py\": \"066dc57d4fab219ea22c1e961bca372d237f7eec032077f54da376c766bef64d\", \"utest/test/api/test_plugin_keyword_tags.py\": \"239d58c22aa4c7ce2d720f4f749cb7f0755587bb78f63820be2016713db0e9ff\", \"utest/test/api/test_plugins.py\": \"c35547775fedc8369ccd1a13583e1aa99361aa65fb33be5db9f7daf3d466ee39\"}}\n","stderr_tail":"","stdout_sha256":"fab9d1b7a540964d40c8ef3877e5f321a494face3af22a9978c7837cce0f417b","log_path":"~/dev/nebius-hackathon/pilot/v2-arm-lightning/robotframework__seleniumlibrary-1431/runs/pilot-robotframework__seleniumlibrary-1431-86cdd86202/logs/base/base-5.log","tree_digest":null,"tree_download_s":null,"started_at":"2026-10-03T22:10:58.560627Z","duration_s":0.030793,"timed_out":false,"image_before":"f8aba161-d47e-4be3-8947-7b0dd0217e68","image_after":"e27569cf-241f-49a8-86f1-4bd324b42319","junit":null,"diff":null,"patch_sha256":null,"dropped_paths":[],"snapshot_sha":null}
{"receipt_id":"base-6","seq":6,"branch_id":"base","kind":"command","cmd":"python -c '# Runs inside the task sandbox, so it must work on Python 3.7.\npackages = set()\ntry:\n    import importlib.metadata as metadata\nexcept ImportError:\n    import pkg_resources\n\n    for dist in pkg_resources.working_set:\n        packages.add(dist.project_name + \"==\" + dist.version)\nelse:\n    for distribution in metadata.distributions():\n        name = distribution.metadata.get(\"Name\")\n        if name:\n            packages.add(name + \"==\" + distribution.version)\nprint(\"\\n\".join(sorted(packages, key=str.casefold)))\n'","path":null,"exit_code":0,"stdout_tail":"allpairspy==2.5.1\napproval-utilities==8.4.1\napprovaltests==8.4.1\nattrs==24.2.0\nbeautifulsoup4==4.14.3\ncertifi==2026.1.4\ncharset-normalizer==3.4.4\nempty-files==0.0.9\nexceptiongroup==1.3.1\nh11==0.14.0\nidna==3.10\nimportlib-metadata==6.7.0\niniconfig==2.0.0\nmock==5.2.0\nmockito==1.5.5\nmrjob==0.7.4\noutcome==1.3.0.post0\npackaging==24.0\npip==24.0\npluggy==1.2.0\npyperclip==1.11.0\nPySocks==1.7.1\npytest==7.4.4\nPyYAML==6.0.1\nrequests==2.31.0\nrobotframework-seleniumlibrary==4.0.0a3.dev1\nrobotframework==6.1.1\nrobotstatuschecker==4.1.0\nselenium==4.11.2\nsetuptools==68.0.0\nsniffio==1.3.1\nsortedcontainers==2.4.0\nsoupsieve==2.4.1\ntestfixtures==8.3.0\ntomli==2.0.1\ntrio-websocket==0.11.1\ntrio==0.22.2\ntyping-extensions==4.7.1\nurllib3==2.0.7\nwheel==0.42.0\nwsproto==1.2.0\nzipp==3.15.0\n","stderr_tail":"-c:6: DeprecationWarning: pkg_resources is deprecated as an API. See https://setuptools.pypa.io/en/latest/pkg_resources.html\n","stdout_sha256":"7d6e99899eb57dc382aea3b14fef378df680921cd613ff46d846bb4daa25d759","log_path":"~/dev/nebius-hackathon/pilot/v2-arm-lightning/robotframework__seleniumlibrary-1431/runs/pilot-robotframework__seleniumlibrary-1431-86cdd86202/logs/base/base-6.log","tree_digest":null,"tree_download_s":null,"started_at":"2026-10-03T22:11:00.309871Z","duration_s":0.0915,"timed_out":false,"image_before":"e27569cf-241f-49a8-86f1-4bd324b42319","image_after":"a2a1a5df-1c5b-4f2f-ba16-baf2e175dc80","junit":null,"diff":null,"patch_sha256":null,"dropped_paths":[],"snapshot_sha":null}
{"receipt_id":"base-7","seq":7,"branch_id":"base","kind":"command","cmd":"git add -A && git -c user.name=receipts -c user.email=receipts@localhost commit -q --allow-empty -m \"receipts snapshot\" && git rev-parse HEAD","path":null,"exit_code":0,"stdout_tail":"8415b11c1953d825460636dd9c4273f9a04f6d7b\n","stderr_tail":"","stdout_sha256":"e19ad51c12c5640d441c7acf980f04eb115b2d1eb65c2ae0b403c4e128ddedd5","log_path":"~/dev/nebius-hackathon/pilot/v2-arm-lightning/robotframework__seleniumlibrary-1431/runs/pilot-robotframework__seleniumlibrary-1431-86cdd86202/logs/base/base-7.log","tree_digest":null,"tree_download_s":null,"started_at":"2026-10-03T22:11:02.324404Z","duration_s":0.032275,"timed_out":false,"image_before":"a2a1a5df-1c5b-4f2f-ba16-baf2e175dc80","image_after":"3feb2389-9143-447b-b814-d19e72c2c84e","junit":null,"diff":null,"patch_sha256":null,"dropped_paths":[],"snapshot_sha":"8415b11c1953d825460636dd9c4273f9a04f6d7b"}
{"receipt_id":"base-8","seq":8,"branch_id":"base","kind":"command","cmd":"git -c core.quotePath=false ls-tree -z --name-only 8415b11c1953d825460636dd9c4273f9a04f6d7b","path":null,"exit_code":0,"stdout_tail":".gitignore\u0000.travis.yml\u0000BUILD.rst\u0000CHANGES.rst\u0000CONTRIBUTING.rst\u0000COPYRIGHT.txt\u0000LICENSE.txt\u0000MANIFEST.in\u0000README.rst\u0000atest\u0000docs\u0000issue_template.md\u0000requirements-build.txt\u0000requirements-dev.txt\u0000requirements.txt\u0000selenium.bmp\u0000setup.py\u0000src\u0000tasks.py\u0000utest\u0000","stderr_tail":"","stdout_sha256":"9ce0e6f069396418b5dadd0355b6f2b62e2bf97cd3f561c7bbdfef247ca9bffa","log_path":"~/dev/nebius-hackathon/pilot/v2-arm-lightning/robotframework__seleniumlibrary-1431/runs/pilot-robotframework__seleniumlibrary-1431-86cdd86202/logs/base/base-8.log","tree_digest":null,"tree_download_s":null,"started_at":"2026-10-03T22:11:04.219504Z","duration_s":0.004178,"timed_out":false,"image_before":"3feb2389-9143-447b-b814-d19e72c2c84e","image_after":"65090371-6e82-4570-b0da-993821030ba3","junit":null,"diff":null,"patch_sha256":null,"dropped_paths":[],"snapshot_sha":null}
{"receipt_id":"base-9","seq":9,"branch_id":"base","kind":"command","cmd":"git -c core.quotePath=false ls-tree -z --name-only 8415b11c1953d825460636dd9c4273f9a04f6d7b:src","path":null,"exit_code":0,"stdout_tail":"SeleniumLibrary\u0000","stderr_tail":"","stdout_sha256":"c57240309defb3ed0b220469d23d5897d3f69b18c99a99a048f4307ddabb8b8a","log_path":"~/dev/nebius-hackathon/pilot/v2-arm-lightning/robotframework__seleniumlibrary-1431/runs/pilot-robotframework__seleniumlibrary-1431-86cdd86202/logs/base/base-9.log","tree_digest":null,"tree_download_s":null,"started_at":"2026-10-03T22:11:05.540543Z","duration_s":0.003799,"timed_out":false,"image_before":"65090371-6e82-4570-b0da-993821030ba3","image_after":"030c8650-920f-4dfa-a60d-6c9946706c44","junit":null,"diff":null,"patch_sha256":null,"dropped_paths":[],"snapshot_sha":null}
