{"receipt_id":"agent1-1","seq":1,"branch_id":"agent1","kind":"command","cmd":"git ls-files -z","path":null,"exit_code":0,"stdout_tail":"orials/defining_dependencies_products_multiple1_produces.py\u0000docs_src/tutorials/defining_dependencies_products_multiple1_py310.py\u0000docs_src/tutorials/defining_dependencies_products_multiple1_py38.py\u0000docs_src/tutorials/defining_dependencies_products_multiple2_produces.py\u0000docs_src/tutorials/defining_dependencies_products_multiple2_py310.py\u0000docs_src/tutorials/defining_dependencies_products_multiple2_py38.py\u0000docs_src/tutorials/defining_dependencies_products_products_decorators.py\u0000docs_src/tutorials/defining_dependencies_products_products_produces.py\u0000docs_src/tutorials/defining_dependencies_products_products_py310.py\u0000docs_src/tutorials/defining_dependencies_products_products_py38.py\u0000docs_src/tutorials/defining_dependencies_products_relative_decorators.py\u0000docs_src/tutorials/defining_dependencies_products_relative_produces.py\u0000docs_src/tutorials/defining_dependencies_products_relative_py310.py\u0000docs_src/tutorials/defining_dependencies_products_relative_py38.py\u0000docs_src/tutorials/making_tasks_persist.py\u0000docs_src/tutorials/repeating_tasks_with_different_inputs1_decorators.py\u0000docs_src/tutorials/repeating_tasks_with_different_inputs1_produces.py\u0000docs_src/tutorials/repeating_tasks_with_different_inputs1_py310.py\u0000docs_src/tutorials/repeating_tasks_with_different_inputs1_py38.py\u0000docs_src/tutorials/repeating_tasks_with_different_inputs2_decorators.py\u0000docs_src/tutorials/repeating_tasks_with_different_inputs2_produces.py\u0000docs_src/tutorials/repeating_tasks_with_different_inputs2_py310.py\u0000docs_src/tutorials/repeating_tasks_with_different_inputs2_py38.py\u0000docs_src/tutorials/repeating_tasks_with_different_inputs3_decorators.py\u0000docs_src/tutorials/repeating_tasks_with_different_inputs3_produces.py\u0000docs_src/tutorials/repeating_tasks_with_different_inputs3_py310.py\u0000docs_src/tutorials/repeating_tasks_with_different_inputs3_py38.py\u0000docs_src/tutorials/repeating_tasks_with_different_inputs4_decorators.py\u0000docs_src/tutorials/repeating_tasks_with_different_inputs4_produces.py\u0000docs_src/tutorials/repeating_tasks_with_different_inputs4_py310.py\u0000docs_src/tutorials/repeating_tasks_with_different_inputs4_py38.py\u0000docs_src/tutorials/repeating_tasks_with_different_inputs5_decorators.py\u0000docs_src/tutorials/repeating_tasks_with_different_inputs5_produces.py\u0000docs_src/tutorials/repeating_tasks_with_different_inputs5_py310.py\u0000docs_src/tutorials/repeating_tasks_with_different_inputs5_py38.py\u0000docs_src/tutorials/skipping_tasks_example_1.py\u0000docs_src/tutorials/using_a_data_catalog_1.py\u0000docs_src/tutorials/using_a_data_catalog_2_produces.py\u0000docs_src/tutorials/using_a_data_catalog_2_py310.py\u0000docs_src/tutorials/using_a_data_catalog_2_py310_return.py\u0000docs_src/tutorials/using_a_data_catalog_2_py38.py\u0000docs_src/tutorials/using_a_data_catalog_3_py310.py\u0000docs_src/tutorials/using_a_data_catalog_3_py38.py\u0000docs_src/tutorials/using_a_data_catalog_4.py\u0000docs_src/tutorials/using_a_data_catalog_5_py310.py\u0000docs_src/tutorials/using_a_data_catalog_5_py310_return.py\u0000docs_src/tutorials/using_a_data_catalog_5_py38.py\u0000docs_src/tutorials/visualizing_the_dag.py\u0000docs_src/tutorials/write_a_task_decorators.py\u0000docs_src/tutorials/write_a_task_produces.py\u0000docs_src/tutorials/write_a_task_py310.py\u0000docs_src/tutorials/write_a_task_py38.py\u0000environment.yml\u0000pyproject.toml\u0000scripts/update_plugin_list.py\u0000src/_pytask/__init__.py\u0000src/_pytask/_hashlib.py\u0000src/_pytask/_inspect.py\u0000src/_pytask/build.py\u0000src/_pytask/cache.py\u0000src/_pytask/capture.py\u0000src/_pytask/clean.py\u0000src/_pytask/cli.py\u0000src/_pytask/click.py\u0000src/_pytask/collect.py\u0000src/_pytask/collect_command.py\u0000src/_pytask/collect_utils.py\u0000src/_pytask/compat.py\u0000src/_pytask/config.py\u0000src/_pytask/config_utils.py\u0000src/_pytask/console.py\u0000src/_pytask/dag.py\u0000src/_pytask/dag_command.py\u0000src/_pytask/dag_utils.py\u0000src/_pytask/data_catalog.py\u0000src/_pytask/database.py\u0000src/_pytask/database_utils.py\u0000src/_pytask/debugging.py\u0000src/_pytask/enums.py\u0000src/_pytask/exceptions.py\u0000src/_pytask/execute.py\u0000src/_pytask/git.py\u0000src/_pytask/hookspecs.py\u0000src/_pytask/live.py\u0000src/_pytask/logging.py\u0000src/_pytask/mark/__init__.py\u0000src/_pytask/mark/__init__.pyi\u0000src/_pytask/mark/expression.py\u0000src/_pytask/mark/structures.py\u0000src/_pytask/mark_utils.py\u0000src/_pytask/models.py\u0000src/_pytask/node_protocols.py\u0000src/_pytask/nodes.py\u0000src/_pytask/outcomes.py\u0000src/_pytask/parameters.py\u0000src/_pytask/path.py\u0000src/_pytask/persist.py\u0000src/_pytask/pluginmanager.py\u0000src/_pytask/profile.py\u0000src/_pytask/py.typed\u0000src/_pytask/reports.py\u0000src/_pytask/session.py\u0000src/_pytask/shared.py\u0000src/_pytask/skipping.py\u0000src/_pytask/task.py\u0000src/_pytask/task_utils.py\u0000src/_pytask/traceback.py\u0000src/_pytask/tree_util.py\u0000src/_pytask/typing.py\u0000src/_pytask/warnings.py\u0000src/_pytask/warnings_utils.py\u0000src/pytask/__init__.py\u0000src/pytask/__main__.py\u0000src/pytask/path.py\u0000src/pytask/py.typed\u0000src/pytask/tree_util.py\u0000tests/__init__.py\u0000tests/__snapshots__/test_collect_command.ambr\u0000tests/__snapshots__/test_dag.ambr\u0000tests/_test_console_helpers.py\u0000tests/conftest.py\u0000tests/test_build.py\u0000tests/test_cache.py\u0000tests/test_capture.py\u0000tests/test_clean.py\u0000tests/test_cli.py\u0000tests/test_click.py\u0000tests/test_collect.py\u0000tests/test_collect_command.py\u0000tests/test_collect_utils.py\u0000tests/test_compat.py\u0000tests/test_config.py\u0000tests/test_config_utils.py\u0000tests/test_console.py\u0000tests/test_dag.py\u0000tests/test_dag_command.py\u0000tests/test_dag_utils.py\u0000tests/test_data_catalog.py\u0000tests/test_database.py\u0000tests/test_debugging.py\u0000tests/test_dry_run.py\u0000tests/test_execute.py\u0000tests/test_git.py\u0000tests/test_hashlib.py\u0000tests/test_ignore.py\u0000tests/test_jupyter/test_functional_interface.ipynb\u0000tests/test_jupyter/test_functional_interface_w_relative_path.ipynb\u0000tests/test_live.py\u0000tests/test_logging.py\u0000tests/test_mark.py\u0000tests/test_mark_cli.py\u0000tests/test_mark_expression.py\u0000tests/test_mark_utils.py\u0000tests/test_node_protocols.py\u0000tests/test_nodes.py\u0000tests/test_outcomes.py\u0000tests/test_path.py\u0000tests/test_persist.py\u0000tests/test_profile.py\u0000tests/test_shared.py\u0000tests/test_skipping.py\u0000tests/test_task.py\u0000tests/test_task_utils.py\u0000tests/test_traceback.py\u0000tests/test_tree_util.py\u0000tests/test_typing.py\u0000tests/test_warnings.py\u0000tox.ini\u0000","stderr_tail":"","stdout_sha256":"e3849cbe0fd8d8a8535115eced8c3877a60f50b671d6ebd48766129ddac9ab08","log_path":"~/dev/nebius-hackathon/pilot/v2-arm-lightning/pytask-dev__pytask-519/runs/pilot-pytask-dev__pytask-519-4ca0de8453/logs/agent1/agent1-1.log","tree_digest":null,"tree_download_s":null,"started_at":"2026-10-03T21:48:28.335454Z","duration_s":0.003423,"timed_out":false,"image_before":"c0863563-e3fe-4918-be3b-127783941d51","image_after":"a26788da-b90a-4291-8c99-555b1e158d15","junit":null,"diff":null,"patch_sha256":null,"dropped_paths":[],"snapshot_sha":null}
{"receipt_id":"agent1-2","seq":2,"branch_id":"agent1","kind":"command","cmd":"grep -n \"test_raise_error_with_builtin_function_as_task\" tests/test_task.py","path":null,"exit_code":0,"stdout_tail":"667:def test_raise_error_with_builtin_function_as_task(runner, tmp_path):\n","stderr_tail":"","stdout_sha256":"ea9a6636f98ff5328ddd7629bf43851a986aa9f8288a38813b9def07fadfe6f5","log_path":"~/dev/nebius-hackathon/pilot/v2-arm-lightning/pytask-dev__pytask-519/runs/pilot-pytask-dev__pytask-519-4ca0de8453/logs/agent1/agent1-2.log","tree_digest":null,"tree_download_s":null,"started_at":"2026-10-03T21:48:35.601870Z","duration_s":0.003035,"timed_out":false,"image_before":"a26788da-b90a-4291-8c99-555b1e158d15","image_after":"5de73b93-140e-4f7f-85af-c15f5ca8c6a8","junit":null,"diff":null,"patch_sha256":null,"dropped_paths":[],"snapshot_sha":null}
{"receipt_id":"agent1-3","seq":3,"branch_id":"agent1","kind":"command","cmd":"cd /pytask && python -c \"\nfrom datetime import datetime\nimport inspect\nprint(type(datetime.utcnow().strftime))\nprint(inspect.getfile(datetime.utcnow().strftime))\n\"","path":null,"exit_code":1,"stdout_tail":"<class 'builtin_function_or_method'>\n","stderr_tail":"Traceback (most recent call last):\n  File \"<string>\", line 5, in <module>\n  File \"/usr/local/lib/python3.10/inspect.py\", line 797, in getfile\n    raise TypeError('module, class, method, function, traceback, frame, or '\nTypeError: module, class, method, function, traceback, frame, or code object was expected, got builtin_function_or_method\n","stdout_sha256":"74231e013e150e3b409a9c7ebb901f8829789a612b9f16bda101c99294c40ebc","log_path":"~/dev/nebius-hackathon/pilot/v2-arm-lightning/pytask-dev__pytask-519/runs/pilot-pytask-dev__pytask-519-4ca0de8453/logs/agent1/agent1-3.log","tree_digest":null,"tree_download_s":null,"started_at":"2026-10-03T21:48:38.909610Z","duration_s":0.024967999999999997,"timed_out":false,"image_before":"5de73b93-140e-4f7f-85af-c15f5ca8c6a8","image_after":"5e7243e7-0d17-4a29-8c78-ceb34048d3e1","junit":null,"diff":null,"patch_sha256":null,"dropped_paths":[],"snapshot_sha":null}
{"receipt_id":"agent1-4","seq":4,"branch_id":"agent1","kind":"write","cmd":"/opt/receipts-085f93bcae1e42b6a804eae8de4f8249/bin/busybox sh -c 'mkdir -p /pytask/src/_pytask && cp /opt/receipts-085f93bcae1e42b6a804eae8de4f8249/incoming/e5ee5e8c9a6fdc5fcb125b50b0a267f1c9b9c4756216069432c63f4d80841af7 /pytask/src/_pytask/task_utils.py'","path":"src/_pytask/task_utils.py","exit_code":0,"stdout_tail":"","stderr_tail":"","stdout_sha256":"e5ee5e8c9a6fdc5fcb125b50b0a267f1c9b9c4756216069432c63f4d80841af7","log_path":"~/dev/nebius-hackathon/pilot/v2-arm-lightning/pytask-dev__pytask-519/runs/pilot-pytask-dev__pytask-519-4ca0de8453/logs/agent1/agent1-4.log","tree_digest":null,"tree_download_s":null,"started_at":"2026-10-03T21:48:42.754083Z","duration_s":0.004798,"timed_out":false,"image_before":"5e7243e7-0d17-4a29-8c78-ceb34048d3e1","image_after":"d7c8f0e1-4227-4f1a-8e15-df7aee9d3b06","junit":null,"diff":null,"patch_sha256":null,"dropped_paths":[],"snapshot_sha":null}
{"receipt_id":"agent1-5","seq":5,"branch_id":"agent1","kind":"command","cmd":"cd /pytask && python -m pytest tests/test_task.py::test_raise_error_with_builtin_function_as_task -xvs 2>&1 | head -50","path":null,"exit_code":0,"stdout_tail":"ImportError while loading conftest '/pytask/tests/conftest.py'.\ntests/conftest.py:13: in <module>\n    from pytask import console\nsrc/pytask/__init__.py:10: in <module>\n    from _pytask.collect_utils import depends_on\nsrc/_pytask/collect_utils.py:24: in <module>\n    from _pytask.task_utils import parse_keyword_arguments_from_signature_defaults\nE     File \"/pytask/src/_pytask/task_utils.py\", line 104\nE       if \"<string>\" in raw_path:\nE       ^^\nE   IndentationError: expected an indented block after 'if' statement on line 103\n","stderr_tail":"","stdout_sha256":"3c2e337df0b5f20c25e29f3aabc10b937f143f837b30066b75a364b0c96d0aef","log_path":"~/dev/nebius-hackathon/pilot/v2-arm-lightning/pytask-dev__pytask-519/runs/pilot-pytask-dev__pytask-519-4ca0de8453/logs/agent1/agent1-5.log","tree_digest":null,"tree_download_s":null,"started_at":"2026-10-03T21:48:45.410421Z","duration_s":0.450318,"timed_out":false,"image_before":"d7c8f0e1-4227-4f1a-8e15-df7aee9d3b06","image_after":"d0677ba7-811e-4efb-95be-d3310996d2b5","junit":null,"diff":null,"patch_sha256":null,"dropped_paths":[],"snapshot_sha":null}
{"receipt_id":"agent1-6","seq":6,"branch_id":"agent1","kind":"write","cmd":"/opt/receipts-e7d6af7f81344bcaabbb374a7f883eda/bin/busybox sh -c 'mkdir -p /pytask/src/_pytask && cp /opt/receipts-e7d6af7f81344bcaabbb374a7f883eda/incoming/b78a4273dec1eeb0a95be8c845167ad8d7c7a38ba111a2c7463c9ca878db28ce /pytask/src/_pytask/task_utils.py'","path":"src/_pytask/task_utils.py","exit_code":0,"stdout_tail":"","stderr_tail":"","stdout_sha256":"b78a4273dec1eeb0a95be8c845167ad8d7c7a38ba111a2c7463c9ca878db28ce","log_path":"~/dev/nebius-hackathon/pilot/v2-arm-lightning/pytask-dev__pytask-519/runs/pilot-pytask-dev__pytask-519-4ca0de8453/logs/agent1/agent1-6.log","tree_digest":null,"tree_download_s":null,"started_at":"2026-10-03T21:48:51.497418Z","duration_s":0.005166,"timed_out":false,"image_before":"d0677ba7-811e-4efb-95be-d3310996d2b5","image_after":"4c8cafdd-d2e0-4083-b08c-b9a485257897","junit":null,"diff":null,"patch_sha256":null,"dropped_paths":[],"snapshot_sha":null}
{"receipt_id":"agent1-7","seq":7,"branch_id":"agent1","kind":"command","cmd":"cd /pytask && python -m pytest tests/test_task.py::test_raise_error_with_builtin_function_as_task -xvs 2>&1 | head -50","path":null,"exit_code":0,"stdout_tail":"============================= test session starts ==============================\nplatform linux -- Python 3.10.19, pytest-9.0.2, pluggy-1.6.0 -- /usr/local/bin/python\ncachedir: .pytest_cache\nrootdir: /pytask\nconfigfile: pyproject.toml\nplugins: cov-7.0.0, xdist-3.8.0, syrupy-5.1.0\ncollecting ... collected 1 item\n\ntests/test_task.py::test_raise_error_with_builtin_function_as_task FAILED\n\n=================================== FAILURES ===================================\n________________ test_raise_error_with_builtin_function_as_task ________________\n\nrunner = <tests.conftest.CustomCliRunner object at 0x7ffff5ec7be0>\ntmp_path = PosixPath('/tmp/pytest-of-root/pytest-2/test_raise_error_with_builtin_0')\n\n    def test_raise_error_with_builtin_function_as_task(runner, tmp_path):\n        source = \"\"\"\n        from pytask import task\n        from pathlib import Path\n        from datetime import datetime\n    \n        task(\n            kwargs={\"format\": \"%y/%m/%d\"}, produces=Path(\"time.txt\")\n        )(datetime.utcnow().strftime)\n        \"\"\"\n        tmp_path.joinpath(\"task_example.py\").write_text(textwrap.dedent(source))\n    \n        result = runner.invoke(cli, [tmp_path.as_posix()])\n>       assert result.exit_code == ExitCode.COLLECTION_FAILED\nE       AssertionError: assert 1 == <ExitCode.COLLECTION_FAILED: 3>\nE        +  where 1 = <Result SystemExit('Builtin functions cannot be wrapped')>.exit_code\nE        +  and   <ExitCode.COLLECTION_FAILED: 3> = ExitCode.COLLECTION_FAILED\n\ntests/test_task.py:680: AssertionError\n=============================== warnings summary ===============================\nsrc/_pytask/click.py:13\n  /pytask/src/_pytask/click.py:13: DeprecationWarning: 'parser.split_opt' is deprecated and will be removed in Click 9.0. The old parser is available in 'optparse'.\n    from click.parser import split_opt\n\nsrc/_pytask/cli.py:23\n  /pytask/src/_pytask/cli.py:23: DeprecationWarning: The '__version__' attribute is deprecated and will be removed in Click 9.1. Use feature detection or 'importlib.metadata.version(\"click\")' instead.\n    if parse_version(click.__version__) < parse_version(\"8\"):  # pragma: no cover\n\n-- Docs: https://docs.pytest.org/en/stable/how-to/capture-warnings.html\n=========================== short test summary info ============================\nFAILED tests/test_task.py::test_raise_error_with_builtin_function_as_task - A...\n!!!!!!!!!!!!!!!!!!!!!!!!!! stopping after 1 failures !!!!!!!!!!!!!!!!!!!!!!!!!!!\n======================== 1 failed, 2 warnings in 0.15s =========================\n","stderr_tail":"","stdout_sha256":"f57cf066b9486cc2d8663a394c278ceafcfc6b6527cd1903c389472469c88fb7","log_path":"~/dev/nebius-hackathon/pilot/v2-arm-lightning/pytask-dev__pytask-519/runs/pilot-pytask-dev__pytask-519-4ca0de8453/logs/agent1/agent1-7.log","tree_digest":null,"tree_download_s":null,"started_at":"2026-10-03T21:48:53.942318Z","duration_s":0.74275,"timed_out":false,"image_before":"4c8cafdd-d2e0-4083-b08c-b9a485257897","image_after":"38ffc85b-e27e-4c6a-bd0c-876b227ccaad","junit":null,"diff":null,"patch_sha256":null,"dropped_paths":[],"snapshot_sha":null}
{"receipt_id":"agent1-8","seq":8,"branch_id":"agent1","kind":"command","cmd":"cd /pytask && grep -r \"COLLECTION_FAILED\" src/_pytask/ --include=\"*.py\" | head -20","path":null,"exit_code":0,"stdout_tail":"src/_pytask/build.py:            session.exit_code = ExitCode.COLLECTION_FAILED\nsrc/_pytask/clean.py:            session.exit_code = ExitCode.COLLECTION_FAILED\nsrc/_pytask/collect_command.py:            session.exit_code = ExitCode.COLLECTION_FAILED\nsrc/_pytask/dag_command.py:            session.exit_code = ExitCode.COLLECTION_FAILED\nsrc/_pytask/outcomes.py:    COLLECTION_FAILED = 3\nsrc/_pytask/profile.py:            session.exit_code = ExitCode.COLLECTION_FAILED\n","stderr_tail":"","stdout_sha256":"0aa7d3bced8be082ceb897f09644a9c78ce8fb448c932254e568a92c84c93e9c","log_path":"~/dev/nebius-hackathon/pilot/v2-arm-lightning/pytask-dev__pytask-519/runs/pilot-pytask-dev__pytask-519-4ca0de8453/logs/agent1/agent1-8.log","tree_digest":null,"tree_download_s":null,"started_at":"2026-10-03T21:48:57.612206Z","duration_s":0.006291,"timed_out":false,"image_before":"38ffc85b-e27e-4c6a-bd0c-876b227ccaad","image_after":"a17482ff-dc6a-4703-b05c-b4e22b1e676f","junit":null,"diff":null,"patch_sha256":null,"dropped_paths":[],"snapshot_sha":null}
{"receipt_id":"agent1-9","seq":9,"branch_id":"agent1","kind":"command","cmd":"cd /pytask && grep -r \"raise.*CollectionError\\|from _pytask\" src/_pytask/ --include=\"*.py\" | head -20","path":null,"exit_code":0,"stdout_tail":"src/_pytask/build.py:from _pytask.capture import CaptureMethod\nsrc/_pytask/build.py:from _pytask.click import ColoredCommand\nsrc/_pytask/build.py:from _pytask.config import hookimpl\nsrc/_pytask/build.py:from _pytask.config_utils import find_project_root_and_config\nsrc/_pytask/build.py:from _pytask.config_utils import read_config\nsrc/_pytask/build.py:from _pytask.console import console\nsrc/_pytask/build.py:from _pytask.exceptions import CollectionError\nsrc/_pytask/build.py:from _pytask.exceptions import ConfigurationError\nsrc/_pytask/build.py:from _pytask.exceptions import ExecutionError\nsrc/_pytask/build.py:from _pytask.exceptions import ResolvingDependenciesError\nsrc/_pytask/build.py:from _pytask.outcomes import ExitCode\nsrc/_pytask/build.py:from _pytask.path import HashPathCache\nsrc/_pytask/build.py:from _pytask.pluginmanager import get_plugin_manager\nsrc/_pytask/build.py:from _pytask.session import Session\nsrc/_pytask/build.py:from _pytask.shared import parse_paths\nsrc/_pytask/build.py:from _pytask.shared import to_list\nsrc/_pytask/build.py:from _pytask.traceback import remove_internal_traceback_frames_from_exc_info\nsrc/_pytask/build.py:    from _pytask.node_protocols import PTask\nsrc/_pytask/build.py:            from _pytask.cli import DEFAULTS_FROM_CLI\nsrc/_pytask/cache.py:from _pytask._hashlib import hash_value\n","stderr_tail":"","stdout_sha256":"f7f347f3c9aa1b87d79aef447eb8b81f1d13dc09e16b63f164516f29bb4c8cc4","log_path":"~/dev/nebius-hackathon/pilot/v2-arm-lightning/pytask-dev__pytask-519/runs/pilot-pytask-dev__pytask-519-4ca0de8453/logs/agent1/agent1-9.log","tree_digest":null,"tree_download_s":null,"started_at":"2026-10-03T21:49:00.144785Z","duration_s":0.0046300000000000004,"timed_out":false,"image_before":"a17482ff-dc6a-4703-b05c-b4e22b1e676f","image_after":"3c81ccd5-8808-4d54-8f46-91c825ab32a6","junit":null,"diff":null,"patch_sha256":null,"dropped_paths":[],"snapshot_sha":null}
{"receipt_id":"agent1-10","seq":10,"branch_id":"agent1","kind":"command","cmd":"cd /pytask && grep -r \"CollectionError\" src/_pytask/ --include=\"*.py\" | head -20","path":null,"exit_code":0,"stdout_tail":"src/_pytask/build.py:from _pytask.exceptions import CollectionError\nsrc/_pytask/build.py:        except CollectionError:\nsrc/_pytask/clean.py:from _pytask.exceptions import CollectionError\nsrc/_pytask/clean.py:        except CollectionError:\nsrc/_pytask/collect.py:from _pytask.exceptions import CollectionError\nsrc/_pytask/collect.py:        raise CollectionError\nsrc/_pytask/collect_command.py:from _pytask.exceptions import CollectionError\nsrc/_pytask/collect_command.py:        except CollectionError:  # pragma: no cover\nsrc/_pytask/dag_command.py:from _pytask.exceptions import CollectionError\nsrc/_pytask/dag_command.py:        except CollectionError:  # pragma: no cover\nsrc/_pytask/exceptions.py:class CollectionError(PytaskError):\nsrc/_pytask/profile.py:from _pytask.exceptions import CollectionError\nsrc/_pytask/profile.py:        except CollectionError:  # pragma: no cover\n","stderr_tail":"","stdout_sha256":"03a3bb5d19fe8a58ac31ef0896fcc9694d7df9203f49c3d0a3bd40e9c9c77d29","log_path":"~/dev/nebius-hackathon/pilot/v2-arm-lightning/pytask-dev__pytask-519/runs/pilot-pytask-dev__pytask-519-4ca0de8453/logs/agent1/agent1-10.log","tree_digest":null,"tree_download_s":null,"started_at":"2026-10-03T21:49:02.223368Z","duration_s":0.006512,"timed_out":false,"image_before":"3c81ccd5-8808-4d54-8f46-91c825ab32a6","image_after":"f7a5366f-9fae-4db6-ae48-54e11e95b718","junit":null,"diff":null,"patch_sha256":null,"dropped_paths":[],"snapshot_sha":null}
{"receipt_id":"agent1-11","seq":11,"branch_id":"agent1","kind":"write","cmd":"/opt/receipts-ac9ee94c7d3442399a7bebb4bb6338d6/bin/busybox sh -c 'mkdir -p /pytask/src/_pytask && cp /opt/receipts-ac9ee94c7d3442399a7bebb4bb6338d6/incoming/9de6c8a1b460c7622b547875c7373241b9755333bab3a091ca41a4d6a249688e /pytask/src/_pytask/task_utils.py'","path":"src/_pytask/task_utils.py","exit_code":0,"stdout_tail":"","stderr_tail":"","stdout_sha256":"9de6c8a1b460c7622b547875c7373241b9755333bab3a091ca41a4d6a249688e","log_path":"~/dev/nebius-hackathon/pilot/v2-arm-lightning/pytask-dev__pytask-519/runs/pilot-pytask-dev__pytask-519-4ca0de8453/logs/agent1/agent1-11.log","tree_digest":null,"tree_download_s":null,"started_at":"2026-10-03T21:49:07.131886Z","duration_s":0.004978,"timed_out":false,"image_before":"f7a5366f-9fae-4db6-ae48-54e11e95b718","image_after":"71573271-45c1-4c8b-bbb8-9f1b5e30ab3d","junit":null,"diff":null,"patch_sha256":null,"dropped_paths":[],"snapshot_sha":null}
{"receipt_id":"agent1-12","seq":12,"branch_id":"agent1","kind":"write","cmd":"/opt/receipts-e29afc956c5b46d8be8765feb2be2067/bin/busybox sh -c 'mkdir -p /pytask/src/_pytask && cp /opt/receipts-e29afc956c5b46d8be8765feb2be2067/incoming/65ba20394c99d22b3f97b967b520f545ff236f702e124fb5e640ead0b6f745ed /pytask/src/_pytask/task_utils.py'","path":"src/_pytask/task_utils.py","exit_code":0,"stdout_tail":"","stderr_tail":"","stdout_sha256":"65ba20394c99d22b3f97b967b520f545ff236f702e124fb5e640ead0b6f745ed","log_path":"~/dev/nebius-hackathon/pilot/v2-arm-lightning/pytask-dev__pytask-519/runs/pilot-pytask-dev__pytask-519-4ca0de8453/logs/agent1/agent1-12.log","tree_digest":null,"tree_download_s":null,"started_at":"2026-10-03T21:49:10.163349Z","duration_s":0.005199,"timed_out":false,"image_before":"71573271-45c1-4c8b-bbb8-9f1b5e30ab3d","image_after":"f7210c2f-e16a-4bb0-850a-5ccc8fe4d6f7","junit":null,"diff":null,"patch_sha256":null,"dropped_paths":[],"snapshot_sha":null}
{"receipt_id":"agent1-13","seq":13,"branch_id":"agent1","kind":"command","cmd":"cd /pytask && python -m pytest tests/test_task.py::test_raise_error_with_builtin_function_as_task -xvs 2>&1 | head -50","path":null,"exit_code":0,"stdout_tail":"============================= test session starts ==============================\nplatform linux -- Python 3.10.19, pytest-9.0.2, pluggy-1.6.0 -- /usr/local/bin/python\ncachedir: .pytest_cache\nrootdir: /pytask\nconfigfile: pyproject.toml\nplugins: cov-7.0.0, xdist-3.8.0, syrupy-5.1.0\ncollecting ... collected 1 item\n\ntests/test_task.py::test_raise_error_with_builtin_function_as_task PASSED\n\n=============================== warnings summary ===============================\nsrc/_pytask/click.py:13\n  /pytask/src/_pytask/click.py:13: DeprecationWarning: 'parser.split_opt' is deprecated and will be removed in Click 9.0. The old parser is available in 'optparse'.\n    from click.parser import split_opt\n\nsrc/_pytask/cli.py:23\n  /pytask/src/_pytask/cli.py:23: DeprecationWarning: The '__version__' attribute is deprecated and will be removed in Click 9.1. Use feature detection or 'importlib.metadata.version(\"click\")' instead.\n    if parse_version(click.__version__) < parse_version(\"8\"):  # pragma: no cover\n\n-- Docs: https://docs.pytest.org/en/stable/how-to/capture-warnings.html\n======================== 1 passed, 2 warnings in 0.18s =========================\n","stderr_tail":"","stdout_sha256":"28a7b844c99f533d64b5c4df3ddfbe99ae66ac82adfebef1abca83d8ff82bb60","log_path":"~/dev/nebius-hackathon/pilot/v2-arm-lightning/pytask-dev__pytask-519/runs/pilot-pytask-dev__pytask-519-4ca0de8453/logs/agent1/agent1-13.log","tree_digest":null,"tree_download_s":null,"started_at":"2026-10-03T21:49:11.945014Z","duration_s":0.671273,"timed_out":false,"image_before":"f7210c2f-e16a-4bb0-850a-5ccc8fe4d6f7","image_after":"76f982b9-da3f-42ac-bc6c-a943b51e3b44","junit":null,"diff":null,"patch_sha256":null,"dropped_paths":[],"snapshot_sha":null}
{"receipt_id":"agent1-14","seq":14,"branch_id":"agent1","kind":"command","cmd":"cd /pytask && python -c \"\nfrom pathlib import Path\nimport time\nimport pytask\n\ntask_build_time = pytask.task(produces=Path('build_time.txt'))(time.asctime)\nprint('Success! Task created:', task_build_time)\n\"","path":null,"exit_code":1,"stdout_tail":"","stderr_tail":"Traceback (most recent call last):\n  File \"<string>\", line 6, in <module>\n  File \"/pytask/src/_pytask/task_utils.py\", line 102, in wrapper\n    raise CollectionError(msg) from None\n_pytask.exceptions.CollectionError: Builtin functions cannot be wrapped\n","stdout_sha256":"6719993226a7c07ddfe3d28514e847fdbe2b3016e118bfb909f6954ff3db7a35","log_path":"~/dev/nebius-hackathon/pilot/v2-arm-lightning/pytask-dev__pytask-519/runs/pilot-pytask-dev__pytask-519-4ca0de8453/logs/agent1/agent1-14.log","tree_digest":null,"tree_download_s":null,"started_at":"2026-10-03T21:49:17.497347Z","duration_s":0.405768,"timed_out":false,"image_before":"76f982b9-da3f-42ac-bc6c-a943b51e3b44","image_after":"9618796c-0b55-4085-88a1-b8f9b4bebdfc","junit":null,"diff":null,"patch_sha256":null,"dropped_paths":[],"snapshot_sha":null}
{"receipt_id":"agent1-15","seq":15,"branch_id":"agent1","kind":"command","cmd":"cd /pytask && python -c \"\nfrom pathlib import Path\nimport tempfile\nimport os\nimport pytask\n\n# Test with a regular function\ndef my_task(produces):\n    produces.write_text('Hello World')\n\nwith tempfile.TemporaryDirectory() as tmpdir:\n    task = pytask.task(produces=Path(tmpdir) / 'output.txt')(my_task)\n    print('Regular function task created successfully:', task)\n\"","path":null,"exit_code":1,"stdout_tail":"","stderr_tail":"Traceback (most recent call last):\n  File \"<string>\", line 12, in <module>\n  File \"/pytask/src/_pytask/task_utils.py\", line 105, in wrapper\n    path = Path(unwrapped.__globals__[\"__file__\"]).absolute().resolve()\nKeyError: '__file__'\n","stdout_sha256":"2b0a28502f32d2e994276967a0c7906d0277e1b4affafabd880dfa0895a5a182","log_path":"~/dev/nebius-hackathon/pilot/v2-arm-lightning/pytask-dev__pytask-519/runs/pilot-pytask-dev__pytask-519-4ca0de8453/logs/agent1/agent1-15.log","tree_digest":null,"tree_download_s":null,"started_at":"2026-10-03T21:49:21.382975Z","duration_s":0.41484200000000004,"timed_out":false,"image_before":"9618796c-0b55-4085-88a1-b8f9b4bebdfc","image_after":"054768d5-27f4-43ca-8e31-8a1a19e130f2","junit":null,"diff":null,"patch_sha256":null,"dropped_paths":[],"snapshot_sha":null}
{"receipt_id":"agent1-16","seq":16,"branch_id":"agent1","kind":"command","cmd":"cd /pytask && git diff src/_pytask/task_utils.py","path":null,"exit_code":0,"stdout_tail":"diff --git a/src/_pytask/task_utils.py b/src/_pytask/task_utils.py\nindex 59af53e..7432570 100644\n--- a/src/_pytask/task_utils.py\n+++ b/src/_pytask/task_utils.py\n@@ -12,6 +12,7 @@ from _pytask.mark import Mark\n from _pytask.models import CollectionMetadata\n from _pytask.shared import find_duplicates\n from _pytask.typing import is_task_function\n+from _pytask.exceptions import CollectionError\n \n \n __all__ = [\n@@ -94,7 +95,12 @@ def task(\n \n         unwrapped = inspect.unwrap(func)\n \n-        raw_path = inspect.getfile(unwrapped)\n+        try:\n+            raw_path = inspect.getfile(unwrapped)\n+        except TypeError:\n+            msg = \"Builtin functions cannot be wrapped\"\n+            raise CollectionError(msg) from None\n+\n         if \"<string>\" in raw_path:\n             path = Path(unwrapped.__globals__[\"__file__\"]).absolute().resolve()\n         else:\n","stderr_tail":"","stdout_sha256":"57420155d517e10c575672070be5cdcc0e9a53af7ad0f10ee99304022667046c","log_path":"~/dev/nebius-hackathon/pilot/v2-arm-lightning/pytask-dev__pytask-519/runs/pilot-pytask-dev__pytask-519-4ca0de8453/logs/agent1/agent1-16.log","tree_digest":null,"tree_download_s":null,"started_at":"2026-10-03T21:49:25.056448Z","duration_s":0.004563,"timed_out":false,"image_before":"054768d5-27f4-43ca-8e31-8a1a19e130f2","image_after":"347fde6e-d377-4cbf-b5e6-9472719ef1d1","junit":null,"diff":null,"patch_sha256":null,"dropped_paths":[],"snapshot_sha":null}
{"receipt_id":"agent1-17","seq":17,"branch_id":"agent1","kind":"command","cmd":"cd /pytask && git stash && python -c \"\nfrom pathlib import Path\nimport tempfile\nimport os\nimport pytask\n\n# Test with a regular function\ndef my_task(produces):\n    produces.write_text('Hello World')\n\nwith tempfile.TemporaryDirectory() as tmpdir:\n    task = pytask.task(produces=Path(tmpdir) / 'output.txt')(my_task)\n    print('Regular function task created successfully:', task)\n\" 2>&1","path":null,"exit_code":1,"stdout_tail":"Saved working directory and index state WIP on (no branch): 030f7af receipts snapshot\nTraceback (most recent call last):\n  File \"<string>\", line 12, in <module>\n  File \"/pytask/src/_pytask/task_utils.py\", line 99, in wrapper\n    path = Path(unwrapped.__globals__[\"__file__\"]).absolute().resolve()\nKeyError: '__file__'\n","stderr_tail":"","stdout_sha256":"63ac61939b92a2758157e60c3a370a2b428f6f13089a472b04fee96e72a9416a","log_path":"~/dev/nebius-hackathon/pilot/v2-arm-lightning/pytask-dev__pytask-519/runs/pilot-pytask-dev__pytask-519-4ca0de8453/logs/agent1/agent1-17.log","tree_digest":null,"tree_download_s":null,"started_at":"2026-10-03T21:49:27.960588Z","duration_s":0.41836300000000004,"timed_out":false,"image_before":"347fde6e-d377-4cbf-b5e6-9472719ef1d1","image_after":"ef667f2a-b90b-4c82-a99a-2fef83c3b44e","junit":null,"diff":null,"patch_sha256":null,"dropped_paths":[],"snapshot_sha":null}
{"receipt_id":"agent1-18","seq":18,"branch_id":"agent1","kind":"command","cmd":"cd /pytask && git stash pop","path":null,"exit_code":0,"stdout_tail":"Not currently on any branch.\nChanges not staged for commit:\n  (use \"git add <file>...\" to update what will be committed)\n  (use \"git restore <file>...\" to discard changes in working directory)\n\tmodified:   src/_pytask/task_utils.py\n\nno changes added to commit (use \"git add\" and/or \"git commit -a\")\nDropped refs/stash@{0} (6a8202e5981489fb3d631294ef7d930684afaed7)\n","stderr_tail":"","stdout_sha256":"2493614daaf3c6aac17df59e2152367550e9de7b621256bfe0bc2fa6f4ab2f54","log_path":"~/dev/nebius-hackathon/pilot/v2-arm-lightning/pytask-dev__pytask-519/runs/pilot-pytask-dev__pytask-519-4ca0de8453/logs/agent1/agent1-18.log","tree_digest":null,"tree_download_s":null,"started_at":"2026-10-03T21:49:31.547147Z","duration_s":0.017084000000000002,"timed_out":false,"image_before":"ef667f2a-b90b-4c82-a99a-2fef83c3b44e","image_after":"d3281b07-01f4-49e2-a662-5a389ad1e916","junit":null,"diff":null,"patch_sha256":null,"dropped_paths":[],"snapshot_sha":null}
{"receipt_id":"agent1-19","seq":19,"branch_id":"agent1","kind":"command","cmd":"cd /pytask && python -m pytest tests/test_task.py -x --tb=short 2>&1 | tail -30","path":null,"exit_code":0,"stdout_tail":"============================= test session starts ==============================\nplatform linux -- Python 3.10.19, pytest-9.0.2, pluggy-1.6.0\nrootdir: /pytask\nconfigfile: pyproject.toml\nplugins: cov-7.0.0, xdist-3.8.0, syrupy-5.1.0\ncollected 41 items\n\ntests/test_task.py ............................x............             [100%]\n\n=============================== warnings summary ===============================\nsrc/_pytask/click.py:13\n  /pytask/src/_pytask/click.py:13: DeprecationWarning: 'parser.split_opt' is deprecated and will be removed in Click 9.0. The old parser is available in 'optparse'.\n    from click.parser import split_opt\n\nsrc/_pytask/cli.py:23\n  /pytask/src/_pytask/cli.py:23: DeprecationWarning: The '__version__' attribute is deprecated and will be removed in Click 9.1. Use feature detection or 'importlib.metadata.version(\"click\")' instead.\n    if parse_version(click.__version__) < parse_version(\"8\"):  # pragma: no cover\n\n-- Docs: https://docs.pytest.org/en/stable/how-to/capture-warnings.html\n================== 40 passed, 1 xfailed, 2 warnings in 2.16s ===================\n","stderr_tail":"","stdout_sha256":"ea6b7abb68dd3cd2e21f819f0de11fef13be6a18d91b1263b586c4e79db8d88e","log_path":"~/dev/nebius-hackathon/pilot/v2-arm-lightning/pytask-dev__pytask-519/runs/pilot-pytask-dev__pytask-519-4ca0de8453/logs/agent1/agent1-19.log","tree_digest":null,"tree_download_s":null,"started_at":"2026-10-03T21:49:34.116995Z","duration_s":1.762011,"timed_out":false,"image_before":"d3281b07-01f4-49e2-a662-5a389ad1e916","image_after":"29af4294-06ab-47ef-b0bb-48007a114f6a","junit":null,"diff":null,"patch_sha256":null,"dropped_paths":[],"snapshot_sha":null}
{"receipt_id":"agent1-20","seq":20,"branch_id":"agent1","kind":"command","cmd":"cd /pytask && python -c \"\nfrom pathlib import Path\nimport time\nimport pytask\n\n# This should now raise a CollectionError instead of TypeError\ntry:\n    task_build_time = pytask.task(produces=Path('build_time.txt'))(time.asctime)\nexcept Exception as e:\n    print(f'Exception type: {type(e).__name__}')\n    print(f'Exception message: {e}')\n\"","path":null,"exit_code":0,"stdout_tail":"Exception type: CollectionError\nException message: Builtin functions cannot be wrapped\n","stderr_tail":"","stdout_sha256":"f6b89745df75246b2924d6ca2bb6dccce81bb5e03e3593df23886fb2e007106a","log_path":"~/dev/nebius-hackathon/pilot/v2-arm-lightning/pytask-dev__pytask-519/runs/pilot-pytask-dev__pytask-519-4ca0de8453/logs/agent1/agent1-20.log","tree_digest":null,"tree_download_s":null,"started_at":"2026-10-03T21:49:43.436605Z","duration_s":0.416143,"timed_out":false,"image_before":"29af4294-06ab-47ef-b0bb-48007a114f6a","image_after":"795617dd-86c4-40ad-a98f-f44cec690007","junit":null,"diff":null,"patch_sha256":null,"dropped_paths":[],"snapshot_sha":null}
{"receipt_id":"agent1-21","seq":21,"branch_id":"agent1","kind":"diff","cmd":"compute patch in executor staging agent1-5686df7ff4b743d1b5edd268297cb59e: /opt/homebrew/Cellar/git/2.53.0/bin/git -c core.hooksPath=/dev/null -c core.attributesFile=/dev/null -c diff.external= -c core.quotePath=false add -A && /opt/homebrew/Cellar/git/2.53.0/bin/git -c core.hooksPath=/dev/null -c core.attributesFile=/dev/null -c diff.external= -c core.quotePath=false diff --cached --binary --no-ext-diff --no-textconv --no-renames 030f7af4d63fcc9d075a834d9f96e1f801ae97cb","path":null,"exit_code":0,"stdout_tail":"diff --git a/src/_pytask/task_utils.py b/src/_pytask/task_utils.py\nindex 59af53e..7432570 100644\n--- a/src/_pytask/task_utils.py\n+++ b/src/_pytask/task_utils.py\n@@ -12,6 +12,7 @@ from _pytask.mark import Mark\n from _pytask.models import CollectionMetadata\n from _pytask.shared import find_duplicates\n from _pytask.typing import is_task_function\n+from _pytask.exceptions import CollectionError\n \n \n __all__ = [\n@@ -94,7 +95,12 @@ def task(\n \n         unwrapped = inspect.unwrap(func)\n \n-        raw_path = inspect.getfile(unwrapped)\n+        try:\n+            raw_path = inspect.getfile(unwrapped)\n+        except TypeError:\n+            msg = \"Builtin functions cannot be wrapped\"\n+            raise CollectionError(msg) from None\n+\n         if \"<string>\" in raw_path:\n             path = Path(unwrapped.__globals__[\"__file__\"]).absolute().resolve()\n         else:\n","stderr_tail":"","stdout_sha256":"57420155d517e10c575672070be5cdcc0e9a53af7ad0f10ee99304022667046c","log_path":null,"tree_digest":"51a97c0409c12e1064ced77bc54323fcbc10c00922f3c59ae772c7060497fe7b","tree_download_s":12.29223783290945,"started_at":"2026-10-03T21:50:08.402608Z","duration_s":0.060035041999071836,"timed_out":false,"image_before":"795617dd-86c4-40ad-a98f-f44cec690007","image_after":"795617dd-86c4-40ad-a98f-f44cec690007","junit":null,"diff":{"files":[{"path":"src/_pytask/task_utils.py","added":7,"deleted":1,"category":"source","status":"modified"}],"patch_sha256":"57420155d517e10c575672070be5cdcc0e9a53af7ad0f10ee99304022667046c","patch_path":"~/dev/nebius-hackathon/pilot/v2-arm-lightning/pytask-dev__pytask-519/runs/pilot-pytask-dev__pytask-519-4ca0de8453/artifacts/agent1/agent1-21.patch"},"patch_sha256":"57420155d517e10c575672070be5cdcc0e9a53af7ad0f10ee99304022667046c","dropped_paths":[],"snapshot_sha":"030f7af4d63fcc9d075a834d9f96e1f801ae97cb"}
