{
  "collected_ids": [
    "tests/test_task.py::test_error_when_function_is_defined_outside_loop_body",
    "tests/test_task.py::test_error_when_function_is_defined_outside_loop_body_with_id",
    "tests/test_task.py::test_order_of_decorator_does_not_matter",
    "tests/test_task.py::test_parametrization_in_for_loop",
    "tests/test_task.py::test_parametrization_in_for_loop_and_normal",
    "tests/test_task.py::test_parametrization_in_for_loop_from_decorator",
    "tests/test_task.py::test_parametrization_in_for_loop_from_decorator_w_irregular_dicts",
    "tests/test_task.py::test_parametrization_in_for_loop_from_markers",
    "tests/test_task.py::test_parametrization_in_for_loop_from_markers_and_args",
    "tests/test_task.py::test_parametrization_in_for_loop_from_signature",
    "tests/test_task.py::test_parametrization_in_for_loop_with_error",
    "tests/test_task.py::test_parametrization_in_for_loop_with_ids",
    "tests/test_task.py::test_parametrization_in_for_loop_with_one_iteration",
    "tests/test_task.py::test_parametrized_names_without_parametrization",
    "tests/test_task.py::test_parametrized_tasks_without_arguments_in_signature",
    "tests/test_task.py::test_raise_error_if_parametrization_produces_non_unique_tasks",
    "tests/test_task.py::test_raise_error_with_builtin_function_as_task",
    "tests/test_task.py::test_raise_errors_for_irregular_ids[1]",
    "tests/test_task.py::test_raise_errors_for_irregular_ids[irregular_id1]",
    "tests/test_task.py::test_raise_errors_for_irregular_ids[irregular_id2]",
    "tests/test_task.py::test_raise_errors_for_irregular_ids[irregular_id3]",
    "tests/test_task.py::test_raise_errors_for_irregular_ids[irregular_id4]",
    "tests/test_task.py::test_raise_errors_for_irregular_ids[irregular_id5]",
    "tests/test_task.py::test_raise_errors_for_irregular_ids[irregular_id6]",
    "tests/test_task.py::test_raise_errors_for_irregular_ids[irregular_id7]",
    "tests/test_task.py::test_return_with_task_decorator[Path('file.txt')]",
    "tests/test_task.py::test_return_with_task_decorator[PathNode(path=Path('file.txt'))]",
    "tests/test_task.py::test_return_with_tuple_and_task_decorator[(Path('file1.txt'), Path('file2.txt'))]",
    "tests/test_task.py::test_return_with_tuple_and_task_decorator[(PathNode(path=Path('file1.txt')), PathNode(path=Path('file2.txt')))]",
    "tests/test_task.py::test_task_function_with_partialed_args",
    "tests/test_task.py::test_task_function_with_partialed_args_and_task_decorator",
    "tests/test_task.py::test_task_kwargs_overwrite_default_arguments",
    "tests/test_task.py::test_task_receives_namedtuple",
    "tests/test_task.py::test_task_receives_unknown_kwarg",
    "tests/test_task.py::test_task_will_be_executed_after_another_one_with_function",
    "tests/test_task.py::test_task_will_be_executed_after_another_one_with_string",
    "tests/test_task.py::test_task_with_task_decorator[None-func]",
    "tests/test_task.py::test_task_with_task_decorator[None-task_example]",
    "tests/test_task.py::test_task_with_task_decorator[the_only_task-func]",
    "tests/test_task.py::test_task_with_task_decorator[the_only_task-task_example]",
    "tests/test_task.py::test_that_dynamically_creates_tasks_are_captured"
  ],
  "protected": [
    "tests/test_task.py::test_error_when_function_is_defined_outside_loop_body",
    "tests/test_task.py::test_error_when_function_is_defined_outside_loop_body_with_id",
    "tests/test_task.py::test_order_of_decorator_does_not_matter",
    "tests/test_task.py::test_parametrization_in_for_loop",
    "tests/test_task.py::test_parametrization_in_for_loop_and_normal",
    "tests/test_task.py::test_parametrization_in_for_loop_from_decorator",
    "tests/test_task.py::test_parametrization_in_for_loop_from_decorator_w_irregular_dicts",
    "tests/test_task.py::test_parametrization_in_for_loop_from_markers",
    "tests/test_task.py::test_parametrization_in_for_loop_from_markers_and_args",
    "tests/test_task.py::test_parametrization_in_for_loop_from_signature",
    "tests/test_task.py::test_parametrization_in_for_loop_with_error",
    "tests/test_task.py::test_parametrization_in_for_loop_with_ids",
    "tests/test_task.py::test_parametrization_in_for_loop_with_one_iteration",
    "tests/test_task.py::test_parametrized_names_without_parametrization",
    "tests/test_task.py::test_parametrized_tasks_without_arguments_in_signature",
    "tests/test_task.py::test_raise_errors_for_irregular_ids[1]",
    "tests/test_task.py::test_raise_errors_for_irregular_ids[irregular_id1]",
    "tests/test_task.py::test_raise_errors_for_irregular_ids[irregular_id2]",
    "tests/test_task.py::test_raise_errors_for_irregular_ids[irregular_id3]",
    "tests/test_task.py::test_raise_errors_for_irregular_ids[irregular_id4]",
    "tests/test_task.py::test_raise_errors_for_irregular_ids[irregular_id5]",
    "tests/test_task.py::test_raise_errors_for_irregular_ids[irregular_id6]",
    "tests/test_task.py::test_raise_errors_for_irregular_ids[irregular_id7]",
    "tests/test_task.py::test_return_with_task_decorator[Path('file.txt')]",
    "tests/test_task.py::test_return_with_task_decorator[PathNode(path=Path('file.txt'))]",
    "tests/test_task.py::test_return_with_tuple_and_task_decorator[(Path('file1.txt'), Path('file2.txt'))]",
    "tests/test_task.py::test_return_with_tuple_and_task_decorator[(PathNode(path=Path('file1.txt')), PathNode(path=Path('file2.txt')))]",
    "tests/test_task.py::test_task_function_with_partialed_args",
    "tests/test_task.py::test_task_function_with_partialed_args_and_task_decorator",
    "tests/test_task.py::test_task_kwargs_overwrite_default_arguments",
    "tests/test_task.py::test_task_receives_namedtuple",
    "tests/test_task.py::test_task_receives_unknown_kwarg",
    "tests/test_task.py::test_task_will_be_executed_after_another_one_with_function",
    "tests/test_task.py::test_task_will_be_executed_after_another_one_with_string",
    "tests/test_task.py::test_task_with_task_decorator[None-func]",
    "tests/test_task.py::test_task_with_task_decorator[None-task_example]",
    "tests/test_task.py::test_task_with_task_decorator[the_only_task-func]",
    "tests/test_task.py::test_task_with_task_decorator[the_only_task-task_example]",
    "tests/test_task.py::test_that_dynamically_creates_tasks_are_captured"
  ],
  "run_receipt_ids": [
    "base-3",
    "base-4"
  ],
  "runs": [
    {
      "collection_errors": [],
      "errors": [],
      "failed": [
        "tests/test_task.py::test_raise_error_with_builtin_function_as_task"
      ],
      "failure_text": {
        "tests/test_task.py::test_raise_error_with_builtin_function_as_task": "AssertionError: assert 'Builtin functions cannot be wrapped' in '\u2500\u2500\u2500\u2500\u2500\u2500\u2500\u2500\u2500\u2500\u2500\u2500\u2500\u2500\u2500\u2500\u2500\u2500\u2500\u2500\u2500\u2500\u2500\u2500\u2500\u2500\u2500\u2500\u2500 Start pytask session \u2500\u2500\u2500\u2500\u2500\u2500\u2500\u2500\u2500\u2500\u2500\u2500\u2500\u2500\u2500\u2500\u2500\u2500\u2500\u2500\u2500\u2500\u2500\u2500\u2500\u2500\u2500\u2500\u2500\\nPlatform: linux -- Python 3.10.19, ...\u2500\u2500\u2500\u2500\u2500\u2500\u2500\u2500\u2500\u2500\u2500\u2500\u2500\u2500\u2500\u2500\u2500\u2500\u2500\u2500\u2500\u2500\u2500\u2500\u2500\u2500\u2500\u2500\u2500\u2500\u2500\u2500\u2500\u256f\\n\u2500\u2500\u2500\u2500\u2500\u2500\u2500\u2500\u2500\u2500\u2500\u2500\u2500\u2500\u2500\u2500\u2500\u2500\u2500\u2500\u2500\u2500\u2500\u2500\u2500\u2500\u2500\u2500 Failed in 0.0 seconds \u2500\u2500\u2500\u2500\u2500\u2500\u2500\u2500\u2500\u2500\u2500\u2500\u2500\u2500\u2500\u2500\u2500\u2500\u2500\u2500\u2500\u2500\u2500\u2500\u2500\u2500\u2500\u2500\u2500\\n'\n +  where '\u2500\u2500\u2500\u2500\u2500\u2500\u2500\u2500\u2500\u2500\u2500\u2500\u2500\u2500\u2500\u2500\u2500\u2500\u2500\u2500\u2500\u2500\u2500\u2500\u2500\u2500\u2500\u2500\u2500 Start pytask session \u2500\u2500\u2500\u2500\u2500\u2500\u2500\u2500\u2500\u2500\u2500\u2500\u2500\u2500\u2500\u2500\u2500\u2500\u2500\u2500\u2500\u2500\u2500\u2500\u2500\u2500\u2500\u2500\u2500\\nPlatform: linux -- Python 3.10.19, ...\u2500\u2500\u2500\u2500\u2500\u2500\u2500\u2500\u2500\u2500\u2500\u2500\u2500\u2500\u2500\u2500\u2500\u2500\u2500\u2500\u2500\u2500\u2500\u2500\u2500\u2500\u2500\u2500\u2500\u2500\u2500\u2500\u2500\u256f\\n\u2500\u2500\u2500\u2500\u2500\u2500\u2500\u2500\u2500\u2500\u2500\u2500\u2500\u2500\u2500\u2500\u2500\u2500\u2500\u2500\u2500\u2500\u2500\u2500\u2500\u2500\u2500\u2500 Failed in 0.0 seconds \u2500\u2500\u2500\u2500\u2500\u2500\u2500\u2500\u2500\u2500\u2500\u2500\u2500\u2500\u2500\u2500\u2500\u2500\u2500\u2500\u2500\u2500\u2500\u2500\u2500\u2500\u2500\u2500\u2500\\n' = <Result SystemExit(<ExitCode.COLLECTION_FAILED: 3>)>.output\nE   AssertionError: assert 'Builtin functions cannot be wrapped' in '\u2500\u2500\u2500\u2500\u2500\u2500\u2500\u2500\u2500\u2500\u2500\u2500\u2500\u2500\u2500\u2500\u2500\u2500\u2500\u2500\u2500\u2500\u2500\u2500\u2500\u2500\u2500\u2500\u2500 Start pytask session \u2500\u2500\u2500\u2500\u2500\u2500\u2500\u2500\u2500\u2500\u2500\u2500\u2500\u2500\u2500\u2500\u2500\u2500\u2500\u2500\u2500\u2500\u2500\u2500\u2500\u2500\u2500\u2500\u2500\\nPlatform: linux -- Python 3.10.19, ...\u2500\u2500\u2500\u2500\u2500\u2500\u2500\u2500\u2500\u2500\u2500\u2500\u2500\u2500\u2500\u2500\u2500\u2500\u2500\u2500\u2500\u2500\u2500\u2500\u2500\u2500\u2500\u2500\u2500\u2500\u2500\u2500\u2500\u256f\\n\u2500\u2500\u2500\u2500\u2500\u2500\u2500\u2500\u2500\u2500\u2500\u2500\u2500\u2500\u2500\u2500\u2500\u2500\u2500\u2500\u2500\u2500\u2500\u2500\u2500\u2500\u2500\u2500 Failed in 0.0 seconds \u2500\u2500\u2500\u2500\u2500\u2500\u2500\u2500\u2500\u2500\u2500\u2500\u2500\u2500\u2500\u2500\u2500\u2500\u2500\u2500\u2500\u2500\u2500\u2500\u2500\u2500\u2500\u2500\u2500\\n'\n     +  where '\u2500\u2500\u2500\u2500\u2500\u2500\u2500\u2500\u2500\u2500\u2500\u2500\u2500\u2500\u2500\u2500\u2500\u2500\u2500\u2500\u2500\u2500\u2500\u2500\u2500\u2500\u2500\u2500\u2500 Start pytask session \u2500\u2500\u2500\u2500\u2500\u2500\u2500\u2500\u2500\u2500\u2500\u2500\u2500\u2500\u2500\u2500\u2500\u2500\u2500\u2500\u2500\u2500\u2500\u2500\u2500\u2500\u2500\u2500\u2500\\nPlatform: linux -- Python 3.10.19, ...\u2500\u2500\u2500\u2500\u2500\u2500\u2500\u2500\u2500\u2500\u2500\u2500\u2500\u2500\u2500\u2500\u2500\u2500\u2500\u2500\u2500\u2500\u2500\u2500\u2500\u2500\u2500\u2500\u2500\u2500\u2500\u2500\u2500\u256f\\n\u2500\u2500\u2500\u2500\u2500\u2500\u2500\u2500\u2500\u2500\u2500\u2500\u2500\u2500\u2500\u2500\u2500\u2500\u2500\u2500\u2500\u2500\u2500\u2500\u2500\u2500\u2500\u2500 Failed in 0.0 seconds \u2500\u2500\u2500\u2500\u2500\u2500\u2500\u2500\u2500\u2500\u2500\u2500\u2500\u2500\u2500\u2500\u2500\u2500\u2500\u2500\u2500\u2500\u2500\u2500\u2500\u2500\u2500\u2500\u2500\\n' = <Result SystemExit(<ExitCode.COLLECTION_FAILED: 3>)>.output"
      },
      "passed": [
        "tests/test_task.py::test_task_with_task_decorator[the_only_task-task_example]",
        "tests/test_task.py::test_task_with_task_decorator[the_only_task-func]",
        "tests/test_task.py::test_task_with_task_decorator[None-task_example]",
        "tests/test_task.py::test_task_with_task_decorator[None-func]",
        "tests/test_task.py::test_parametrization_in_for_loop",
        "tests/test_task.py::test_parametrization_in_for_loop_from_markers",
        "tests/test_task.py::test_parametrization_in_for_loop_from_signature",
        "tests/test_task.py::test_parametrization_in_for_loop_from_markers_and_args",
        "tests/test_task.py::test_parametrization_in_for_loop_from_decorator",
        "tests/test_task.py::test_parametrization_in_for_loop_with_ids",
        "tests/test_task.py::test_parametrization_in_for_loop_with_error",
        "tests/test_task.py::test_parametrization_in_for_loop_from_decorator_w_irregular_dicts",
        "tests/test_task.py::test_parametrization_in_for_loop_with_one_iteration",
        "tests/test_task.py::test_parametrization_in_for_loop_and_normal",
        "tests/test_task.py::test_parametrized_names_without_parametrization",
        "tests/test_task.py::test_order_of_decorator_does_not_matter",
        "tests/test_task.py::test_task_function_with_partialed_args",
        "tests/test_task.py::test_task_function_with_partialed_args_and_task_decorator",
        "tests/test_task.py::test_parametrized_tasks_without_arguments_in_signature",
        "tests/test_task.py::test_that_dynamically_creates_tasks_are_captured",
        "tests/test_task.py::test_raise_errors_for_irregular_ids[1]",
        "tests/test_task.py::test_raise_errors_for_irregular_ids[irregular_id1]",
        "tests/test_task.py::test_raise_errors_for_irregular_ids[irregular_id2]",
        "tests/test_task.py::test_raise_errors_for_irregular_ids[irregular_id3]",
        "tests/test_task.py::test_raise_errors_for_irregular_ids[irregular_id4]",
        "tests/test_task.py::test_raise_errors_for_irregular_ids[irregular_id5]",
        "tests/test_task.py::test_raise_errors_for_irregular_ids[irregular_id6]",
        "tests/test_task.py::test_raise_errors_for_irregular_ids[irregular_id7]",
        "tests/test_task.py::test_task_receives_unknown_kwarg",
        "tests/test_task.py::test_task_receives_namedtuple",
        "tests/test_task.py::test_task_kwargs_overwrite_default_arguments",
        "tests/test_task.py::test_return_with_task_decorator[PathNode(path=Path('file.txt'))]",
        "tests/test_task.py::test_return_with_task_decorator[Path('file.txt')]",
        "tests/test_task.py::test_return_with_tuple_and_task_decorator[(PathNode(path=Path('file1.txt')), PathNode(path=Path('file2.txt')))]",
        "tests/test_task.py::test_return_with_tuple_and_task_decorator[(Path('file1.txt'), Path('file2.txt'))]",
        "tests/test_task.py::test_error_when_function_is_defined_outside_loop_body",
        "tests/test_task.py::test_error_when_function_is_defined_outside_loop_body_with_id",
        "tests/test_task.py::test_task_will_be_executed_after_another_one_with_string",
        "tests/test_task.py::test_task_will_be_executed_after_another_one_with_function"
      ],
      "skipped": [
        "tests/test_task.py::test_raise_error_if_parametrization_produces_non_unique_tasks"
      ]
    },
    {
      "collection_errors": [],
      "errors": [],
      "failed": [
        "tests/test_task.py::test_raise_error_with_builtin_function_as_task"
      ],
      "failure_text": {
        "tests/test_task.py::test_raise_error_with_builtin_function_as_task": "AssertionError: assert 'Builtin functions cannot be wrapped' in '\u2500\u2500\u2500\u2500\u2500\u2500\u2500\u2500\u2500\u2500\u2500\u2500\u2500\u2500\u2500\u2500\u2500\u2500\u2500\u2500\u2500\u2500\u2500\u2500\u2500\u2500\u2500\u2500\u2500 Start pytask session \u2500\u2500\u2500\u2500\u2500\u2500\u2500\u2500\u2500\u2500\u2500\u2500\u2500\u2500\u2500\u2500\u2500\u2500\u2500\u2500\u2500\u2500\u2500\u2500\u2500\u2500\u2500\u2500\u2500\\nPlatform: linux -- Python 3.10.19, ...\u2500\u2500\u2500\u2500\u2500\u2500\u2500\u2500\u2500\u2500\u2500\u2500\u2500\u2500\u2500\u2500\u2500\u2500\u2500\u2500\u2500\u2500\u2500\u2500\u2500\u2500\u2500\u2500\u2500\u2500\u2500\u2500\u2500\u256f\\n\u2500\u2500\u2500\u2500\u2500\u2500\u2500\u2500\u2500\u2500\u2500\u2500\u2500\u2500\u2500\u2500\u2500\u2500\u2500\u2500\u2500\u2500\u2500\u2500\u2500\u2500\u2500\u2500 Failed in 0.0 seconds \u2500\u2500\u2500\u2500\u2500\u2500\u2500\u2500\u2500\u2500\u2500\u2500\u2500\u2500\u2500\u2500\u2500\u2500\u2500\u2500\u2500\u2500\u2500\u2500\u2500\u2500\u2500\u2500\u2500\\n'\n +  where '\u2500\u2500\u2500\u2500\u2500\u2500\u2500\u2500\u2500\u2500\u2500\u2500\u2500\u2500\u2500\u2500\u2500\u2500\u2500\u2500\u2500\u2500\u2500\u2500\u2500\u2500\u2500\u2500\u2500 Start pytask session \u2500\u2500\u2500\u2500\u2500\u2500\u2500\u2500\u2500\u2500\u2500\u2500\u2500\u2500\u2500\u2500\u2500\u2500\u2500\u2500\u2500\u2500\u2500\u2500\u2500\u2500\u2500\u2500\u2500\\nPlatform: linux -- Python 3.10.19, ...\u2500\u2500\u2500\u2500\u2500\u2500\u2500\u2500\u2500\u2500\u2500\u2500\u2500\u2500\u2500\u2500\u2500\u2500\u2500\u2500\u2500\u2500\u2500\u2500\u2500\u2500\u2500\u2500\u2500\u2500\u2500\u2500\u2500\u256f\\n\u2500\u2500\u2500\u2500\u2500\u2500\u2500\u2500\u2500\u2500\u2500\u2500\u2500\u2500\u2500\u2500\u2500\u2500\u2500\u2500\u2500\u2500\u2500\u2500\u2500\u2500\u2500\u2500 Failed in 0.0 seconds \u2500\u2500\u2500\u2500\u2500\u2500\u2500\u2500\u2500\u2500\u2500\u2500\u2500\u2500\u2500\u2500\u2500\u2500\u2500\u2500\u2500\u2500\u2500\u2500\u2500\u2500\u2500\u2500\u2500\\n' = <Result SystemExit(<ExitCode.COLLECTION_FAILED: 3>)>.output\nE   AssertionError: assert 'Builtin functions cannot be wrapped' in '\u2500\u2500\u2500\u2500\u2500\u2500\u2500\u2500\u2500\u2500\u2500\u2500\u2500\u2500\u2500\u2500\u2500\u2500\u2500\u2500\u2500\u2500\u2500\u2500\u2500\u2500\u2500\u2500\u2500 Start pytask session \u2500\u2500\u2500\u2500\u2500\u2500\u2500\u2500\u2500\u2500\u2500\u2500\u2500\u2500\u2500\u2500\u2500\u2500\u2500\u2500\u2500\u2500\u2500\u2500\u2500\u2500\u2500\u2500\u2500\\nPlatform: linux -- Python 3.10.19, ...\u2500\u2500\u2500\u2500\u2500\u2500\u2500\u2500\u2500\u2500\u2500\u2500\u2500\u2500\u2500\u2500\u2500\u2500\u2500\u2500\u2500\u2500\u2500\u2500\u2500\u2500\u2500\u2500\u2500\u2500\u2500\u2500\u2500\u256f\\n\u2500\u2500\u2500\u2500\u2500\u2500\u2500\u2500\u2500\u2500\u2500\u2500\u2500\u2500\u2500\u2500\u2500\u2500\u2500\u2500\u2500\u2500\u2500\u2500\u2500\u2500\u2500\u2500 Failed in 0.0 seconds \u2500\u2500\u2500\u2500\u2500\u2500\u2500\u2500\u2500\u2500\u2500\u2500\u2500\u2500\u2500\u2500\u2500\u2500\u2500\u2500\u2500\u2500\u2500\u2500\u2500\u2500\u2500\u2500\u2500\\n'\n     +  where '\u2500\u2500\u2500\u2500\u2500\u2500\u2500\u2500\u2500\u2500\u2500\u2500\u2500\u2500\u2500\u2500\u2500\u2500\u2500\u2500\u2500\u2500\u2500\u2500\u2500\u2500\u2500\u2500\u2500 Start pytask session \u2500\u2500\u2500\u2500\u2500\u2500\u2500\u2500\u2500\u2500\u2500\u2500\u2500\u2500\u2500\u2500\u2500\u2500\u2500\u2500\u2500\u2500\u2500\u2500\u2500\u2500\u2500\u2500\u2500\\nPlatform: linux -- Python 3.10.19, ...\u2500\u2500\u2500\u2500\u2500\u2500\u2500\u2500\u2500\u2500\u2500\u2500\u2500\u2500\u2500\u2500\u2500\u2500\u2500\u2500\u2500\u2500\u2500\u2500\u2500\u2500\u2500\u2500\u2500\u2500\u2500\u2500\u2500\u256f\\n\u2500\u2500\u2500\u2500\u2500\u2500\u2500\u2500\u2500\u2500\u2500\u2500\u2500\u2500\u2500\u2500\u2500\u2500\u2500\u2500\u2500\u2500\u2500\u2500\u2500\u2500\u2500\u2500 Failed in 0.0 seconds \u2500\u2500\u2500\u2500\u2500\u2500\u2500\u2500\u2500\u2500\u2500\u2500\u2500\u2500\u2500\u2500\u2500\u2500\u2500\u2500\u2500\u2500\u2500\u2500\u2500\u2500\u2500\u2500\u2500\\n' = <Result SystemExit(<ExitCode.COLLECTION_FAILED: 3>)>.output"
      },
      "passed": [
        "tests/test_task.py::test_task_with_task_decorator[the_only_task-task_example]",
        "tests/test_task.py::test_task_with_task_decorator[the_only_task-func]",
        "tests/test_task.py::test_task_with_task_decorator[None-task_example]",
        "tests/test_task.py::test_task_with_task_decorator[None-func]",
        "tests/test_task.py::test_parametrization_in_for_loop",
        "tests/test_task.py::test_parametrization_in_for_loop_from_markers",
        "tests/test_task.py::test_parametrization_in_for_loop_from_signature",
        "tests/test_task.py::test_parametrization_in_for_loop_from_markers_and_args",
        "tests/test_task.py::test_parametrization_in_for_loop_from_decorator",
        "tests/test_task.py::test_parametrization_in_for_loop_with_ids",
        "tests/test_task.py::test_parametrization_in_for_loop_with_error",
        "tests/test_task.py::test_parametrization_in_for_loop_from_decorator_w_irregular_dicts",
        "tests/test_task.py::test_parametrization_in_for_loop_with_one_iteration",
        "tests/test_task.py::test_parametrization_in_for_loop_and_normal",
        "tests/test_task.py::test_parametrized_names_without_parametrization",
        "tests/test_task.py::test_order_of_decorator_does_not_matter",
        "tests/test_task.py::test_task_function_with_partialed_args",
        "tests/test_task.py::test_task_function_with_partialed_args_and_task_decorator",
        "tests/test_task.py::test_parametrized_tasks_without_arguments_in_signature",
        "tests/test_task.py::test_that_dynamically_creates_tasks_are_captured",
        "tests/test_task.py::test_raise_errors_for_irregular_ids[1]",
        "tests/test_task.py::test_raise_errors_for_irregular_ids[irregular_id1]",
        "tests/test_task.py::test_raise_errors_for_irregular_ids[irregular_id2]",
        "tests/test_task.py::test_raise_errors_for_irregular_ids[irregular_id3]",
        "tests/test_task.py::test_raise_errors_for_irregular_ids[irregular_id4]",
        "tests/test_task.py::test_raise_errors_for_irregular_ids[irregular_id5]",
        "tests/test_task.py::test_raise_errors_for_irregular_ids[irregular_id6]",
        "tests/test_task.py::test_raise_errors_for_irregular_ids[irregular_id7]",
        "tests/test_task.py::test_task_receives_unknown_kwarg",
        "tests/test_task.py::test_task_receives_namedtuple",
        "tests/test_task.py::test_task_kwargs_overwrite_default_arguments",
        "tests/test_task.py::test_return_with_task_decorator[PathNode(path=Path('file.txt'))]",
        "tests/test_task.py::test_return_with_task_decorator[Path('file.txt')]",
        "tests/test_task.py::test_return_with_tuple_and_task_decorator[(PathNode(path=Path('file1.txt')), PathNode(path=Path('file2.txt')))]",
        "tests/test_task.py::test_return_with_tuple_and_task_decorator[(Path('file1.txt'), Path('file2.txt'))]",
        "tests/test_task.py::test_error_when_function_is_defined_outside_loop_body",
        "tests/test_task.py::test_error_when_function_is_defined_outside_loop_body_with_id",
        "tests/test_task.py::test_task_will_be_executed_after_another_one_with_string",
        "tests/test_task.py::test_task_will_be_executed_after_another_one_with_function"
      ],
      "skipped": [
        "tests/test_task.py::test_raise_error_if_parametrization_produces_non_unique_tasks"
      ]
    }
  ],
  "scope": {
    "c0_top_level": [
      ".github",
      ".gitignore",
      ".pre-commit-config.yaml",
      ".readthedocs.yaml",
      "CITATION",
      "LICENSE",
      "MANIFEST.in",
      "README.md",
      "codecov.yml",
      "docs",
      "docs_src",
      "environment.yml",
      "pyproject.toml",
      "scripts",
      "src",
      "src/_pytask",
      "src/pytask",
      "tests",
      "tox.ini"
    ],
    "protected_names": [
      "CITATION",
      "LICENSE",
      "MANIFEST.in",
      "README.md",
      "__future__",
      "_abc",
      "_aix_support",
      "_ast",
      "_asyncio",
      "_bisect",
      "_blake2",
      "_bz2",
      "_codecs",
      "_codecs_cn",
      "_codecs_hk",
      "_codecs_iso2022",
      "_codecs_jp",
      "_codecs_kr",
      "_codecs_tw",
      "_collections",
      "_collections_abc",
      "_compat_pickle",
      "_compression",
      "_contextvars",
      "_crypt",
      "_csv",
      "_ctypes",
      "_curses",
      "_curses_panel",
      "_datetime",
      "_dbm",
      "_decimal",
      "_elementtree",
      "_frozen_importlib",
      "_frozen_importlib_external",
      "_functools",
      "_gdbm",
      "_hashlib",
      "_heapq",
      "_imp",
      "_io",
      "_json",
      "_locale",
      "_lsprof",
      "_lzma",
      "_markupbase",
      "_md5",
      "_msi",
      "_multibytecodec",
      "_multiprocessing",
      "_opcode",
      "_operator",
      "_osx_support",
      "_overlapped",
      "_pickle",
      "_posixshmem",
      "_posixsubprocess",
      "_py_abc",
      "_pydatetime",
      "_pydecimal",
      "_pyio",
      "_pylong",
      "_pytask",
      "_pytest",
      "_queue",
      "_random",
      "_scproxy",
      "_sha1",
      "_sha2",
      "_sha3",
      "_signal",
      "_sitebuiltins",
      "_socket",
      "_sqlite3",
      "_sre",
      "_ssl",
      "_stat",
      "_statistics",
      "_string",
      "_strptime",
      "_struct",
      "_symtable",
      "_thread",
      "_threading_local",
      "_tkinter",
      "_tokenize",
      "_tracemalloc",
      "_typing",
      "_uuid",
      "_warnings",
      "_weakref",
      "_weakrefset",
      "_winapi",
      "_wmi",
      "_zoneinfo",
      "abc",
      "aifc",
      "aiofiles",
      "aiohappyeyeballs",
      "aiohttp",
      "aiohttp_retry",
      "aiosignal",
      "annotated_types",
      "antigravity",
      "anyio",
      "argparse",
      "array",
      "ast",
      "asyncio",
      "atexit",
      "attr",
      "attrs",
      "audioop",
      "base64",
      "bdb",
      "bidict",
      "binascii",
      "bisect",
      "builtins",
      "bz2",
      "cProfile",
      "calendar",
      "certifi",
      "cgi",
      "cgitb",
      "charset_normalizer",
      "chunk",
      "cmath",
      "cmd",
      "code",
      "codecov.yml",
      "codecs",
      "codeop",
      "collections",
      "colorsys",
      "compileall",
      "concurrent",
      "configparser",
      "conftest",
      "contextlib",
      "contextvars",
      "copy",
      "copyreg",
      "crypt",
      "csv",
      "ctypes",
      "curses",
      "dataclasses",
      "datetime",
      "dateutil",
      "daytona",
      "daytona_analytics_api_client",
      "daytona_analytics_api_client_async",
      "daytona_api_client",
      "daytona_api_client_async",
      "daytona_toolbox_api_client",
      "daytona_toolbox_api_client_async",
      "dbm",
      "decimal",
      "deprecated",
      "difflib",
      "dis",
      "docs",
      "docs_src",
      "doctest",
      "dotenv",
      "email",
      "encodings",
      "engineio",
      "ensurepip",
      "enum",
      "environment.yml",
      "errno",
      "faulthandler",
      "fcntl",
      "filecmp",
      "fileinput",
      "fnmatch",
      "fractions",
      "frozenlist",
      "ftplib",
      "functools",
      "gc",
      "genericpath",
      "getopt",
      "getpass",
      "gettext",
      "glob",
      "google",
      "graphlib",
      "grp",
      "gzip",
      "h11",
      "hashlib",
      "heapq",
      "hmac",
      "html",
      "http",
      "httpcore",
      "httpcore2",
      "httpx",
      "httpx2",
      "httpx_ws",
      "idlelib",
      "idna",
      "imaplib",
      "imghdr",
      "importlib",
      "iniconfig",
      "inspect",
      "io",
      "ipaddress",
      "itertools",
      "jiter",
      "json",
      "keyword",
      "lib2to3",
      "linecache",
      "locale",
      "logging",
      "lzma",
      "mailbox",
      "mailcap",
      "marshal",
      "math",
      "mimetypes",
      "mmap",
      "modulefinder",
      "msilib",
      "msvcrt",
      "multidict",
      "multipart",
      "multiprocessing",
      "netrc",
      "nis",
      "nntplib",
      "nt",
      "ntpath",
      "nturl2path",
      "numbers",
      "obstore",
      "opcode",
      "openai",
      "opentelemetry",
      "operator",
      "optparse",
      "os",
      "ossaudiodev",
      "packaging",
      "pathlib",
      "pdb",
      "pickle",
      "pickletools",
      "pipes",
      "pkgutil",
      "platform",
      "plistlib",
      "pluggy",
      "poplib",
      "posix",
      "posixpath",
      "pprint",
      "profile",
      "propcache",
      "pstats",
      "pty",
      "pwd",
      "py",
      "py_compile",
      "pyclbr",
      "pydantic",
      "pydantic_core",
      "pydoc",
      "pydoc_data",
      "pyexpat",
      "pygments",
      "pyproject.toml",
      "pytask",
      "pytest",
      "pytest_asyncio",
      "python_multipart",
      "queue",
      "quopri",
      "random",
      "re",
      "readline",
      "reprlib",
      "requests",
      "resource",
      "rlcompleter",
      "runpy",
      "sched",
      "scripts",
      "secrets",
      "select",
      "selectors",
      "shelve",
      "shlex",
      "shutil",
      "signal",
      "simple_websocket",
      "site",
      "six",
      "smtplib",
      "sndhdr",
      "sniffio",
      "socket",
      "socketio",
      "socketserver",
      "spwd",
      "sqlite3",
      "src",
      "sre_compile",
      "sre_constants",
      "sre_parse",
      "ssl",
      "stat",
      "statistics",
      "string",
      "stringprep",
      "struct",
      "subprocess",
      "sunau",
      "symtable",
      "sys",
      "sysconfig",
      "syslog",
      "tabnanny",
      "tarfile",
      "telnetlib",
      "tempfile",
      "termios",
      "tests",
      "textwrap",
      "this",
      "threading",
      "time",
      "timeit",
      "tkinter",
      "token",
      "tokenize",
      "toml",
      "tomllib",
      "tox.ini",
      "trace",
      "traceback",
      "tracemalloc",
      "truststore",
      "tty",
      "turtle",
      "turtledemo",
      "types",
      "typing",
      "typing_extensions",
      "typing_inspection",
      "unicodedata",
      "unittest",
      "urllib",
      "urllib3",
      "uu",
      "uuid",
      "venv",
      "warnings",
      "wave",
      "weakref",
      "webbrowser",
      "websocket",
      "winreg",
      "winsound",
      "wrapt",
      "wrapt-stubs",
      "wsgiref",
      "wsproto",
      "xdrlib",
      "xml",
      "xmlrpc",
      "yarl",
      "zipapp",
      "zipfile",
      "zipimport",
      "zlib",
      "zoneinfo"
    ]
  },
  "skipped_ids": [
    "tests/test_task.py::test_raise_error_if_parametrization_produces_non_unique_tasks"
  ],
  "spec_paths": [
    "tests/test_task.py"
  ],
  "target": [
    "tests/test_task.py::test_raise_error_with_builtin_function_as_task"
  ],
  "target_failure_text": {
    "tests/test_task.py::test_raise_error_with_builtin_function_as_task": "AssertionError: assert 'Builtin functions cannot be wrapped' in '\u2500\u2500\u2500\u2500\u2500\u2500\u2500\u2500\u2500\u2500\u2500\u2500\u2500\u2500\u2500\u2500\u2500\u2500\u2500\u2500\u2500\u2500\u2500\u2500\u2500\u2500\u2500\u2500\u2500 Start pytask session \u2500\u2500\u2500\u2500\u2500\u2500\u2500\u2500\u2500\u2500\u2500\u2500\u2500\u2500\u2500\u2500\u2500\u2500\u2500\u2500\u2500\u2500\u2500\u2500\u2500\u2500\u2500\u2500\u2500\\nPlatform: linux -- Python 3.10.19, ...\u2500\u2500\u2500\u2500\u2500\u2500\u2500\u2500\u2500\u2500\u2500\u2500\u2500\u2500\u2500\u2500\u2500\u2500\u2500\u2500\u2500\u2500\u2500\u2500\u2500\u2500\u2500\u2500\u2500\u2500\u2500\u2500\u2500\u256f\\n\u2500\u2500\u2500\u2500\u2500\u2500\u2500\u2500\u2500\u2500\u2500\u2500\u2500\u2500\u2500\u2500\u2500\u2500\u2500\u2500\u2500\u2500\u2500\u2500\u2500\u2500\u2500\u2500 Failed in 0.0 seconds \u2500\u2500\u2500\u2500\u2500\u2500\u2500\u2500\u2500\u2500\u2500\u2500\u2500\u2500\u2500\u2500\u2500\u2500\u2500\u2500\u2500\u2500\u2500\u2500\u2500\u2500\u2500\u2500\u2500\\n'\n +  where '\u2500\u2500\u2500\u2500\u2500\u2500\u2500\u2500\u2500\u2500\u2500\u2500\u2500\u2500\u2500\u2500\u2500\u2500\u2500\u2500\u2500\u2500\u2500\u2500\u2500\u2500\u2500\u2500\u2500 Start pytask session \u2500\u2500\u2500\u2500\u2500\u2500\u2500\u2500\u2500\u2500\u2500\u2500\u2500\u2500\u2500\u2500\u2500\u2500\u2500\u2500\u2500\u2500\u2500\u2500\u2500\u2500\u2500\u2500\u2500\\nPlatform: linux -- Python 3.10.19, ...\u2500\u2500\u2500\u2500\u2500\u2500\u2500\u2500\u2500\u2500\u2500\u2500\u2500\u2500\u2500\u2500\u2500\u2500\u2500\u2500\u2500\u2500\u2500\u2500\u2500\u2500\u2500\u2500\u2500\u2500\u2500\u2500\u2500\u256f\\n\u2500\u2500\u2500\u2500\u2500\u2500\u2500\u2500\u2500\u2500\u2500\u2500\u2500\u2500\u2500\u2500\u2500\u2500\u2500\u2500\u2500\u2500\u2500\u2500\u2500\u2500\u2500\u2500 Failed in 0.0 seconds \u2500\u2500\u2500\u2500\u2500\u2500\u2500\u2500\u2500\u2500\u2500\u2500\u2500\u2500\u2500\u2500\u2500\u2500\u2500\u2500\u2500\u2500\u2500\u2500\u2500\u2500\u2500\u2500\u2500\\n' = <Result SystemExit(<ExitCode.COLLECTION_FAILED: 3>)>.output\nE   AssertionError: assert 'Builtin functions cannot be wrapped' in '\u2500\u2500\u2500\u2500\u2500\u2500\u2500\u2500\u2500\u2500\u2500\u2500\u2500\u2500\u2500\u2500\u2500\u2500\u2500\u2500\u2500\u2500\u2500\u2500\u2500\u2500\u2500\u2500\u2500 Start pytask session \u2500\u2500\u2500\u2500\u2500\u2500\u2500\u2500\u2500\u2500\u2500\u2500\u2500\u2500\u2500\u2500\u2500\u2500\u2500\u2500\u2500\u2500\u2500\u2500\u2500\u2500\u2500\u2500\u2500\\nPlatform: linux -- Python 3.10.19, ...\u2500\u2500\u2500\u2500\u2500\u2500\u2500\u2500\u2500\u2500\u2500\u2500\u2500\u2500\u2500\u2500\u2500\u2500\u2500\u2500\u2500\u2500\u2500\u2500\u2500\u2500\u2500\u2500\u2500\u2500\u2500\u2500\u2500\u256f\\n\u2500\u2500\u2500\u2500\u2500\u2500\u2500\u2500\u2500\u2500\u2500\u2500\u2500\u2500\u2500\u2500\u2500\u2500\u2500\u2500\u2500\u2500\u2500\u2500\u2500\u2500\u2500\u2500 Failed in 0.0 seconds \u2500\u2500\u2500\u2500\u2500\u2500\u2500\u2500\u2500\u2500\u2500\u2500\u2500\u2500\u2500\u2500\u2500\u2500\u2500\u2500\u2500\u2500\u2500\u2500\u2500\u2500\u2500\u2500\u2500\\n'\n     +  where '\u2500\u2500\u2500\u2500\u2500\u2500\u2500\u2500\u2500\u2500\u2500\u2500\u2500\u2500\u2500\u2500\u2500\u2500\u2500\u2500\u2500\u2500\u2500\u2500\u2500\u2500\u2500\u2500\u2500 Start pytask session \u2500\u2500\u2500\u2500\u2500\u2500\u2500\u2500\u2500\u2500\u2500\u2500\u2500\u2500\u2500\u2500\u2500\u2500\u2500\u2500\u2500\u2500\u2500\u2500\u2500\u2500\u2500\u2500\u2500\\nPlatform: linux -- Python 3.10.19, ...\u2500\u2500\u2500\u2500\u2500\u2500\u2500\u2500\u2500\u2500\u2500\u2500\u2500\u2500\u2500\u2500\u2500\u2500\u2500\u2500\u2500\u2500\u2500\u2500\u2500\u2500\u2500\u2500\u2500\u2500\u2500\u2500\u2500\u256f\\n\u2500\u2500\u2500\u2500\u2500\u2500\u2500\u2500\u2500\u2500\u2500\u2500\u2500\u2500\u2500\u2500\u2500\u2500\u2500\u2500\u2500\u2500\u2500\u2500\u2500\u2500\u2500\u2500 Failed in 0.0 seconds \u2500\u2500\u2500\u2500\u2500\u2500\u2500\u2500\u2500\u2500\u2500\u2500\u2500\u2500\u2500\u2500\u2500\u2500\u2500\u2500\u2500\u2500\u2500\u2500\u2500\u2500\u2500\u2500\u2500\\n' = <Result SystemExit(<ExitCode.COLLECTION_FAILED: 3>)>.output"
  },
  "target_map": {
    "tests/test_task.py::test_raise_error_with_builtin_function_as_task": [
      "tests/test_task.py::test_raise_error_with_builtin_function_as_task"
    ]
  },
  "unstable": []
}
