{"receipt_id":"base-1","seq":1,"branch_id":"base","kind":"command","cmd":"python -c 'import base64; from pathlib import Path; Path('\"'\"'/tmp/receipts-theacodes__nox-466-test.patch'\"'\"').write_bytes(base64.b64decode('\"'\"'ZGlmZiAtLWdpdCBhL3Rlc3RzL3Rlc3RfdmlydHVhbGVudi5weSBiL3Rlc3RzL3Rlc3RfdmlydHVhbGVudi5weQppbmRleCBjODVjMDhiLi44ZmUxYzQxIDEwMDY0NAotLS0gYS90ZXN0cy90ZXN0X3ZpcnR1YWxlbnYucHkKKysrIGIvdGVzdHMvdGVzdF92aXJ0dWFsZW52LnB5CkBAIC0yMTAsNiArMjEwLDIzIEBAIGRlZiB0ZXN0X2NvbmRhZW52X2NyZWF0ZV9pbnRlcnByZXRlcihtYWtlX2NvbmRhKToKICAgICAgICAgYXNzZXJ0IGRpcl8uam9pbigiYmluIiwgInB5dGhvbjMuNyIpLmNoZWNrKCkKIAogCitAcHl0ZXN0Lm1hcmsuc2tpcGlmKG5vdCBIQVNfQ09OREEsIHJlYXNvbj0iTWlzc2luZyBjb25kYSBjb21tYW5kLiIpCitkZWYgdGVzdF9jb25kYV9lbnZfY3JlYXRlX3ZlcmJvc2UobWFrZV9jb25kYSk6CisgICAgdmVudiwgZGlyXyA9IG1ha2VfY29uZGEoKQorICAgIHdpdGggbW9jay5wYXRjaCgibm94LnZpcnR1YWxlbnYubm94LmNvbW1hbmQucnVuIikgYXMgbW9ja19ydW46CisgICAgICAgIHZlbnYuY3JlYXRlKCkKKworICAgIGFyZ3MsIGt3YXJncyA9IG1vY2tfcnVuLmNhbGxfYXJncworICAgIGFzc2VydCBrd2FyZ3NbImxvZyJdIGlzIEZhbHNlCisKKyAgICBub3gub3B0aW9ucy52ZXJib3NlID0gVHJ1ZQorICAgIHdpdGggbW9jay5wYXRjaCgibm94LnZpcnR1YWxlbnYubm94LmNvbW1hbmQucnVuIikgYXMgbW9ja19ydW46CisgICAgICAgIHZlbnYuY3JlYXRlKCkKKworICAgIGFyZ3MsIGt3YXJncyA9IG1vY2tfcnVuLmNhbGxfYXJncworICAgIGFzc2VydCBrd2FyZ3NbImxvZyJdCisKKwogQG1vY2sucGF0Y2goIm5veC52aXJ0dWFsZW52Ll9TWVNURU0iLCBuZXc9IldpbmRvd3MiKQogZGVmIHRlc3RfY29uZGFlbnZfYmluX3dpbmRvd3MobWFrZV9jb25kYSk6CiAgICAgdmVudiwgZGlyXyA9IG1ha2VfY29uZGEoKQo='\"'\"'))'","path":null,"exit_code":0,"stdout_tail":"","stderr_tail":"","stdout_sha256":"e3b0c44298fc1c149afbf4c8996fb92427ae41e4649b934ca495991b7852b855","log_path":"~/dev/nebius-hackathon/pilot/v2-P/theacodes__nox-466/runs/pilot-theacodes__nox-466-7cd2d00d26/logs/base/base-1.log","tree_digest":null,"tree_download_s":null,"started_at":"2026-10-03T18:01:19.263613Z","duration_s":0.023404,"timed_out":false,"image_before":"b2d59199-0894-3d0e-ada2-ff7fa41a55fe","image_after":"b9cc05a4-37bd-4a72-b32c-d9668f09df1e","junit":null,"diff":null,"patch_sha256":null,"dropped_paths":[],"snapshot_sha":null}
{"receipt_id":"base-2","seq":2,"branch_id":"base","kind":"command","cmd":"git apply /tmp/receipts-theacodes__nox-466-test.patch","path":null,"exit_code":0,"stdout_tail":"","stderr_tail":"","stdout_sha256":"e3b0c44298fc1c149afbf4c8996fb92427ae41e4649b934ca495991b7852b855","log_path":"~/dev/nebius-hackathon/pilot/v2-P/theacodes__nox-466/runs/pilot-theacodes__nox-466-7cd2d00d26/logs/base/base-2.log","tree_digest":null,"tree_download_s":null,"started_at":"2026-10-03T18:01:20.521860Z","duration_s":0.003926000000000001,"timed_out":false,"image_before":"b9cc05a4-37bd-4a72-b32c-d9668f09df1e","image_after":"df9cd7f0-b71c-4b25-b69a-68301b82dbd6","junit":null,"diff":null,"patch_sha256":null,"dropped_paths":[],"snapshot_sha":null}
{"receipt_id":"base-3","seq":3,"branch_id":"base","kind":"command","cmd":"/opt/receipts-ebbba744a1a6415ab9ce01942fcdb715/bin/busybox mkdir -p /opt/receipts/reports && python -I /opt/receipts-ebbba744a1a6415ab9ce01942fcdb715/receipts_pytest.py --no-header -rA --tb=line --color=no -p no:cacheprovider -W ignore::DeprecationWarning tests/test_virtualenv.py -o junit_family=xunit1 -p no:cacheprovider -rA --continue-on-collection-errors --junitxml=/opt/receipts/reports/base-3.xml","path":null,"exit_code":1,"stdout_tail":"============================= test session starts ==============================\ncollected 59 items\n\ntests/test_virtualenv.py .......F................s...................... [ 79%]\n............                                                             [100%]\n\n=================================== FAILURES ===================================\nE   assert False\n/nox/tests/test_virtualenv.py:227: assert False\n==================================== PASSES ====================================\n------------- generated xml file: /opt/receipts/reports/base-3.xml -------------\n=========================== short test summary info ============================\nPASSED tests/test_virtualenv.py::test_process_env_constructor\nPASSED tests/test_virtualenv.py::test_process_env_create\nPASSED tests/test_virtualenv.py::test_condaenv_constructor_defaults\nPASSED tests/test_virtualenv.py::test_condaenv_constructor_explicit\nPASSED tests/test_virtualenv.py::test_condaenv_create\nPASSED tests/test_virtualenv.py::test_condaenv_create_with_params\nPASSED tests/test_virtualenv.py::test_condaenv_create_interpreter\nPASSED tests/test_virtualenv.py::test_condaenv_bin_windows\nPASSED tests/test_virtualenv.py::test_condaenv_\nPASSED tests/test_virtualenv.py::test_constructor_defaults\nPASSED tests/test_virtualenv.py::test_constructor_explicit\nPASSED tests/test_virtualenv.py::test_env\nPASSED tests/test_virtualenv.py::test_blacklisted_env\nPASSED tests/test_virtualenv.py::test__clean_location\nPASSED tests/test_virtualenv.py::test_bin_paths\nPASSED tests/test_virtualenv.py::test_bin_windows\nPASSED tests/test_virtualenv.py::test_create\nPASSED tests/test_virtualenv.py::test_create_reuse_environment\nPASSED tests/test_virtualenv.py::test_create_reuse_environment_with_different_interpreter\nPASSED tests/test_virtualenv.py::test_create_reuse_stale_venv_environment\nPASSED tests/test_virtualenv.py::test_create_reuse_stale_virtualenv_environment\nPASSED tests/test_virtualenv.py::test_create_reuse_venv_environment\nPASSED tests/test_virtualenv.py::test_create_reuse_oldstyle_virtualenv_environment\nPASSED tests/test_virtualenv.py::test_create_venv_backend\nPASSED tests/test_virtualenv.py::test_create_interpreter\nPASSED tests/test_virtualenv.py::test__resolved_interpreter_none\nPASSED tests/test_virtualenv.py::test__resolved_interpreter_numerical_non_windows[3-python3]\nPASSED tests/test_virtualenv.py::test__resolved_interpreter_numerical_non_windows[3.6-python3.6]\nPASSED tests/test_virtualenv.py::test__resolved_interpreter_numerical_non_windows[3.6.2-python3.6]\nPASSED tests/test_virtualenv.py::test__resolved_interpreter_numerical_non_windows[3.10-python3.10]\nPASSED tests/test_virtualenv.py::test__resolved_interpreter_numerical_non_windows[2.7.15-python2.7]\nPASSED tests/test_virtualenv.py::test__resolved_interpreter_invalid_numerical_id[2.]\nPASSED tests/test_virtualenv.py::test__resolved_interpreter_invalid_numerical_id[2.7.]\nPASSED tests/test_virtualenv.py::test__resolved_interpreter_32_bit_non_windows\nPASSED tests/test_virtualenv.py::test__resolved_interpreter_non_windows\nPASSED tests/test_virtualenv.py::test__resolved_interpreter_windows_full_path\nPASSED tests/test_virtualenv.py::test__resolved_interpreter_windows_pyexe[3.7-c:\\\\python37-x64\\\\python.exe]\nPASSED tests/test_virtualenv.py::test__resolved_interpreter_windows_pyexe[python3.6-c:\\\\python36-x64\\\\python.exe]\nPASSED tests/test_virtualenv.py::test__resolved_interpreter_windows_pyexe[2.7-32-c:\\\\python27\\\\python.exe]\nPASSED tests/test_virtualenv.py::test__resolved_interpreter_windows_pyexe_fails\nPASSED tests/test_virtualenv.py::test__resolved_interpreter_windows_path_and_version\nPASSED tests/test_virtualenv.py::test__resolved_interpreter_windows_path_and_version_fails[3.7.3\\\\n-c:\\\\python37-x64\\\\python.exe-2.7]\nPASSED tests/test_virtualenv.py::test__resolved_interpreter_windows_path_and_version_fails[3.7.3\\\\n-c:\\\\python37-x64\\\\python.exe-python3.7]\nPASSED tests/test_virtualenv.py::test__resolved_interpreter_windows_path_and_version_fails[3.7.3\\\\n-c:\\\\python37-x64\\\\python.exe-goofy]\nPASSED tests/test_virtualenv.py::test__resolved_interpreter_windows_path_and_version_fails[3.7.3\\\\n-None-2.7]\nPASSED tests/test_virtualenv.py::test__resolved_interpreter_windows_path_and_version_fails[3.7.3\\\\n-None-python3.7]\nPASSED tests/test_virtualenv.py::test__resolved_interpreter_windows_path_and_version_fails[3.7.3\\\\n-None-goofy]\nPASSED tests/test_virtualenv.py::test__resolved_interpreter_windows_path_and_version_fails[RAISE_ERROR-c:\\\\python37-x64\\\\python.exe-2.7]\nPASSED tests/test_virtualenv.py::test__resolved_interpreter_windows_path_and_version_fails[RAISE_ERROR-c:\\\\python37-x64\\\\python.exe-python3.7]\nPASSED tests/test_virtualenv.py::test__resolved_interpreter_windows_path_and_version_fails[RAISE_ERROR-c:\\\\python37-x64\\\\python.exe-goofy]\nPASSED tests/test_virtualenv.py::test__resolved_interpreter_windows_path_and_version_fails[RAISE_ERROR-None-2.7]\nPASSED tests/test_virtualenv.py::test__resolved_interpreter_windows_path_and_version_fails[RAISE_ERROR-None-python3.7]\nPASSED tests/test_virtualenv.py::test__resolved_interpreter_windows_path_and_version_fails[RAISE_ERROR-None-goofy]\nPASSED tests/test_virtualenv.py::test__resolved_interpreter_not_found\nPASSED tests/test_virtualenv.py::test__resolved_interpreter_nonstandard\nPASSED tests/test_virtualenv.py::test__resolved_interpreter_cache_result\nPASSED tests/test_virtualenv.py::test__resolved_interpreter_cache_failure\nSKIPPED [1] tests/test_virtualenv.py:482: Requires Python 2.7 installation.\nFAILED tests/test_virtualenv.py::test_conda_env_create_verbose - assert False\n=================== 1 failed, 57 passed, 1 skipped in 50.57s ===================\n","stderr_tail":"","stdout_sha256":"2aa17ac5fb90c45386c6fb748dac1fe4b1edbdbdd8939e75fbae6f423398191a","log_path":"~/dev/nebius-hackathon/pilot/v2-P/theacodes__nox-466/runs/pilot-theacodes__nox-466-7cd2d00d26/logs/base/base-3.log","tree_digest":"92513535d99d1b0a060944a06810a73a001f6a5a8aa4bea8dab3f3d1053c540a","tree_download_s":3.6051882919855416,"started_at":"2026-10-03T18:01:22.410371Z","duration_s":31.653855,"timed_out":false,"image_before":"df9cd7f0-b71c-4b25-b69a-68301b82dbd6","image_after":"b3ba6b7d-3992-4521-8cdf-65decb90a586","junit":{"passed":["tests/test_virtualenv.py::test_process_env_constructor","tests/test_virtualenv.py::test_process_env_create","tests/test_virtualenv.py::test_condaenv_constructor_defaults","tests/test_virtualenv.py::test_condaenv_constructor_explicit","tests/test_virtualenv.py::test_condaenv_create","tests/test_virtualenv.py::test_condaenv_create_with_params","tests/test_virtualenv.py::test_condaenv_create_interpreter","tests/test_virtualenv.py::test_condaenv_bin_windows","tests/test_virtualenv.py::test_condaenv_","tests/test_virtualenv.py::test_constructor_defaults","tests/test_virtualenv.py::test_constructor_explicit","tests/test_virtualenv.py::test_env","tests/test_virtualenv.py::test_blacklisted_env","tests/test_virtualenv.py::test__clean_location","tests/test_virtualenv.py::test_bin_paths","tests/test_virtualenv.py::test_bin_windows","tests/test_virtualenv.py::test_create","tests/test_virtualenv.py::test_create_reuse_environment","tests/test_virtualenv.py::test_create_reuse_environment_with_different_interpreter","tests/test_virtualenv.py::test_create_reuse_stale_venv_environment","tests/test_virtualenv.py::test_create_reuse_stale_virtualenv_environment","tests/test_virtualenv.py::test_create_reuse_venv_environment","tests/test_virtualenv.py::test_create_reuse_oldstyle_virtualenv_environment","tests/test_virtualenv.py::test_create_venv_backend","tests/test_virtualenv.py::test_create_interpreter","tests/test_virtualenv.py::test__resolved_interpreter_none","tests/test_virtualenv.py::test__resolved_interpreter_numerical_non_windows[3-python3]","tests/test_virtualenv.py::test__resolved_interpreter_numerical_non_windows[3.6-python3.6]","tests/test_virtualenv.py::test__resolved_interpreter_numerical_non_windows[3.6.2-python3.6]","tests/test_virtualenv.py::test__resolved_interpreter_numerical_non_windows[3.10-python3.10]","tests/test_virtualenv.py::test__resolved_interpreter_numerical_non_windows[2.7.15-python2.7]","tests/test_virtualenv.py::test__resolved_interpreter_invalid_numerical_id[2.]","tests/test_virtualenv.py::test__resolved_interpreter_invalid_numerical_id[2.7.]","tests/test_virtualenv.py::test__resolved_interpreter_32_bit_non_windows","tests/test_virtualenv.py::test__resolved_interpreter_non_windows","tests/test_virtualenv.py::test__resolved_interpreter_windows_full_path","tests/test_virtualenv.py::test__resolved_interpreter_windows_pyexe[3.7-c:\\\\python37-x64\\\\python.exe]","tests/test_virtualenv.py::test__resolved_interpreter_windows_pyexe[python3.6-c:\\\\python36-x64\\\\python.exe]","tests/test_virtualenv.py::test__resolved_interpreter_windows_pyexe[2.7-32-c:\\\\python27\\\\python.exe]","tests/test_virtualenv.py::test__resolved_interpreter_windows_pyexe_fails","tests/test_virtualenv.py::test__resolved_interpreter_windows_path_and_version","tests/test_virtualenv.py::test__resolved_interpreter_windows_path_and_version_fails[3.7.3\\\\n-c:\\\\python37-x64\\\\python.exe-2.7]","tests/test_virtualenv.py::test__resolved_interpreter_windows_path_and_version_fails[3.7.3\\\\n-c:\\\\python37-x64\\\\python.exe-python3.7]","tests/test_virtualenv.py::test__resolved_interpreter_windows_path_and_version_fails[3.7.3\\\\n-c:\\\\python37-x64\\\\python.exe-goofy]","tests/test_virtualenv.py::test__resolved_interpreter_windows_path_and_version_fails[3.7.3\\\\n-None-2.7]","tests/test_virtualenv.py::test__resolved_interpreter_windows_path_and_version_fails[3.7.3\\\\n-None-python3.7]","tests/test_virtualenv.py::test__resolved_interpreter_windows_path_and_version_fails[3.7.3\\\\n-None-goofy]","tests/test_virtualenv.py::test__resolved_interpreter_windows_path_and_version_fails[RAISE_ERROR-c:\\\\python37-x64\\\\python.exe-2.7]","tests/test_virtualenv.py::test__resolved_interpreter_windows_path_and_version_fails[RAISE_ERROR-c:\\\\python37-x64\\\\python.exe-python3.7]","tests/test_virtualenv.py::test__resolved_interpreter_windows_path_and_version_fails[RAISE_ERROR-c:\\\\python37-x64\\\\python.exe-goofy]","tests/test_virtualenv.py::test__resolved_interpreter_windows_path_and_version_fails[RAISE_ERROR-None-2.7]","tests/test_virtualenv.py::test__resolved_interpreter_windows_path_and_version_fails[RAISE_ERROR-None-python3.7]","tests/test_virtualenv.py::test__resolved_interpreter_windows_path_and_version_fails[RAISE_ERROR-None-goofy]","tests/test_virtualenv.py::test__resolved_interpreter_not_found","tests/test_virtualenv.py::test__resolved_interpreter_nonstandard","tests/test_virtualenv.py::test__resolved_interpreter_cache_result","tests/test_virtualenv.py::test__resolved_interpreter_cache_failure"],"failed":["tests/test_virtualenv.py::test_conda_env_create_verbose"],"errors":[],"skipped":["tests/test_virtualenv.py::test_create_reuse_python2_environment"],"collection_errors":[],"failure_text":{"tests/test_virtualenv.py::test_conda_env_create_verbose":"assert False\nE   assert False"}},"diff":null,"patch_sha256":null,"dropped_paths":[],"snapshot_sha":null}
{"receipt_id":"base-4","seq":4,"branch_id":"base","kind":"command","cmd":"/opt/receipts-a32d6cd57e114ee9b5fa911aeead284b/bin/busybox mkdir -p /opt/receipts/reports && python -I /opt/receipts-a32d6cd57e114ee9b5fa911aeead284b/receipts_pytest.py --no-header -rA --tb=line --color=no -p no:cacheprovider -W ignore::DeprecationWarning tests/test_virtualenv.py -o junit_family=xunit1 -p no:cacheprovider -rA --continue-on-collection-errors --junitxml=/opt/receipts/reports/base-4.xml","path":null,"exit_code":1,"stdout_tail":"============================= test session starts ==============================\ncollected 59 items\n\ntests/test_virtualenv.py .......F................s...................... [ 79%]\n............                                                             [100%]\n\n=================================== FAILURES ===================================\nE   assert False\n/nox/tests/test_virtualenv.py:227: assert False\n==================================== PASSES ====================================\n------------- generated xml file: /opt/receipts/reports/base-4.xml -------------\n=========================== short test summary info ============================\nPASSED tests/test_virtualenv.py::test_process_env_constructor\nPASSED tests/test_virtualenv.py::test_process_env_create\nPASSED tests/test_virtualenv.py::test_condaenv_constructor_defaults\nPASSED tests/test_virtualenv.py::test_condaenv_constructor_explicit\nPASSED tests/test_virtualenv.py::test_condaenv_create\nPASSED tests/test_virtualenv.py::test_condaenv_create_with_params\nPASSED tests/test_virtualenv.py::test_condaenv_create_interpreter\nPASSED tests/test_virtualenv.py::test_condaenv_bin_windows\nPASSED tests/test_virtualenv.py::test_condaenv_\nPASSED tests/test_virtualenv.py::test_constructor_defaults\nPASSED tests/test_virtualenv.py::test_constructor_explicit\nPASSED tests/test_virtualenv.py::test_env\nPASSED tests/test_virtualenv.py::test_blacklisted_env\nPASSED tests/test_virtualenv.py::test__clean_location\nPASSED tests/test_virtualenv.py::test_bin_paths\nPASSED tests/test_virtualenv.py::test_bin_windows\nPASSED tests/test_virtualenv.py::test_create\nPASSED tests/test_virtualenv.py::test_create_reuse_environment\nPASSED tests/test_virtualenv.py::test_create_reuse_environment_with_different_interpreter\nPASSED tests/test_virtualenv.py::test_create_reuse_stale_venv_environment\nPASSED tests/test_virtualenv.py::test_create_reuse_stale_virtualenv_environment\nPASSED tests/test_virtualenv.py::test_create_reuse_venv_environment\nPASSED tests/test_virtualenv.py::test_create_reuse_oldstyle_virtualenv_environment\nPASSED tests/test_virtualenv.py::test_create_venv_backend\nPASSED tests/test_virtualenv.py::test_create_interpreter\nPASSED tests/test_virtualenv.py::test__resolved_interpreter_none\nPASSED tests/test_virtualenv.py::test__resolved_interpreter_numerical_non_windows[3-python3]\nPASSED tests/test_virtualenv.py::test__resolved_interpreter_numerical_non_windows[3.6-python3.6]\nPASSED tests/test_virtualenv.py::test__resolved_interpreter_numerical_non_windows[3.6.2-python3.6]\nPASSED tests/test_virtualenv.py::test__resolved_interpreter_numerical_non_windows[3.10-python3.10]\nPASSED tests/test_virtualenv.py::test__resolved_interpreter_numerical_non_windows[2.7.15-python2.7]\nPASSED tests/test_virtualenv.py::test__resolved_interpreter_invalid_numerical_id[2.]\nPASSED tests/test_virtualenv.py::test__resolved_interpreter_invalid_numerical_id[2.7.]\nPASSED tests/test_virtualenv.py::test__resolved_interpreter_32_bit_non_windows\nPASSED tests/test_virtualenv.py::test__resolved_interpreter_non_windows\nPASSED tests/test_virtualenv.py::test__resolved_interpreter_windows_full_path\nPASSED tests/test_virtualenv.py::test__resolved_interpreter_windows_pyexe[3.7-c:\\\\python37-x64\\\\python.exe]\nPASSED tests/test_virtualenv.py::test__resolved_interpreter_windows_pyexe[python3.6-c:\\\\python36-x64\\\\python.exe]\nPASSED tests/test_virtualenv.py::test__resolved_interpreter_windows_pyexe[2.7-32-c:\\\\python27\\\\python.exe]\nPASSED tests/test_virtualenv.py::test__resolved_interpreter_windows_pyexe_fails\nPASSED tests/test_virtualenv.py::test__resolved_interpreter_windows_path_and_version\nPASSED tests/test_virtualenv.py::test__resolved_interpreter_windows_path_and_version_fails[3.7.3\\\\n-c:\\\\python37-x64\\\\python.exe-2.7]\nPASSED tests/test_virtualenv.py::test__resolved_interpreter_windows_path_and_version_fails[3.7.3\\\\n-c:\\\\python37-x64\\\\python.exe-python3.7]\nPASSED tests/test_virtualenv.py::test__resolved_interpreter_windows_path_and_version_fails[3.7.3\\\\n-c:\\\\python37-x64\\\\python.exe-goofy]\nPASSED tests/test_virtualenv.py::test__resolved_interpreter_windows_path_and_version_fails[3.7.3\\\\n-None-2.7]\nPASSED tests/test_virtualenv.py::test__resolved_interpreter_windows_path_and_version_fails[3.7.3\\\\n-None-python3.7]\nPASSED tests/test_virtualenv.py::test__resolved_interpreter_windows_path_and_version_fails[3.7.3\\\\n-None-goofy]\nPASSED tests/test_virtualenv.py::test__resolved_interpreter_windows_path_and_version_fails[RAISE_ERROR-c:\\\\python37-x64\\\\python.exe-2.7]\nPASSED tests/test_virtualenv.py::test__resolved_interpreter_windows_path_and_version_fails[RAISE_ERROR-c:\\\\python37-x64\\\\python.exe-python3.7]\nPASSED tests/test_virtualenv.py::test__resolved_interpreter_windows_path_and_version_fails[RAISE_ERROR-c:\\\\python37-x64\\\\python.exe-goofy]\nPASSED tests/test_virtualenv.py::test__resolved_interpreter_windows_path_and_version_fails[RAISE_ERROR-None-2.7]\nPASSED tests/test_virtualenv.py::test__resolved_interpreter_windows_path_and_version_fails[RAISE_ERROR-None-python3.7]\nPASSED tests/test_virtualenv.py::test__resolved_interpreter_windows_path_and_version_fails[RAISE_ERROR-None-goofy]\nPASSED tests/test_virtualenv.py::test__resolved_interpreter_not_found\nPASSED tests/test_virtualenv.py::test__resolved_interpreter_nonstandard\nPASSED tests/test_virtualenv.py::test__resolved_interpreter_cache_result\nPASSED tests/test_virtualenv.py::test__resolved_interpreter_cache_failure\nSKIPPED [1] tests/test_virtualenv.py:482: Requires Python 2.7 installation.\nFAILED tests/test_virtualenv.py::test_conda_env_create_verbose - assert False\n=================== 1 failed, 57 passed, 1 skipped in 46.10s ===================\n","stderr_tail":"","stdout_sha256":"12f2ec59476f18dbe1fbf72e271f9c277c60fe4cd85b70eaa32ad9a595198c80","log_path":"~/dev/nebius-hackathon/pilot/v2-P/theacodes__nox-466/runs/pilot-theacodes__nox-466-7cd2d00d26/logs/base/base-4.log","tree_digest":"92513535d99d1b0a060944a06810a73a001f6a5a8aa4bea8dab3f3d1053c540a","tree_download_s":4.107539292192087,"started_at":"2026-10-03T18:02:42.317511Z","duration_s":25.922101,"timed_out":false,"image_before":"b3ba6b7d-3992-4521-8cdf-65decb90a586","image_after":"4632d43b-f1be-4e64-aaa5-258a7fc41a1a","junit":{"passed":["tests/test_virtualenv.py::test_process_env_constructor","tests/test_virtualenv.py::test_process_env_create","tests/test_virtualenv.py::test_condaenv_constructor_defaults","tests/test_virtualenv.py::test_condaenv_constructor_explicit","tests/test_virtualenv.py::test_condaenv_create","tests/test_virtualenv.py::test_condaenv_create_with_params","tests/test_virtualenv.py::test_condaenv_create_interpreter","tests/test_virtualenv.py::test_condaenv_bin_windows","tests/test_virtualenv.py::test_condaenv_","tests/test_virtualenv.py::test_constructor_defaults","tests/test_virtualenv.py::test_constructor_explicit","tests/test_virtualenv.py::test_env","tests/test_virtualenv.py::test_blacklisted_env","tests/test_virtualenv.py::test__clean_location","tests/test_virtualenv.py::test_bin_paths","tests/test_virtualenv.py::test_bin_windows","tests/test_virtualenv.py::test_create","tests/test_virtualenv.py::test_create_reuse_environment","tests/test_virtualenv.py::test_create_reuse_environment_with_different_interpreter","tests/test_virtualenv.py::test_create_reuse_stale_venv_environment","tests/test_virtualenv.py::test_create_reuse_stale_virtualenv_environment","tests/test_virtualenv.py::test_create_reuse_venv_environment","tests/test_virtualenv.py::test_create_reuse_oldstyle_virtualenv_environment","tests/test_virtualenv.py::test_create_venv_backend","tests/test_virtualenv.py::test_create_interpreter","tests/test_virtualenv.py::test__resolved_interpreter_none","tests/test_virtualenv.py::test__resolved_interpreter_numerical_non_windows[3-python3]","tests/test_virtualenv.py::test__resolved_interpreter_numerical_non_windows[3.6-python3.6]","tests/test_virtualenv.py::test__resolved_interpreter_numerical_non_windows[3.6.2-python3.6]","tests/test_virtualenv.py::test__resolved_interpreter_numerical_non_windows[3.10-python3.10]","tests/test_virtualenv.py::test__resolved_interpreter_numerical_non_windows[2.7.15-python2.7]","tests/test_virtualenv.py::test__resolved_interpreter_invalid_numerical_id[2.]","tests/test_virtualenv.py::test__resolved_interpreter_invalid_numerical_id[2.7.]","tests/test_virtualenv.py::test__resolved_interpreter_32_bit_non_windows","tests/test_virtualenv.py::test__resolved_interpreter_non_windows","tests/test_virtualenv.py::test__resolved_interpreter_windows_full_path","tests/test_virtualenv.py::test__resolved_interpreter_windows_pyexe[3.7-c:\\\\python37-x64\\\\python.exe]","tests/test_virtualenv.py::test__resolved_interpreter_windows_pyexe[python3.6-c:\\\\python36-x64\\\\python.exe]","tests/test_virtualenv.py::test__resolved_interpreter_windows_pyexe[2.7-32-c:\\\\python27\\\\python.exe]","tests/test_virtualenv.py::test__resolved_interpreter_windows_pyexe_fails","tests/test_virtualenv.py::test__resolved_interpreter_windows_path_and_version","tests/test_virtualenv.py::test__resolved_interpreter_windows_path_and_version_fails[3.7.3\\\\n-c:\\\\python37-x64\\\\python.exe-2.7]","tests/test_virtualenv.py::test__resolved_interpreter_windows_path_and_version_fails[3.7.3\\\\n-c:\\\\python37-x64\\\\python.exe-python3.7]","tests/test_virtualenv.py::test__resolved_interpreter_windows_path_and_version_fails[3.7.3\\\\n-c:\\\\python37-x64\\\\python.exe-goofy]","tests/test_virtualenv.py::test__resolved_interpreter_windows_path_and_version_fails[3.7.3\\\\n-None-2.7]","tests/test_virtualenv.py::test__resolved_interpreter_windows_path_and_version_fails[3.7.3\\\\n-None-python3.7]","tests/test_virtualenv.py::test__resolved_interpreter_windows_path_and_version_fails[3.7.3\\\\n-None-goofy]","tests/test_virtualenv.py::test__resolved_interpreter_windows_path_and_version_fails[RAISE_ERROR-c:\\\\python37-x64\\\\python.exe-2.7]","tests/test_virtualenv.py::test__resolved_interpreter_windows_path_and_version_fails[RAISE_ERROR-c:\\\\python37-x64\\\\python.exe-python3.7]","tests/test_virtualenv.py::test__resolved_interpreter_windows_path_and_version_fails[RAISE_ERROR-c:\\\\python37-x64\\\\python.exe-goofy]","tests/test_virtualenv.py::test__resolved_interpreter_windows_path_and_version_fails[RAISE_ERROR-None-2.7]","tests/test_virtualenv.py::test__resolved_interpreter_windows_path_and_version_fails[RAISE_ERROR-None-python3.7]","tests/test_virtualenv.py::test__resolved_interpreter_windows_path_and_version_fails[RAISE_ERROR-None-goofy]","tests/test_virtualenv.py::test__resolved_interpreter_not_found","tests/test_virtualenv.py::test__resolved_interpreter_nonstandard","tests/test_virtualenv.py::test__resolved_interpreter_cache_result","tests/test_virtualenv.py::test__resolved_interpreter_cache_failure"],"failed":["tests/test_virtualenv.py::test_conda_env_create_verbose"],"errors":[],"skipped":["tests/test_virtualenv.py::test_create_reuse_python2_environment"],"collection_errors":[],"failure_text":{"tests/test_virtualenv.py::test_conda_env_create_verbose":"assert False\nE   assert False"}},"diff":null,"patch_sha256":null,"dropped_paths":[],"snapshot_sha":null}
{"receipt_id":"base-5","seq":5,"branch_id":"base","kind":"command","cmd":"python -c 'import base64\nimport hashlib\nimport json\nimport os\nfrom pathlib import Path\n\npayload = json.loads(base64.b64decode('\"'\"'eyJ0ZXN0X2ZpbGVzIjpbInRlc3RzL3Rlc3RfdmlydHVhbGVudi5weSJdLCJ0ZXN0X3Jvb3RzIjpbInRlc3RzIl0sImNvbmZpZ19uYW1lcyI6WyIucHl0ZXN0LnRvbWwiLCJjb25mdGVzdC5weSIsInB5cHJvamVjdC50b21sIiwicHl0ZXN0LmluaSIsInB5dGVzdC50b21sIiwic2V0dXAuY2ZnIiwidG94LmluaSJdfQ=='\"'\"'))\nexcluded = {'\"'\"'.git'\"'\"', '\"'\"'.venv'\"'\"', '\"'\"'__pycache__'\"'\"', '\"'\"'site-packages'\"'\"'}\n\ndef digest(path):\n    return hashlib.sha256(path.read_bytes()).hexdigest()\n\ntests = {}\nfor item in payload['\"'\"'test_files'\"'\"']:\n    path = Path(item)\n    if path.is_file():\n        tests[path.as_posix()] = digest(path)\nfor item in payload['\"'\"'test_roots'\"'\"']:\n    root = Path(item)\n    if not root.is_dir():\n        continue\n    for directory, names, filenames in os.walk(root, followlinks=False):\n        names[:] = sorted(name for name in names if name not in excluded)\n        for filename in sorted(filenames):\n            path = Path(directory, filename)\n            if path.is_file():\n                tests[path.as_posix()] = digest(path)\n\nconfigs = {}\nfor directory, names, filenames in os.walk('\"'\"'.'\"'\"', followlinks=False):\n    names[:] = sorted(name for name in names if name not in excluded)\n    for filename in sorted(filenames):\n        if filename not in payload['\"'\"'config_names'\"'\"']:\n            continue\n        path = Path(directory, filename)\n        rendered = path.as_posix()\n        rendered = rendered[2:] if rendered.startswith('\"'\"'./'\"'\"') else rendered\n        configs[rendered] = digest(path)\n\nprint(json.dumps({'\"'\"'test_digests'\"'\"': tests, '\"'\"'pytest_config_digests'\"'\"': configs}, sort_keys=True))\n'","path":null,"exit_code":0,"stdout_tail":"{\"pytest_config_digests\": {\"pyproject.toml\": \"f9f51d3d9e3b5a4f7751faf018ade71f8b1201e4e3bb718bf5a65ef568210ebd\", \"setup.cfg\": \"12dcc56c228b46e54f3e485ed8f44146d5f68b848ceb57c6f4ee0ca76c17f269\"}, \"test_digests\": {\"tests/resources/noxfile.py\": \"7f5419a953961dcc240fb28e49dbf37d22d0f8d1cb5ff6e91d60db1db46e8e5c\", \"tests/resources/noxfile_nested.py\": \"312512837b5f7bc35d1be96b79ad6eb3d576537e83c91f60208b2afcbfc5e605\", \"tests/resources/noxfile_normalization.py\": \"0c7f827916dfc2ac23654474890915f1a1d86d84644631bc10a617a8b49a6598\", \"tests/resources/noxfile_options.py\": \"877407651771b5aae229c6c9491304bf11f527f6d37782c99268f6c895c73a0c\", \"tests/resources/noxfile_options_pythons.py\": \"911c51fb2cc76bfc24d27021ae44b243c7f0af9cef37d6dafe0f41760d6c69d6\", \"tests/resources/noxfile_pythons.py\": \"8d1f3b6c06389f9e528d3f4e234bf887252bf49426d90d2269b033088749384b\", \"tests/resources/noxfile_spaces.py\": \"a9c29abe315c1049381f9a34ded70bd654c6e67cc213a44fe9eafc89d4da8fdc\", \"tests/test__option_set.py\": \"bd75d3cb08a4aea7930abaa3458a71265dd2b2e491260558ff924e15b527a0f3\", \"tests/test__parametrize.py\": \"b9b462e7b66365efee43fdea09e9038500824433be243d49be96a7bab5436f4e\", \"tests/test__version.py\": \"1c688767b7815c1eb3bcf00dc0dbd6909c44c6835280348d891a763b5f776dd3\", \"tests/test_command.py\": \"00e88063bc8b74a15245af81ea6793e5a1ea93e8d7dbcd7c2dc098292138e115\", \"tests/test_logger.py\": \"4c135fa9af6234deb9f687e9882d90458e5fc98c0b43616dfd44eb52b078dc6c\", \"tests/test_main.py\": \"ea217c5330abf7aa70f452b7f2428e2f523526cef02c89a135178fdc47c53a2b\", \"tests/test_manifest.py\": \"c85f5c9f92ffe96aa56fcca0bdd23c61f9291d9eaf6bcd2be190a323997a89d8\", \"tests/test_registry.py\": \"1a86869256510ab4654779f8aeb42041a3e87e1f70684637628da8f8fb9aa5de\", \"tests/test_sessions.py\": \"2c5fb90989c646777541a5b37cfdf98eca29b9b77b07ba6ef968da86095e3e24\", \"tests/test_tasks.py\": \"125698d434e9db36ab6fc7ad82c27db2c05c09c0437b9227cccf1e59b899d097\", \"tests/test_tox_to_nox.py\": \"c3592eb6989618acdaec18c73bd27494b6c756a08ba71adbb3d14d77ef762902\", \"tests/test_virtualenv.py\": \"1e56868bf83eb38e5c07f8019fbb12a3529a94ce52998f4f4337b1d5693f32cd\", \"tests/test_workflow.py\": \"b034d26463ac3d4ef54040fabf923f1086d85688454b59abe3516bfe6c466939\"}}\n","stderr_tail":"","stdout_sha256":"c8ef94192f4213e28df8a1dd9831f63b6471b55d067fabdb0906200be9ae0141","log_path":"~/dev/nebius-hackathon/pilot/v2-P/theacodes__nox-466/runs/pilot-theacodes__nox-466-7cd2d00d26/logs/base/base-5.log","tree_digest":null,"tree_download_s":null,"started_at":"2026-10-03T18:03:53.959326Z","duration_s":0.033252000000000004,"timed_out":false,"image_before":"4632d43b-f1be-4e64-aaa5-258a7fc41a1a","image_after":"e1c95f89-bc59-4e5b-a386-c252437d82b8","junit":null,"diff":null,"patch_sha256":null,"dropped_paths":[],"snapshot_sha":null}
{"receipt_id":"base-6","seq":6,"branch_id":"base","kind":"command","cmd":"python -c '# Runs inside the task sandbox, so it must work on Python 3.7.\npackages = set()\ntry:\n    import importlib.metadata as metadata\nexcept ImportError:\n    import pkg_resources\n\n    for dist in pkg_resources.working_set:\n        packages.add(dist.project_name + \"==\" + dist.version)\nelse:\n    for distribution in metadata.distributions():\n        name = distribution.metadata.get(\"Name\")\n        if name:\n            packages.add(name + \"==\" + distribution.version)\nprint(\"\\n\".join(sorted(packages, key=str.casefold)))\n'","path":null,"exit_code":0,"stdout_tail":"alabaster==1.0.0\nanyio==4.12.1\nargcomplete==1.12.3\nbabel==2.18.0\nblinker==1.9.0\ncachetools==7.0.1\ncertifi==2026.1.4\nchardet==5.2.0\ncharset-normalizer==3.4.4\nclick==8.3.1\ncolorama==0.4.6\ncolorlog==6.10.1\ncommonmark==0.9.1\ncoverage==7.13.4\ndistlib==0.4.0\ndocutils==0.21.2\nexceptiongroup==1.3.1\nfilelock==3.24.3\nFlask==3.1.3\nh11==0.16.0\nidna==3.11\nimagesize==1.4.1\niniconfig==2.3.0\nitsdangerous==2.2.0\nJinja2==3.1.6\nMarkupSafe==3.0.3\nnox==2021.6.12\npackaging==26.0\npip==25.3\nplatformdirs==4.9.2\npluggy==1.6.0\npy==1.11.0\nPygments==2.19.2\npyproject-api==1.10.0\npytest-cov==7.0.0\npytest==9.0.2\nrecommonmark==0.7.1\nrequests==2.32.5\nsetuptools==80.9.0\nsnowballstemmer==3.0.1\nsphinx-autobuild==2024.10.3\nSphinx==8.1.3\nsphinxcontrib-applehelp==2.0.0\nsphinxcontrib-devhelp==2.0.0\nsphinxcontrib-htmlhelp==2.1.0\nsphinxcontrib-jsmath==1.0.1\nsphinxcontrib-qthelp==2.0.0\nsphinxcontrib-serializinghtml==2.0.0\nstarlette==0.52.1\ntomli==2.4.0\ntox==4.44.0\ntyping_extensions==4.15.0\nurllib3==2.6.3\nuvicorn==0.41.0\nvirtualenv==20.38.0\nwatchfiles==1.1.1\nwebsockets==16.0\nWerkzeug==3.1.6\nwheel==0.45.1\nwitchhazel==2022.9.8\n","stderr_tail":"","stdout_sha256":"865b0cc87c8c4c5380a07c61faecd5883b0e84f0c9427239284b1d36087022a9","log_path":"~/dev/nebius-hackathon/pilot/v2-P/theacodes__nox-466/runs/pilot-theacodes__nox-466-7cd2d00d26/logs/base/base-6.log","tree_digest":null,"tree_download_s":null,"started_at":"2026-10-03T18:03:55.799916Z","duration_s":0.069678,"timed_out":false,"image_before":"e1c95f89-bc59-4e5b-a386-c252437d82b8","image_after":"eed2ff89-c216-4cbe-a5ef-c3b50ab6d779","junit":null,"diff":null,"patch_sha256":null,"dropped_paths":[],"snapshot_sha":null}
{"receipt_id":"base-7","seq":7,"branch_id":"base","kind":"command","cmd":"git add -A && git -c user.name=receipts -c user.email=receipts@localhost commit -q --allow-empty -m \"receipts snapshot\" && git rev-parse HEAD","path":null,"exit_code":0,"stdout_tail":"30a0d6663df6baf8db134360a9f33a90bb0f3fdc\n","stderr_tail":"","stdout_sha256":"c4ae797435be3a5251e42a937c69be960c57b9aab1ee8ee9f352e216898e9cb2","log_path":"~/dev/nebius-hackathon/pilot/v2-P/theacodes__nox-466/runs/pilot-theacodes__nox-466-7cd2d00d26/logs/base/base-7.log","tree_digest":null,"tree_download_s":null,"started_at":"2026-10-03T18:03:57.605366Z","duration_s":0.027697,"timed_out":false,"image_before":"eed2ff89-c216-4cbe-a5ef-c3b50ab6d779","image_after":"f4837f74-1ec3-454d-8b8a-aa65dbf19887","junit":null,"diff":null,"patch_sha256":null,"dropped_paths":[],"snapshot_sha":"30a0d6663df6baf8db134360a9f33a90bb0f3fdc"}
{"receipt_id":"base-8","seq":8,"branch_id":"base","kind":"command","cmd":"git -c core.quotePath=false ls-tree -z --name-only 30a0d6663df6baf8db134360a9f33a90bb0f3fdc","path":null,"exit_code":0,"stdout_tail":".coveragerc\u0000.flake8\u0000.github\u0000.gitignore\u0000.isort.cfg\u0000.readthedocs.yml\u0000CHANGELOG.md\u0000CODE_OF_CONDUCT.md\u0000CONTRIBUTING.md\u0000LICENSE\u0000MANIFEST.in\u0000README.rst\u0000docs\u0000nox\u0000noxfile.py\u0000pyproject.toml\u0000requirements-conda-test.txt\u0000requirements-test.txt\u0000setup.cfg\u0000tests\u0000","stderr_tail":"","stdout_sha256":"48e0f1a9755fe1fdcbebbb5351d817626610c41d3b5ab37b560ee03786b5fa12","log_path":"~/dev/nebius-hackathon/pilot/v2-P/theacodes__nox-466/runs/pilot-theacodes__nox-466-7cd2d00d26/logs/base/base-8.log","tree_digest":null,"tree_download_s":null,"started_at":"2026-10-03T18:03:59.467839Z","duration_s":0.004168,"timed_out":false,"image_before":"f4837f74-1ec3-454d-8b8a-aa65dbf19887","image_after":"d8fe8ab2-179b-4a81-ab07-b5a5e501da02","junit":null,"diff":null,"patch_sha256":null,"dropped_paths":[],"snapshot_sha":null}
{"receipt_id":"base-9","seq":9,"branch_id":"base","kind":"command","cmd":"git -c core.quotePath=false ls-tree -z --name-only 30a0d6663df6baf8db134360a9f33a90bb0f3fdc:src","path":null,"exit_code":128,"stdout_tail":"","stderr_tail":"fatal: Not a valid object name 30a0d6663df6baf8db134360a9f33a90bb0f3fdc:src\n","stdout_sha256":"ef1bd4a7c3611e1a55a27a965d10c4630ac4a829eedb08c43e16e4fcdd666464","log_path":"~/dev/nebius-hackathon/pilot/v2-P/theacodes__nox-466/runs/pilot-theacodes__nox-466-7cd2d00d26/logs/base/base-9.log","tree_digest":null,"tree_download_s":null,"started_at":"2026-10-03T18:04:01.267845Z","duration_s":0.004553,"timed_out":false,"image_before":"d8fe8ab2-179b-4a81-ab07-b5a5e501da02","image_after":"d15ea7d9-3bfa-4ae4-b59f-d000fd5dffb2","junit":null,"diff":null,"patch_sha256":null,"dropped_paths":[],"snapshot_sha":null}
