{"receipt_id":"agent1-1","seq":1,"branch_id":"agent1","kind":"command","cmd":"git ls-files -z","path":null,"exit_code":0,"stdout_tail":".coveragerc\u0000.flake8\u0000.github/FUNDING.yml\u0000.github/ISSUE_TEMPLATE/bug.md\u0000.github/ISSUE_TEMPLATE/feature_request.md\u0000.github/workflows/ci.yml\u0000.gitignore\u0000.isort.cfg\u0000.readthedocs.yml\u0000CHANGELOG.md\u0000CODE_OF_CONDUCT.md\u0000CONTRIBUTING.md\u0000LICENSE\u0000MANIFEST.in\u0000README.rst\u0000docs/CHANGELOG.md\u0000docs/CONTRIBUTING.md\u0000docs/Makefile\u0000docs/_static/alice-full.png\u0000docs/_static/alice.gif\u0000docs/_static/alice.png\u0000docs/_static/custom.css\u0000docs/conf.py\u0000docs/config.rst\u0000docs/index.rst\u0000docs/tutorial.rst\u0000docs/usage.rst\u0000nox/__init__.py\u0000nox/__main__.py\u0000nox/_decorators.py\u0000nox/_option_set.py\u0000nox/_options.py\u0000nox/_parametrize.py\u0000nox/_typing.py\u0000nox/_version.py\u0000nox/command.py\u0000nox/logger.py\u0000nox/manifest.py\u0000nox/popen.py\u0000nox/py.typed\u0000nox/registry.py\u0000nox/sessions.py\u0000nox/tasks.py\u0000nox/tox_to_nox.jinja2\u0000nox/tox_to_nox.py\u0000nox/virtualenv.py\u0000nox/workflow.py\u0000noxfile.py\u0000pyproject.toml\u0000requirements-conda-test.txt\u0000requirements-test.txt\u0000setup.cfg\u0000tests/resources/noxfile.py\u0000tests/resources/noxfile_nested.py\u0000tests/resources/noxfile_normalization.py\u0000tests/resources/noxfile_options.py\u0000tests/resources/noxfile_options_pythons.py\u0000tests/resources/noxfile_pythons.py\u0000tests/resources/noxfile_spaces.py\u0000tests/test__option_set.py\u0000tests/test__parametrize.py\u0000tests/test__version.py\u0000tests/test_command.py\u0000tests/test_logger.py\u0000tests/test_main.py\u0000tests/test_manifest.py\u0000tests/test_registry.py\u0000tests/test_sessions.py\u0000tests/test_tasks.py\u0000tests/test_tox_to_nox.py\u0000tests/test_virtualenv.py\u0000tests/test_workflow.py\u0000","stderr_tail":"","stdout_sha256":"c46c851e4545232007a57344d534f869e8fd17a25a684d2233afe18388f35e97","log_path":"~/dev/nebius-hackathon/pilot/v2-P/theacodes__nox-466/runs/pilot-theacodes__nox-466-7cd2d00d26/logs/agent1/agent1-1.log","tree_digest":null,"tree_download_s":null,"started_at":"2026-10-03T18:04:03.212947Z","duration_s":0.00346,"timed_out":false,"image_before":"d15ea7d9-3bfa-4ae4-b59f-d000fd5dffb2","image_after":"ce0a33f9-7b53-45af-bf7d-5c433bc26889","junit":null,"diff":null,"patch_sha256":null,"dropped_paths":[],"snapshot_sha":null}
{"receipt_id":"agent1-2","seq":2,"branch_id":"agent1","kind":"command","cmd":"grep -n \"import.*nox\" nox/virtualenv.py","path":null,"exit_code":0,"stdout_tail":"25:import nox.command\n","stderr_tail":"","stdout_sha256":"6e7d8ca4fcd416f10a925eef5f19393726ba04e4cbc094714067021eee73e0f1","log_path":"~/dev/nebius-hackathon/pilot/v2-P/theacodes__nox-466/runs/pilot-theacodes__nox-466-7cd2d00d26/logs/agent1/agent1-2.log","tree_digest":null,"tree_download_s":null,"started_at":"2026-10-03T18:04:11.634221Z","duration_s":0.003293,"timed_out":false,"image_before":"ce0a33f9-7b53-45af-bf7d-5c433bc26889","image_after":"884a25ee-9591-4dea-afee-fa32eaa9493f","junit":null,"diff":null,"patch_sha256":null,"dropped_paths":[],"snapshot_sha":null}
{"receipt_id":"agent1-3","seq":3,"branch_id":"agent1","kind":"command","cmd":"grep -rn \"nox.options.verbose\\|options.verbose\" nox/ | head -5","path":null,"exit_code":0,"stdout_tail":"","stderr_tail":"","stdout_sha256":"e3b0c44298fc1c149afbf4c8996fb92427ae41e4649b934ca495991b7852b855","log_path":"~/dev/nebius-hackathon/pilot/v2-P/theacodes__nox-466/runs/pilot-theacodes__nox-466-7cd2d00d26/logs/agent1/agent1-3.log","tree_digest":null,"tree_download_s":null,"started_at":"2026-10-03T18:04:14.786128Z","duration_s":0.004938,"timed_out":false,"image_before":"884a25ee-9591-4dea-afee-fa32eaa9493f","image_after":"4b706563-19df-44e2-8e55-a660acb4e433","junit":null,"diff":null,"patch_sha256":null,"dropped_paths":[],"snapshot_sha":null}
{"receipt_id":"agent1-4","seq":4,"branch_id":"agent1","kind":"command","cmd":"grep -rn \"verbose\" nox/ | grep -i option | head -5","path":null,"exit_code":0,"stdout_tail":"nox/_options.py:294:        \"verbose\",\nnox/_options.py:296:        \"--verbose\",\n","stderr_tail":"","stdout_sha256":"7de22b6842f9d391abf70f218ca075a293a2d15282ae619f63431a46836da6af","log_path":"~/dev/nebius-hackathon/pilot/v2-P/theacodes__nox-466/runs/pilot-theacodes__nox-466-7cd2d00d26/logs/agent1/agent1-4.log","tree_digest":null,"tree_download_s":null,"started_at":"2026-10-03T18:04:17.237071Z","duration_s":0.007091999999999999,"timed_out":false,"image_before":"4b706563-19df-44e2-8e55-a660acb4e433","image_after":"17d4453b-f4c4-4e8e-85eb-1626e45dcd2b","junit":null,"diff":null,"patch_sha256":null,"dropped_paths":[],"snapshot_sha":null}
{"receipt_id":"agent1-5","seq":5,"branch_id":"agent1","kind":"command","cmd":"grep -rn \"\\.verbose\" nox/ | head -5","path":null,"exit_code":0,"stdout_tail":"nox/__main__.py:41:        color=args.color, verbose=args.verbose, add_timestamp=args.add_timestamp\n","stderr_tail":"","stdout_sha256":"ac7f0c425099a7dd323469e3a3a83ad94321034b23c2f0ee320c467f47963199","log_path":"~/dev/nebius-hackathon/pilot/v2-P/theacodes__nox-466/runs/pilot-theacodes__nox-466-7cd2d00d26/logs/agent1/agent1-5.log","tree_digest":null,"tree_download_s":null,"started_at":"2026-10-03T18:04:21.336346Z","duration_s":0.005122,"timed_out":false,"image_before":"17d4453b-f4c4-4e8e-85eb-1626e45dcd2b","image_after":"b7950aa2-3d03-41ce-9671-fc0a67d0e6e3","junit":null,"diff":null,"patch_sha256":null,"dropped_paths":[],"snapshot_sha":null}
{"receipt_id":"agent1-6","seq":6,"branch_id":"agent1","kind":"command","cmd":"grep -rn \"nox.options\" nox/ | head -5","path":null,"exit_code":0,"stdout_tail":"nox/_option_set.py:129:        nox.options.thing_a = True\nnox/_option_set.py:140:        nox.options.thing_a = True\nnox/_options.py:482:By setting properties on ``nox.options`` you can specify command line\nnox/tasks.py:85:    \"\"\"Merges any modifications made to ``nox.options`` by the Noxfile module\nnox/tasks.py:92:    _options.options.merge_namespaces(global_config, nox.options)\n","stderr_tail":"","stdout_sha256":"a92bb3e251c443bc90eb6aaf65174c9a0bb9ae74a84d99002c7cfcc0d2e92b77","log_path":"~/dev/nebius-hackathon/pilot/v2-P/theacodes__nox-466/runs/pilot-theacodes__nox-466-7cd2d00d26/logs/agent1/agent1-6.log","tree_digest":null,"tree_download_s":null,"started_at":"2026-10-03T18:04:23.463282Z","duration_s":0.0047989999999999994,"timed_out":false,"image_before":"b7950aa2-3d03-41ce-9671-fc0a67d0e6e3","image_after":"cb7ebef6-0f68-480e-83f4-a6ced90dbaf4","junit":null,"diff":null,"patch_sha256":null,"dropped_paths":[],"snapshot_sha":null}
{"receipt_id":"agent1-7","seq":7,"branch_id":"agent1","kind":"write","cmd":"/opt/receipts-19899c02f186472796e04bd775059c30/bin/busybox sh -c 'mkdir -p /nox/nox && cp /opt/receipts-19899c02f186472796e04bd775059c30/incoming/0997b26fbddfce418ebfea349ddd3b41ecd0278c176c584e8b0aaf225f60c78e /nox/nox/virtualenv.py'","path":"nox/virtualenv.py","exit_code":0,"stdout_tail":"","stderr_tail":"","stdout_sha256":"0997b26fbddfce418ebfea349ddd3b41ecd0278c176c584e8b0aaf225f60c78e","log_path":"~/dev/nebius-hackathon/pilot/v2-P/theacodes__nox-466/runs/pilot-theacodes__nox-466-7cd2d00d26/logs/agent1/agent1-7.log","tree_digest":null,"tree_download_s":null,"started_at":"2026-10-03T18:04:28.333593Z","duration_s":0.005483,"timed_out":false,"image_before":"cb7ebef6-0f68-480e-83f4-a6ced90dbaf4","image_after":"7b542297-3298-44aa-9e97-99ae865b612f","junit":null,"diff":null,"patch_sha256":null,"dropped_paths":[],"snapshot_sha":null}
{"receipt_id":"agent1-8","seq":8,"branch_id":"agent1","kind":"command","cmd":"grep -n \"log=False\" nox/virtualenv.py","path":null,"exit_code":0,"stdout_tail":"209:                nox.command.run(cmd, silent=True, log=False)\n254:        nox.command.run(cmd, silent=True, log=False)\n355:                [self._resolved_interpreter, \"-c\", program], silent=True, log=False\n361:            [\"python\", \"-c\", program], silent=True, log=False, paths=self.bin_paths\n477:        nox.command.run(cmd, silent=True, log=False)\n","stderr_tail":"","stdout_sha256":"e37692c46d9940e35d0f9c48b3e63883df7d66da7ebadbbdddd8d3c7aa6d6e78","log_path":"~/dev/nebius-hackathon/pilot/v2-P/theacodes__nox-466/runs/pilot-theacodes__nox-466-7cd2d00d26/logs/agent1/agent1-8.log","tree_digest":null,"tree_download_s":null,"started_at":"2026-10-03T18:04:32.609384Z","duration_s":0.0030369999999999998,"timed_out":false,"image_before":"7b542297-3298-44aa-9e97-99ae865b612f","image_after":"fff28285-f6f4-429f-848e-331c87563b96","junit":null,"diff":null,"patch_sha256":null,"dropped_paths":[],"snapshot_sha":null}
{"receipt_id":"agent1-9","seq":9,"branch_id":"agent1","kind":"write","cmd":"/opt/receipts-959a99fa6a724f199ccd724b2b3ef7a6/bin/busybox sh -c 'mkdir -p /nox/nox && cp /opt/receipts-959a99fa6a724f199ccd724b2b3ef7a6/incoming/574ce6a477cda8a923a3e08fc34e9d1365cd3ee048a50e3fc8954eb0b3e1c5fe /nox/nox/virtualenv.py'","path":"nox/virtualenv.py","exit_code":0,"stdout_tail":"","stderr_tail":"","stdout_sha256":"574ce6a477cda8a923a3e08fc34e9d1365cd3ee048a50e3fc8954eb0b3e1c5fe","log_path":"~/dev/nebius-hackathon/pilot/v2-P/theacodes__nox-466/runs/pilot-theacodes__nox-466-7cd2d00d26/logs/agent1/agent1-9.log","tree_digest":null,"tree_download_s":null,"started_at":"2026-10-03T18:04:39.014433Z","duration_s":0.004529,"timed_out":false,"image_before":"fff28285-f6f4-429f-848e-331c87563b96","image_after":"fedc3655-861e-47de-a459-764be8aaec8a","junit":null,"diff":null,"patch_sha256":null,"dropped_paths":[],"snapshot_sha":null}
{"receipt_id":"agent1-10","seq":10,"branch_id":"agent1","kind":"command","cmd":"/opt/receipts-88d61d096efb46609c4a2eaaa562f1f2/bin/busybox mkdir -p /opt/receipts/reports && python -I /opt/receipts-88d61d096efb46609c4a2eaaa562f1f2/receipts_pytest.py tests/test_virtualenv.py::test_conda_env_create_verbose -v -o junit_family=xunit1 -p no:cacheprovider -rA --continue-on-collection-errors --junitxml=/opt/receipts/reports/agent1-10.xml","path":null,"exit_code":4,"stdout_tail":"============================= test session starts ==============================\nplatform linux -- Python 3.10.19, pytest-9.0.2, pluggy-1.6.0 -- /usr/local/bin/python\nrootdir: /nox\nconfigfile: pyproject.toml\nplugins: anyio-4.12.1, cov-7.0.0\ncollecting ... collected 0 items / 1 error\n\n==================================== ERRORS ====================================\n__________________ ERROR collecting tests/test_virtualenv.py ___________________\nImportError while importing test module '/nox/tests/test_virtualenv.py'.\nHint: make sure your test modules/packages have valid Python names.\nTraceback:\n/usr/local/lib/python3.10/importlib/__init__.py:126: in import_module\n    return _bootstrap._gcd_import(name[level:], package, level)\ntests/test_virtualenv.py:24: in <module>\n    import nox.virtualenv\nnox/__init__.py:17: in <module>\n    from nox._options import noxfile_options as options\nnox/_options.py:22: in <module>\n    from nox.tasks import discover_manifest, filter_manifest, load_nox_module\nnox/tasks.py:29: in <module>\n    from nox.manifest import WARN_PYTHONS_IGNORED, Manifest\nnox/manifest.py:34: in <module>\n    from nox.sessions import Session, SessionRunner\nnox/sessions.py:41: in <module>\n    from nox.virtualenv import CondaEnv, PassthroughEnv, ProcessEnv, VirtualEnv\nnox/virtualenv.py:26: in <module>\n    import nox.options\nE   ModuleNotFoundError: No module named 'nox.options'\n----------- generated xml file: /opt/receipts/reports/agent1-10.xml ------------\n=========================== short test summary info ============================\nERROR tests/test_virtualenv.py\n=============================== 1 error in 0.18s ===============================\n","stderr_tail":"ERROR: found no collectors for /nox/tests/test_virtualenv.py::test_conda_env_create_verbose\n\n","stdout_sha256":"7d573cd3fee3b1b4f733a96e976b3bef604a8e072dd5c51d40b5c138210dd147","log_path":"~/dev/nebius-hackathon/pilot/v2-P/theacodes__nox-466/runs/pilot-theacodes__nox-466-7cd2d00d26/logs/agent1/agent1-10.log","tree_digest":"d3ffac2ea460f6819ddf7e08e694fbbfe358ed79b06abef7976ca4edcee52e95","tree_download_s":3.485030625015497,"started_at":"2026-10-03T18:04:41.172245Z","duration_s":0.814948,"timed_out":false,"image_before":"fedc3655-861e-47de-a459-764be8aaec8a","image_after":"af2dccac-781f-400b-aca7-b3288d97ba59","junit":{"passed":[],"failed":[],"errors":[],"skipped":[],"collection_errors":["tests/test_virtualenv.py"],"failure_text":{"tests/test_virtualenv.py":"collection failure\nImportError while importing test module '/nox/tests/test_virtualenv.py'.\nHint: make sure your test modules/packages have valid Python names.\nTraceback:\n/usr/local/lib/python3.10/importlib/__init__.py:126: in import_module\n    return _bootstrap._gcd_import(name[level:], package, level)\ntests/test_virtualenv.py:24: in <module>\n    import nox.virtualenv\nnox/__init__.py:17: in <module>\n    from nox._options import noxfile_options as options\nnox/_options.py:22: in <module>\n    from nox.tasks import discover_manifest, filter_manifest, load_nox_module\nnox/tasks.py:29: in <module>\n    from nox.manifest import WARN_PYTHONS_IGNORED, Manifest\nnox/manifest.py:34: in <module>\n    from nox.sessions import Session, SessionRunner\nnox/sessions.py:41: in <module>\n    from nox.virtualenv import CondaEnv, PassthroughEnv, ProcessEnv, VirtualEnv\nnox/virtualenv.py:26: in <module>\n    import nox.options\nE   ModuleNotFoundError: No module named 'nox.options'"}},"diff":null,"patch_sha256":null,"dropped_paths":[],"snapshot_sha":null}
{"receipt_id":"agent1-11","seq":11,"branch_id":"agent1","kind":"write","cmd":"/opt/receipts-81504f0d31d24c609233932d4bf97531/bin/busybox sh -c 'mkdir -p /nox/nox && cp /opt/receipts-81504f0d31d24c609233932d4bf97531/incoming/2f86a2690426c36a75fe3e80abfadbf09f353eec0ea9964a5f21e93a2dadc0ed /nox/nox/virtualenv.py'","path":"nox/virtualenv.py","exit_code":0,"stdout_tail":"","stderr_tail":"","stdout_sha256":"2f86a2690426c36a75fe3e80abfadbf09f353eec0ea9964a5f21e93a2dadc0ed","log_path":"~/dev/nebius-hackathon/pilot/v2-P/theacodes__nox-466/runs/pilot-theacodes__nox-466-7cd2d00d26/logs/agent1/agent1-11.log","tree_digest":null,"tree_download_s":null,"started_at":"2026-10-03T18:04:54.343133Z","duration_s":0.004362,"timed_out":false,"image_before":"af2dccac-781f-400b-aca7-b3288d97ba59","image_after":"a85382af-0627-4bd9-9338-18af62a26563","junit":null,"diff":null,"patch_sha256":null,"dropped_paths":[],"snapshot_sha":null}
{"receipt_id":"agent1-12","seq":12,"branch_id":"agent1","kind":"write","cmd":"/opt/receipts-712cb6b3effa4009a9f7ad8aca75d4da/bin/busybox sh -c 'mkdir -p /nox/nox && cp /opt/receipts-712cb6b3effa4009a9f7ad8aca75d4da/incoming/2f86a2690426c36a75fe3e80abfadbf09f353eec0ea9964a5f21e93a2dadc0ed /nox/nox/virtualenv.py'","path":"nox/virtualenv.py","exit_code":0,"stdout_tail":"","stderr_tail":"","stdout_sha256":"2f86a2690426c36a75fe3e80abfadbf09f353eec0ea9964a5f21e93a2dadc0ed","log_path":"~/dev/nebius-hackathon/pilot/v2-P/theacodes__nox-466/runs/pilot-theacodes__nox-466-7cd2d00d26/logs/agent1/agent1-12.log","tree_digest":null,"tree_download_s":null,"started_at":"2026-10-03T18:04:57.653762Z","duration_s":0.004652,"timed_out":false,"image_before":"a85382af-0627-4bd9-9338-18af62a26563","image_after":"5192340d-e588-450d-a497-9b71ca2a8455","junit":null,"diff":null,"patch_sha256":null,"dropped_paths":[],"snapshot_sha":null}
{"receipt_id":"agent1-13","seq":13,"branch_id":"agent1","kind":"write","cmd":"/opt/receipts-cde9c4bb37814396a30dc21288fdb099/bin/busybox sh -c 'mkdir -p /nox/nox && cp /opt/receipts-cde9c4bb37814396a30dc21288fdb099/incoming/a8fc0d48fa8e81d2c205ddd0335fddd4e232b97dfbb49b13ad487b625a597c3f /nox/nox/virtualenv.py'","path":"nox/virtualenv.py","exit_code":0,"stdout_tail":"","stderr_tail":"","stdout_sha256":"a8fc0d48fa8e81d2c205ddd0335fddd4e232b97dfbb49b13ad487b625a597c3f","log_path":"~/dev/nebius-hackathon/pilot/v2-P/theacodes__nox-466/runs/pilot-theacodes__nox-466-7cd2d00d26/logs/agent1/agent1-13.log","tree_digest":null,"tree_download_s":null,"started_at":"2026-10-03T18:05:01.144250Z","duration_s":0.004707,"timed_out":false,"image_before":"5192340d-e588-450d-a497-9b71ca2a8455","image_after":"75e3fdb2-c99b-44ef-90a1-b6c668396dbf","junit":null,"diff":null,"patch_sha256":null,"dropped_paths":[],"snapshot_sha":null}
{"receipt_id":"agent1-14","seq":14,"branch_id":"agent1","kind":"command","cmd":"/opt/receipts-f4a3d1e1b11f492cab87a02db234e4c0/bin/busybox mkdir -p /opt/receipts/reports && python -I /opt/receipts-f4a3d1e1b11f492cab87a02db234e4c0/receipts_pytest.py tests/test_virtualenv.py::test_conda_env_create_verbose -v -o junit_family=xunit1 -p no:cacheprovider -rA --continue-on-collection-errors --junitxml=/opt/receipts/reports/agent1-14.xml","path":null,"exit_code":1,"stdout_tail":"============================= test session starts ==============================\nplatform linux -- Python 3.10.19, pytest-9.0.2, pluggy-1.6.0 -- /usr/local/bin/python\nrootdir: /nox\nconfigfile: pyproject.toml\nplugins: anyio-4.12.1, cov-7.0.0\ncollecting ... collected 1 item\n\ntests/test_virtualenv.py::test_conda_env_create_verbose FAILED           [100%]\n\n=================================== FAILURES ===================================\n________________________ test_conda_env_create_verbose _________________________\n\nmake_conda = <function make_conda.<locals>.factory at 0x7ffff5af3130>\n\n    @pytest.mark.skipif(not HAS_CONDA, reason=\"Missing conda command.\")\n    def test_conda_env_create_verbose(make_conda):\n        venv, dir_ = make_conda()\n        with mock.patch(\"nox.virtualenv.nox.command.run\") as mock_run:\n>           venv.create()\n\ntests/test_virtualenv.py:217: \n_ _ _ _ _ _ _ _ _ _ _ _ _ _ _ _ _ _ _ _ _ _ _ _ _ _ _ _ _ _ _ _ _ _ _ _ _ _ _ _ \n\nself = <nox.virtualenv.CondaEnv object at 0x7ffff7180130>\n\n    def create(self) -> bool:\n        \"\"\"Create the conda env.\"\"\"\n        if not self._clean_location():\n            logger.debug(\n                \"Re-using existing conda env at {}.\".format(self.location_name)\n            )\n    \n            self._reused = True\n    \n            return False\n    \n        cmd = [\"conda\", \"create\", \"--yes\", \"--prefix\", self.location]\n    \n        cmd.extend(self.venv_params)\n    \n        # Ensure the pip package is installed.\n        cmd.append(\"pip\")\n    \n        if self.interpreter:\n            python_dep = \"python={}\".format(self.interpreter)\n        else:\n            python_dep = \"python\"\n        cmd.append(python_dep)\n    \n        logger.info(\n            \"Creating conda env in {} with {}\".format(self.location_name, python_dep)\n        )\n>       import nox.options\nE       ModuleNotFoundError: No module named 'nox.options'\n\nnox/virtualenv.py:253: ModuleNotFoundError\n----------- generated xml file: /opt/receipts/reports/agent1-14.xml ------------\n=========================== short test summary info ============================\nFAILED tests/test_virtualenv.py::test_conda_env_create_verbose - ModuleNotFou...\n============================== 1 failed in 0.18s ===============================\n","stderr_tail":"","stdout_sha256":"6f79015233fd160553f3a21c6acb410cadedd45fc26eee9648b26b80949e5d7c","log_path":"~/dev/nebius-hackathon/pilot/v2-P/theacodes__nox-466/runs/pilot-theacodes__nox-466-7cd2d00d26/logs/agent1/agent1-14.log","tree_digest":"ac9ded08bc61dca67034112bd2b14a6ad1f4f71873e50448f566e795175f6be6","tree_download_s":2.941812749952078,"started_at":"2026-10-03T18:05:03.654879Z","duration_s":0.810524,"timed_out":false,"image_before":"75e3fdb2-c99b-44ef-90a1-b6c668396dbf","image_after":"37a7d028-cf18-493f-a891-b41d5a301cf7","junit":{"passed":[],"failed":["tests/test_virtualenv.py::test_conda_env_create_verbose"],"errors":[],"skipped":[],"collection_errors":[],"failure_text":{"tests/test_virtualenv.py::test_conda_env_create_verbose":"ModuleNotFoundError: No module named 'nox.options'\nmake_conda = <function make_conda.<locals>.factory at 0x7ffff5af3130>\n\n    @pytest.mark.skipif(not HAS_CONDA, reason=\"Missing conda command.\")\n    def test_conda_env_create_verbose(make_conda):\n        venv, dir_ = make_conda()\n        with mock.patch(\"nox.virtualenv.nox.command.run\") as mock_run:\n>           venv.create()\n\ntests/test_virtualenv.py:217: \n_ _ _ _ _ _ _ _ _ _ _ _ _ _ _ _ _ _ _ _ _ _ _ _ _ _ _ _ _ _ _ _ _ _ _ _ _ _ _ _ \n\nself = <nox.virtualenv.CondaEnv object at 0x7ffff7180130>\n\n    def create(self) -> bool:\n        \"\"\"Create the conda env.\"\"\"\n        if not self._clean_location():\n            logger.debug(\n                \"Re-using existing conda env at {}.\".format(self.location_name)\n            )\n    \n            self._reused = True\n    \n            return False\n    \n        cmd = [\"conda\", \"create\", \"--yes\", \"--prefix\", self.location]\n    \n        cmd.extend(self.venv_params)\n    \n        # Ensure the pip package is installed.\n        cmd.append(\"pip\")\n    \n        if self.interpreter:\n            python_dep = \"python={}\".format(self.interpreter)\n        else:\n            python_dep = \"python\"\n        cmd.append(python_dep)\n    \n        logger.info(\n            \"Creating conda env in {} with {}\".format(self.location_name, python_dep)\n        )\n>       import nox.options\nE       ModuleNotFoundError: No module named 'nox.options'\n\nnox/virtualenv.py:253: ModuleNotFoundError"}},"diff":null,"patch_sha256":null,"dropped_paths":[],"snapshot_sha":null}
{"receipt_id":"agent1-15","seq":15,"branch_id":"agent1","kind":"command","cmd":"find nox -name \"*.py\" | grep -E \"(options|_options)\" | head -5","path":null,"exit_code":0,"stdout_tail":"nox/_options.py\n","stderr_tail":"","stdout_sha256":"abdd7430d134edf0b94afc77f3f3d899e324ede3c0c84f64906efb19e47767f9","log_path":"~/dev/nebius-hackathon/pilot/v2-P/theacodes__nox-466/runs/pilot-theacodes__nox-466-7cd2d00d26/logs/agent1/agent1-15.log","tree_digest":null,"tree_download_s":null,"started_at":"2026-10-03T18:05:11.028692Z","duration_s":0.005867000000000001,"timed_out":false,"image_before":"37a7d028-cf18-493f-a891-b41d5a301cf7","image_after":"76a1a910-64f3-4088-8d4c-4d4e889669c0","junit":null,"diff":null,"patch_sha256":null,"dropped_paths":[],"snapshot_sha":null}
{"receipt_id":"agent1-16","seq":16,"branch_id":"agent1","kind":"write","cmd":"/opt/receipts-44645007e9084ba897c75e2a86fd8a1e/bin/busybox sh -c 'mkdir -p /nox/nox && cp /opt/receipts-44645007e9084ba897c75e2a86fd8a1e/incoming/cdebfc34d99cd6167191aba1175478a21abbad9270af2c0ce9ed3065fc452272 /nox/nox/virtualenv.py'","path":"nox/virtualenv.py","exit_code":0,"stdout_tail":"","stderr_tail":"","stdout_sha256":"cdebfc34d99cd6167191aba1175478a21abbad9270af2c0ce9ed3065fc452272","log_path":"~/dev/nebius-hackathon/pilot/v2-P/theacodes__nox-466/runs/pilot-theacodes__nox-466-7cd2d00d26/logs/agent1/agent1-16.log","tree_digest":null,"tree_download_s":null,"started_at":"2026-10-03T18:05:15.345455Z","duration_s":0.004777,"timed_out":false,"image_before":"76a1a910-64f3-4088-8d4c-4d4e889669c0","image_after":"00f77d69-26e4-4848-b769-b21a15f5635d","junit":null,"diff":null,"patch_sha256":null,"dropped_paths":[],"snapshot_sha":null}
{"receipt_id":"agent1-17","seq":17,"branch_id":"agent1","kind":"command","cmd":"/opt/receipts-f37bcdfb541b474babd68506656dce6d/bin/busybox mkdir -p /opt/receipts/reports && python -I /opt/receipts-f37bcdfb541b474babd68506656dce6d/receipts_pytest.py tests/test_virtualenv.py::test_conda_env_create_verbose -v -o junit_family=xunit1 -p no:cacheprovider -rA --continue-on-collection-errors --junitxml=/opt/receipts/reports/agent1-17.xml","path":null,"exit_code":1,"stdout_tail":"============================= test session starts ==============================\nplatform linux -- Python 3.10.19, pytest-9.0.2, pluggy-1.6.0 -- /usr/local/bin/python\nrootdir: /nox\nconfigfile: pyproject.toml\nplugins: anyio-4.12.1, cov-7.0.0\ncollecting ... collected 1 item\n\ntests/test_virtualenv.py::test_conda_env_create_verbose FAILED           [100%]\n\n=================================== FAILURES ===================================\n________________________ test_conda_env_create_verbose _________________________\n\nmake_conda = <function make_conda.<locals>.factory at 0x7ffff5acf130>\n\n    @pytest.mark.skipif(not HAS_CONDA, reason=\"Missing conda command.\")\n    def test_conda_env_create_verbose(make_conda):\n        venv, dir_ = make_conda()\n        with mock.patch(\"nox.virtualenv.nox.command.run\") as mock_run:\n>           venv.create()\n\ntests/test_virtualenv.py:217: \n_ _ _ _ _ _ _ _ _ _ _ _ _ _ _ _ _ _ _ _ _ _ _ _ _ _ _ _ _ _ _ _ _ _ _ _ _ _ _ _ \n\nself = <nox.virtualenv.CondaEnv object at 0x7ffff7180730>\n\n    def create(self) -> bool:\n        \"\"\"Create the conda env.\"\"\"\n        if not self._clean_location():\n            logger.debug(\n                \"Re-using existing conda env at {}.\".format(self.location_name)\n            )\n    \n            self._reused = True\n    \n            return False\n    \n        cmd = [\"conda\", \"create\", \"--yes\", \"--prefix\", self.location]\n    \n        cmd.extend(self.venv_params)\n    \n        # Ensure the pip package is installed.\n        cmd.append(\"pip\")\n    \n        if self.interpreter:\n            python_dep = \"python={}\".format(self.interpreter)\n        else:\n            python_dep = \"python\"\n        cmd.append(python_dep)\n    \n        logger.info(\n            \"Creating conda env in {} with {}\".format(self.location_name, python_dep)\n        )\n        # Import locally to avoid circular imports\n        from nox._options import options\n>       nox.command.run(cmd, silent=True, log=not options.verbose)\nE       AttributeError: 'OptionSet' object has no attribute 'verbose'\n\nnox/virtualenv.py:255: AttributeError\n----------- generated xml file: /opt/receipts/reports/agent1-17.xml ------------\n=========================== short test summary info ============================\nFAILED tests/test_virtualenv.py::test_conda_env_create_verbose - AttributeErr...\n============================== 1 failed in 0.18s ===============================\n","stderr_tail":"","stdout_sha256":"2533cb6eeb8bb5ff325a51d27a24cab2ad5e473000f88289d9f9b2084200bfcd","log_path":"~/dev/nebius-hackathon/pilot/v2-P/theacodes__nox-466/runs/pilot-theacodes__nox-466-7cd2d00d26/logs/agent1/agent1-17.log","tree_digest":"16b92e50009a3022892733e80b7463d81b2132aca147e086b8bf679c83eab028","tree_download_s":3.5561390831135213,"started_at":"2026-10-03T18:05:17.602707Z","duration_s":1.857481,"timed_out":false,"image_before":"00f77d69-26e4-4848-b769-b21a15f5635d","image_after":"53579872-ba29-411f-bb57-b9b838915e6b","junit":{"passed":[],"failed":["tests/test_virtualenv.py::test_conda_env_create_verbose"],"errors":[],"skipped":[],"collection_errors":[],"failure_text":{"tests/test_virtualenv.py::test_conda_env_create_verbose":"AttributeError: 'OptionSet' object has no attribute 'verbose'\nmake_conda = <function make_conda.<locals>.factory at 0x7ffff5acf130>\n\n    @pytest.mark.skipif(not HAS_CONDA, reason=\"Missing conda command.\")\n    def test_conda_env_create_verbose(make_conda):\n        venv, dir_ = make_conda()\n        with mock.patch(\"nox.virtualenv.nox.command.run\") as mock_run:\n>           venv.create()\n\ntests/test_virtualenv.py:217: \n_ _ _ _ _ _ _ _ _ _ _ _ _ _ _ _ _ _ _ _ _ _ _ _ _ _ _ _ _ _ _ _ _ _ _ _ _ _ _ _ \n\nself = <nox.virtualenv.CondaEnv object at 0x7ffff7180730>\n\n    def create(self) -> bool:\n        \"\"\"Create the conda env.\"\"\"\n        if not self._clean_location():\n            logger.debug(\n                \"Re-using existing conda env at {}.\".format(self.location_name)\n            )\n    \n            self._reused = True\n    \n            return False\n    \n        cmd = [\"conda\", \"create\", \"--yes\", \"--prefix\", self.location]\n    \n        cmd.extend(self.venv_params)\n    \n        # Ensure the pip package is installed.\n        cmd.append(\"pip\")\n    \n        if self.interpreter:\n            python_dep = \"python={}\".format(self.interpreter)\n        else:\n            python_dep = \"python\"\n        cmd.append(python_dep)\n    \n        logger.info(\n            \"Creating conda env in {} with {}\".format(self.location_name, python_dep)\n        )\n        # Import locally to avoid circular imports\n        from nox._options import options\n>       nox.command.run(cmd, silent=True, log=not options.verbose)\nE       AttributeError: 'OptionSet' object has no attribute 'verbose'\n\nnox/virtualenv.py:255: AttributeError"}},"diff":null,"patch_sha256":null,"dropped_paths":[],"snapshot_sha":null}
{"receipt_id":"agent1-18","seq":18,"branch_id":"agent1","kind":"command","cmd":"grep -n \"verbose\" nox/_options.py","path":null,"exit_code":0,"stdout_tail":"294:        \"verbose\",\n296:        \"--verbose\",\n","stderr_tail":"","stdout_sha256":"cc48b0ffbcfb4d083b04bb582e1fed1bc502c155cf2cd267c97cb560413c0d67","log_path":"~/dev/nebius-hackathon/pilot/v2-P/theacodes__nox-466/runs/pilot-theacodes__nox-466-7cd2d00d26/logs/agent1/agent1-18.log","tree_digest":null,"tree_download_s":null,"started_at":"2026-10-03T18:05:37.737684Z","duration_s":0.003025,"timed_out":false,"image_before":"53579872-ba29-411f-bb57-b9b838915e6b","image_after":"b55e24dd-b829-4a93-bcbe-f740ece1c641","junit":null,"diff":null,"patch_sha256":null,"dropped_paths":[],"snapshot_sha":null}
{"receipt_id":"agent1-19","seq":19,"branch_id":"agent1","kind":"command","cmd":"grep -rn \"\\.verbose\" nox/ | head -3","path":null,"exit_code":0,"stdout_tail":"nox/__main__.py:41:        color=args.color, verbose=args.verbose, add_timestamp=args.add_timestamp\nnox/virtualenv.py:255:        nox.command.run(cmd, silent=True, log=not options.verbose)\n","stderr_tail":"","stdout_sha256":"a81eb4f58f7bea60a435ccf8e14bdd4c3cf97abb06a1212f5e381018303728a6","log_path":"~/dev/nebius-hackathon/pilot/v2-P/theacodes__nox-466/runs/pilot-theacodes__nox-466-7cd2d00d26/logs/agent1/agent1-19.log","tree_digest":null,"tree_download_s":null,"started_at":"2026-10-03T18:05:42.218642Z","duration_s":0.005331000000000001,"timed_out":false,"image_before":"b55e24dd-b829-4a93-bcbe-f740ece1c641","image_after":"be24b337-06d1-4ca7-bb3d-f4a8789278b8","junit":null,"diff":null,"patch_sha256":null,"dropped_paths":[],"snapshot_sha":null}
{"receipt_id":"agent1-20","seq":20,"branch_id":"agent1","kind":"write","cmd":"/opt/receipts-a52e9873bdb0411599401e6f116e2d91/bin/busybox sh -c 'mkdir -p /nox/nox && cp /opt/receipts-a52e9873bdb0411599401e6f116e2d91/incoming/59c5dd3964faccb5798eec049c23f842f0a19d1332eab6ea08f3e3e4d6eba17d /nox/nox/virtualenv.py'","path":"nox/virtualenv.py","exit_code":0,"stdout_tail":"","stderr_tail":"","stdout_sha256":"59c5dd3964faccb5798eec049c23f842f0a19d1332eab6ea08f3e3e4d6eba17d","log_path":"~/dev/nebius-hackathon/pilot/v2-P/theacodes__nox-466/runs/pilot-theacodes__nox-466-7cd2d00d26/logs/agent1/agent1-20.log","tree_digest":null,"tree_download_s":null,"started_at":"2026-10-03T18:05:51.687598Z","duration_s":0.005081,"timed_out":false,"image_before":"be24b337-06d1-4ca7-bb3d-f4a8789278b8","image_after":"d96eb63b-1bb5-4811-8002-92859b6d221a","junit":null,"diff":null,"patch_sha256":null,"dropped_paths":[],"snapshot_sha":null}
{"receipt_id":"agent1-21","seq":21,"branch_id":"agent1","kind":"command","cmd":"/opt/receipts-19d7026fb9a84f5c8e4b53cfd3583c39/bin/busybox mkdir -p /opt/receipts/reports && python -I /opt/receipts-19d7026fb9a84f5c8e4b53cfd3583c39/receipts_pytest.py tests/test_virtualenv.py::test_conda_env_create_verbose -v -o junit_family=xunit1 -p no:cacheprovider -rA --continue-on-collection-errors --junitxml=/opt/receipts/reports/agent1-21.xml","path":null,"exit_code":1,"stdout_tail":"============================= test session starts ==============================\nplatform linux -- Python 3.10.19, pytest-9.0.2, pluggy-1.6.0 -- /usr/local/bin/python\nrootdir: /nox\nconfigfile: pyproject.toml\nplugins: anyio-4.12.1, cov-7.0.0\ncollecting ... collected 1 item\n\ntests/test_virtualenv.py::test_conda_env_create_verbose FAILED           [100%]\n\n=================================== FAILURES ===================================\n________________________ test_conda_env_create_verbose _________________________\n\nmake_conda = <function make_conda.<locals>.factory at 0x7ffff5b77130>\n\n    @pytest.mark.skipif(not HAS_CONDA, reason=\"Missing conda command.\")\n    def test_conda_env_create_verbose(make_conda):\n        venv, dir_ = make_conda()\n        with mock.patch(\"nox.virtualenv.nox.command.run\") as mock_run:\n>           venv.create()\n\ntests/test_virtualenv.py:217: \n_ _ _ _ _ _ _ _ _ _ _ _ _ _ _ _ _ _ _ _ _ _ _ _ _ _ _ _ _ _ _ _ _ _ _ _ _ _ _ _ \n\nself = <nox.virtualenv.CondaEnv object at 0x7ffff7180100>\n\n    def create(self) -> bool:\n        \"\"\"Create the conda env.\"\"\"\n        if not self._clean_location():\n            logger.debug(\n                \"Re-using existing conda env at {}.\".format(self.location_name)\n            )\n    \n            self._reused = True\n    \n            return False\n    \n        cmd = [\"conda\", \"create\", \"--yes\", \"--prefix\", self.location]\n    \n        cmd.extend(self.venv_params)\n    \n        # Ensure the pip package is installed.\n        cmd.append(\"pip\")\n    \n        if self.interpreter:\n            python_dep = \"python={}\".format(self.interpreter)\n        else:\n            python_dep = \"python\"\n        cmd.append(python_dep)\n    \n        logger.info(\n            \"Creating conda env in {} with {}\".format(self.location_name, python_dep)\n        )\n        # Import locally to avoid circular imports\n        from nox._options import options\n        # Handle both possible interfaces for accessing verbose flag\n>       verbose = getattr(options, 'verbose', False) if hasattr(options, 'verbose') else options.get('verbose', False)\nE       AttributeError: 'OptionSet' object has no attribute 'get'\n\nnox/virtualenv.py:256: AttributeError\n----------- generated xml file: /opt/receipts/reports/agent1-21.xml ------------\n=========================== short test summary info ============================\nFAILED tests/test_virtualenv.py::test_conda_env_create_verbose - AttributeErr...\n============================== 1 failed in 0.18s ===============================\n","stderr_tail":"","stdout_sha256":"f4243451026dfeb9c5d89c54731b60fcebb1eac98a51612fdfdc9cdfca594efd","log_path":"~/dev/nebius-hackathon/pilot/v2-P/theacodes__nox-466/runs/pilot-theacodes__nox-466-7cd2d00d26/logs/agent1/agent1-21.log","tree_digest":"ec2fc75145c9ed9ffed49775f7a70b09f871f419fc1bbf5f5c98568220e29a26","tree_download_s":7.798873916966841,"started_at":"2026-10-03T18:05:54.588313Z","duration_s":1.854684,"timed_out":false,"image_before":"d96eb63b-1bb5-4811-8002-92859b6d221a","image_after":"f9d4097f-57d8-480a-9cc1-78ff780c7178","junit":{"passed":[],"failed":["tests/test_virtualenv.py::test_conda_env_create_verbose"],"errors":[],"skipped":[],"collection_errors":[],"failure_text":{"tests/test_virtualenv.py::test_conda_env_create_verbose":"AttributeError: 'OptionSet' object has no attribute 'get'\nmake_conda = <function make_conda.<locals>.factory at 0x7ffff5b77130>\n\n    @pytest.mark.skipif(not HAS_CONDA, reason=\"Missing conda command.\")\n    def test_conda_env_create_verbose(make_conda):\n        venv, dir_ = make_conda()\n        with mock.patch(\"nox.virtualenv.nox.command.run\") as mock_run:\n>           venv.create()\n\ntests/test_virtualenv.py:217: \n_ _ _ _ _ _ _ _ _ _ _ _ _ _ _ _ _ _ _ _ _ _ _ _ _ _ _ _ _ _ _ _ _ _ _ _ _ _ _ _ \n\nself = <nox.virtualenv.CondaEnv object at 0x7ffff7180100>\n\n    def create(self) -> bool:\n        \"\"\"Create the conda env.\"\"\"\n        if not self._clean_location():\n            logger.debug(\n                \"Re-using existing conda env at {}.\".format(self.location_name)\n            )\n    \n            self._reused = True\n    \n            return False\n    \n        cmd = [\"conda\", \"create\", \"--yes\", \"--prefix\", self.location]\n    \n        cmd.extend(self.venv_params)\n    \n        # Ensure the pip package is installed.\n        cmd.append(\"pip\")\n    \n        if self.interpreter:\n            python_dep = \"python={}\".format(self.interpreter)\n        else:\n            python_dep = \"python\"\n        cmd.append(python_dep)\n    \n        logger.info(\n            \"Creating conda env in {} with {}\".format(self.location_name, python_dep)\n        )\n        # Import locally to avoid circular imports\n        from nox._options import options\n        # Handle both possible interfaces for accessing verbose flag\n>       verbose = getattr(options, 'verbose', False) if hasattr(options, 'verbose') else options.get('verbose', False)\nE       AttributeError: 'OptionSet' object has no attribute 'get'\n\nnox/virtualenv.py:256: AttributeError"}},"diff":null,"patch_sha256":null,"dropped_paths":[],"snapshot_sha":null}
{"receipt_id":"agent1-22","seq":22,"branch_id":"agent1","kind":"write","cmd":"/opt/receipts-5e54964b44ba43538bf9a14d27d08867/bin/busybox sh -c 'mkdir -p /nox/nox && cp /opt/receipts-5e54964b44ba43538bf9a14d27d08867/incoming/570cadd6fab346c7b554e5e508f4d50d9a3be4a0311f030b83629f24067d2cce /nox/nox/virtualenv.py'","path":"nox/virtualenv.py","exit_code":0,"stdout_tail":"","stderr_tail":"","stdout_sha256":"570cadd6fab346c7b554e5e508f4d50d9a3be4a0311f030b83629f24067d2cce","log_path":"~/dev/nebius-hackathon/pilot/v2-P/theacodes__nox-466/runs/pilot-theacodes__nox-466-7cd2d00d26/logs/agent1/agent1-22.log","tree_digest":null,"tree_download_s":null,"started_at":"2026-10-03T18:06:20.015282Z","duration_s":0.005215,"timed_out":false,"image_before":"f9d4097f-57d8-480a-9cc1-78ff780c7178","image_after":"73ad773e-d2f3-41a7-9623-353765409f6a","junit":null,"diff":null,"patch_sha256":null,"dropped_paths":[],"snapshot_sha":null}
{"receipt_id":"agent1-23","seq":23,"branch_id":"agent1","kind":"command","cmd":"/opt/receipts-44af5325448e422888473b2fe57b10cd/bin/busybox mkdir -p /opt/receipts/reports && python -I /opt/receipts-44af5325448e422888473b2fe57b10cd/receipts_pytest.py tests/test_virtualenv.py::test_conda_env_create_verbose -v -o junit_family=xunit1 -p no:cacheprovider -rA --continue-on-collection-errors --junitxml=/opt/receipts/reports/agent1-23.xml","path":null,"exit_code":1,"stdout_tail":"============================= test session starts ==============================\nplatform linux -- Python 3.10.19, pytest-9.0.2, pluggy-1.6.0 -- /usr/local/bin/python\nrootdir: /nox\nconfigfile: pyproject.toml\nplugins: anyio-4.12.1, cov-7.0.0\ncollecting ... collected 1 item\n\ntests/test_virtualenv.py::test_conda_env_create_verbose FAILED           [100%]\n\n=================================== FAILURES ===================================\n________________________ test_conda_env_create_verbose _________________________\n\nmake_conda = <function make_conda.<locals>.factory at 0x7ffff5b57130>\n\n    @pytest.mark.skipif(not HAS_CONDA, reason=\"Missing conda command.\")\n    def test_conda_env_create_verbose(make_conda):\n        venv, dir_ = make_conda()\n        with mock.patch(\"nox.virtualenv.nox.command.run\") as mock_run:\n            venv.create()\n    \n        args, kwargs = mock_run.call_args\n>       assert kwargs[\"log\"] is False\nE       assert True is False\n\ntests/test_virtualenv.py:220: AssertionError\n----------- generated xml file: /opt/receipts/reports/agent1-23.xml ------------\n=========================== short test summary info ============================\nFAILED tests/test_virtualenv.py::test_conda_env_create_verbose - assert True ...\n============================== 1 failed in 0.17s ===============================\n","stderr_tail":"","stdout_sha256":"da3c358bd897e0390c5982b7bac8642b6927aab0be7152a761ab1266673119fd","log_path":"~/dev/nebius-hackathon/pilot/v2-P/theacodes__nox-466/runs/pilot-theacodes__nox-466-7cd2d00d26/logs/agent1/agent1-23.log","tree_digest":"728c6a07845659336669456d1a0fd5450313b17eb59546242f16cafcd6357e8b","tree_download_s":3.5457778330892324,"started_at":"2026-10-03T18:06:23.166214Z","duration_s":0.795111,"timed_out":false,"image_before":"73ad773e-d2f3-41a7-9623-353765409f6a","image_after":"260187d8-2bd4-43f0-b5b8-b386689d72df","junit":{"passed":[],"failed":["tests/test_virtualenv.py::test_conda_env_create_verbose"],"errors":[],"skipped":[],"collection_errors":[],"failure_text":{"tests/test_virtualenv.py::test_conda_env_create_verbose":"assert True is False\nmake_conda = <function make_conda.<locals>.factory at 0x7ffff5b57130>\n\n    @pytest.mark.skipif(not HAS_CONDA, reason=\"Missing conda command.\")\n    def test_conda_env_create_verbose(make_conda):\n        venv, dir_ = make_conda()\n        with mock.patch(\"nox.virtualenv.nox.command.run\") as mock_run:\n            venv.create()\n    \n        args, kwargs = mock_run.call_args\n>       assert kwargs[\"log\"] is False\nE       assert True is False\n\ntests/test_virtualenv.py:220: AssertionError"}},"diff":null,"patch_sha256":null,"dropped_paths":[],"snapshot_sha":null}
{"receipt_id":"agent1-24","seq":24,"branch_id":"agent1","kind":"write","cmd":"/opt/receipts-010af962152846a9b40a70d9fed950e2/bin/busybox sh -c 'mkdir -p /nox/nox && cp /opt/receipts-010af962152846a9b40a70d9fed950e2/incoming/bcb6facd17f0adc8cd44fa2ccccd34e34dc16fd900444dbbbddffd3f4fb572ef /nox/nox/virtualenv.py'","path":"nox/virtualenv.py","exit_code":0,"stdout_tail":"","stderr_tail":"","stdout_sha256":"bcb6facd17f0adc8cd44fa2ccccd34e34dc16fd900444dbbbddffd3f4fb572ef","log_path":"~/dev/nebius-hackathon/pilot/v2-P/theacodes__nox-466/runs/pilot-theacodes__nox-466-7cd2d00d26/logs/agent1/agent1-24.log","tree_digest":null,"tree_download_s":null,"started_at":"2026-10-03T18:06:37.097400Z","duration_s":0.004579,"timed_out":false,"image_before":"260187d8-2bd4-43f0-b5b8-b386689d72df","image_after":"e930b603-213b-414d-a902-07549b8c672a","junit":null,"diff":null,"patch_sha256":null,"dropped_paths":[],"snapshot_sha":null}
{"receipt_id":"agent1-25","seq":25,"branch_id":"agent1","kind":"command","cmd":"/opt/receipts-2d4deacbd38549149b39b6bced32b242/bin/busybox mkdir -p /opt/receipts/reports && python -I /opt/receipts-2d4deacbd38549149b39b6bced32b242/receipts_pytest.py tests/test_virtualenv.py::test_conda_env_create_verbose -v -o junit_family=xunit1 -p no:cacheprovider -rA --continue-on-collection-errors --junitxml=/opt/receipts/reports/agent1-25.xml","path":null,"exit_code":1,"stdout_tail":"============================= test session starts ==============================\nplatform linux -- Python 3.10.19, pytest-9.0.2, pluggy-1.6.0 -- /usr/local/bin/python\nrootdir: /nox\nconfigfile: pyproject.toml\nplugins: anyio-4.12.1, cov-7.0.0\ncollecting ... collected 1 item\n\ntests/test_virtualenv.py::test_conda_env_create_verbose FAILED           [100%]\n\n=================================== FAILURES ===================================\n________________________ test_conda_env_create_verbose _________________________\n\nmake_conda = <function make_conda.<locals>.factory at 0x7ffff5b73130>\n\n    @pytest.mark.skipif(not HAS_CONDA, reason=\"Missing conda command.\")\n    def test_conda_env_create_verbose(make_conda):\n        venv, dir_ = make_conda()\n        with mock.patch(\"nox.virtualenv.nox.command.run\") as mock_run:\n            venv.create()\n    \n        args, kwargs = mock_run.call_args\n>       assert kwargs[\"log\"] is False\nE       assert True is False\n\ntests/test_virtualenv.py:220: AssertionError\n----------- generated xml file: /opt/receipts/reports/agent1-25.xml ------------\n=========================== short test summary info ============================\nFAILED tests/test_virtualenv.py::test_conda_env_create_verbose - assert True ...\n============================== 1 failed in 0.18s ===============================\n","stderr_tail":"","stdout_sha256":"c20b7e5872628acc4844bd551cbc2a2469ab392cd48a05c4bd16e80d5b3cf92b","log_path":"~/dev/nebius-hackathon/pilot/v2-P/theacodes__nox-466/runs/pilot-theacodes__nox-466-7cd2d00d26/logs/agent1/agent1-25.log","tree_digest":"04a382031d7ddee74168440246a99fd25f79ba37725b699432a21bc3fa63962f","tree_download_s":3.4128484998364,"started_at":"2026-10-03T18:06:40.318818Z","duration_s":0.810259,"timed_out":false,"image_before":"e930b603-213b-414d-a902-07549b8c672a","image_after":"9439bcd0-b961-4587-b352-29ea0955c8c2","junit":{"passed":[],"failed":["tests/test_virtualenv.py::test_conda_env_create_verbose"],"errors":[],"skipped":[],"collection_errors":[],"failure_text":{"tests/test_virtualenv.py::test_conda_env_create_verbose":"assert True is False\nmake_conda = <function make_conda.<locals>.factory at 0x7ffff5b73130>\n\n    @pytest.mark.skipif(not HAS_CONDA, reason=\"Missing conda command.\")\n    def test_conda_env_create_verbose(make_conda):\n        venv, dir_ = make_conda()\n        with mock.patch(\"nox.virtualenv.nox.command.run\") as mock_run:\n            venv.create()\n    \n        args, kwargs = mock_run.call_args\n>       assert kwargs[\"log\"] is False\nE       assert True is False\n\ntests/test_virtualenv.py:220: AssertionError"}},"diff":null,"patch_sha256":null,"dropped_paths":[],"snapshot_sha":null}
{"receipt_id":"agent1-26","seq":26,"branch_id":"agent1","kind":"write","cmd":"/opt/receipts-7ec5bb94867c4db99c37753465cfac55/bin/busybox sh -c 'mkdir -p /nox/nox && cp /opt/receipts-7ec5bb94867c4db99c37753465cfac55/incoming/42e2c6397733806afa3cb7723174d1c09d32942118ce636624c65b7af4f530de /nox/nox/virtualenv.py'","path":"nox/virtualenv.py","exit_code":0,"stdout_tail":"","stderr_tail":"","stdout_sha256":"42e2c6397733806afa3cb7723174d1c09d32942118ce636624c65b7af4f530de","log_path":"~/dev/nebius-hackathon/pilot/v2-P/theacodes__nox-466/runs/pilot-theacodes__nox-466-7cd2d00d26/logs/agent1/agent1-26.log","tree_digest":null,"tree_download_s":null,"started_at":"2026-10-03T18:06:51.185135Z","duration_s":0.005016,"timed_out":false,"image_before":"9439bcd0-b961-4587-b352-29ea0955c8c2","image_after":"ea15d772-47e6-497f-a762-f6fc293b7a3e","junit":null,"diff":null,"patch_sha256":null,"dropped_paths":[],"snapshot_sha":null}
{"receipt_id":"agent1-27","seq":27,"branch_id":"agent1","kind":"command","cmd":"/opt/receipts-9fcfde62eba143ff88ba3e968eeba091/bin/busybox mkdir -p /opt/receipts/reports && python -I /opt/receipts-9fcfde62eba143ff88ba3e968eeba091/receipts_pytest.py tests/test_virtualenv.py::test_conda_env_create_verbose -v -s -o junit_family=xunit1 -p no:cacheprovider -rA --continue-on-collection-errors --junitxml=/opt/receipts/reports/agent1-27.xml","path":null,"exit_code":1,"stdout_tail":"============================= test session starts ==============================\nplatform linux -- Python 3.10.19, pytest-9.0.2, pluggy-1.6.0 -- /usr/local/bin/python\nrootdir: /nox\nconfigfile: pyproject.toml\nplugins: anyio-4.12.1, cov-7.0.0\ncollecting ... collected 1 item\n\ntests/test_virtualenv.py::test_conda_env_create_verbose DEBUG: options type = <class 'argparse.Namespace'>\nDEBUG: options dir = ['add_timestamp', 'default_venv_backend', 'envdir', 'error_on_external_run', 'error_on_missing_interpreters', 'force_venv_backend', 'keywords', 'pythons', 'report', 'reuse_existing_virtualenvs', 'sessions', 'stop_on_first_error', 'verbose']\nDEBUG: options.verbose = None\nDEBUG: verbose = None\nFAILED\n\n=================================== FAILURES ===================================\n________________________ test_conda_env_create_verbose _________________________\n\nmake_conda = <function make_conda.<locals>.factory at 0x7ffff5ad3130>\n\n    @pytest.mark.skipif(not HAS_CONDA, reason=\"Missing conda command.\")\n    def test_conda_env_create_verbose(make_conda):\n        venv, dir_ = make_conda()\n        with mock.patch(\"nox.virtualenv.nox.command.run\") as mock_run:\n            venv.create()\n    \n        args, kwargs = mock_run.call_args\n>       assert kwargs[\"log\"] is False\nE       assert True is False\n\ntests/test_virtualenv.py:220: AssertionError\n----------- generated xml file: /opt/receipts/reports/agent1-27.xml ------------\n=========================== short test summary info ============================\nFAILED tests/test_virtualenv.py::test_conda_env_create_verbose - assert True ...\n============================== 1 failed in 0.17s ===============================\n","stderr_tail":"","stdout_sha256":"bc48042b3dc39e0047c01a233ffff86da9520068246c62f0b96be75c66c217c5","log_path":"~/dev/nebius-hackathon/pilot/v2-P/theacodes__nox-466/runs/pilot-theacodes__nox-466-7cd2d00d26/logs/agent1/agent1-27.log","tree_digest":"4257577b85626e0db0233aa4bf63e8515108fba9e50e8f4892c16c1d829e8779","tree_download_s":3.7725912500172853,"started_at":"2026-10-03T18:06:54.280399Z","duration_s":0.792087,"timed_out":false,"image_before":"ea15d772-47e6-497f-a762-f6fc293b7a3e","image_after":"f0ef4c5f-696e-4b50-9518-7e41055e0145","junit":{"passed":[],"failed":["tests/test_virtualenv.py::test_conda_env_create_verbose"],"errors":[],"skipped":[],"collection_errors":[],"failure_text":{"tests/test_virtualenv.py::test_conda_env_create_verbose":"assert True is False\nmake_conda = <function make_conda.<locals>.factory at 0x7ffff5ad3130>\n\n    @pytest.mark.skipif(not HAS_CONDA, reason=\"Missing conda command.\")\n    def test_conda_env_create_verbose(make_conda):\n        venv, dir_ = make_conda()\n        with mock.patch(\"nox.virtualenv.nox.command.run\") as mock_run:\n            venv.create()\n    \n        args, kwargs = mock_run.call_args\n>       assert kwargs[\"log\"] is False\nE       assert True is False\n\ntests/test_virtualenv.py:220: AssertionError"}},"diff":null,"patch_sha256":null,"dropped_paths":[],"snapshot_sha":null}
{"receipt_id":"agent1-28","seq":28,"branch_id":"agent1","kind":"write","cmd":"/opt/receipts-6e3e592d1ee547a0b4275b8837012b10/bin/busybox sh -c 'mkdir -p /nox/nox && cp /opt/receipts-6e3e592d1ee547a0b4275b8837012b10/incoming/a8cb58c01d956c0e815851421c31dc7f408804d6c6fb2073b41bad7cd5a9e862 /nox/nox/virtualenv.py'","path":"nox/virtualenv.py","exit_code":0,"stdout_tail":"","stderr_tail":"","stdout_sha256":"a8cb58c01d956c0e815851421c31dc7f408804d6c6fb2073b41bad7cd5a9e862","log_path":"~/dev/nebius-hackathon/pilot/v2-P/theacodes__nox-466/runs/pilot-theacodes__nox-466-7cd2d00d26/logs/agent1/agent1-28.log","tree_digest":null,"tree_download_s":null,"started_at":"2026-10-03T18:07:05.812147Z","duration_s":0.00509,"timed_out":false,"image_before":"f0ef4c5f-696e-4b50-9518-7e41055e0145","image_after":"33eb659a-02b8-4c9c-b202-3ad312a2bbe5","junit":null,"diff":null,"patch_sha256":null,"dropped_paths":[],"snapshot_sha":null}
{"receipt_id":"agent1-29","seq":29,"branch_id":"agent1","kind":"command","cmd":"/opt/receipts-f8e39bc6d7f04cd484f0a59c46c1e857/bin/busybox mkdir -p /opt/receipts/reports && python -I /opt/receipts-f8e39bc6d7f04cd484f0a59c46c1e857/receipts_pytest.py tests/test_virtualenv.py::test_conda_env_create_verbose -v -o junit_family=xunit1 -p no:cacheprovider -rA --continue-on-collection-errors --junitxml=/opt/receipts/reports/agent1-29.xml","path":null,"exit_code":1,"stdout_tail":"============================= test session starts ==============================\nplatform linux -- Python 3.10.19, pytest-9.0.2, pluggy-1.6.0 -- /usr/local/bin/python\nrootdir: /nox\nconfigfile: pyproject.toml\nplugins: anyio-4.12.1, cov-7.0.0\ncollecting ... collected 1 item\n\ntests/test_virtualenv.py::test_conda_env_create_verbose FAILED           [100%]\n\n=================================== FAILURES ===================================\n________________________ test_conda_env_create_verbose _________________________\n\nmake_conda = <function make_conda.<locals>.factory at 0x7ffff5acf130>\n\n    @pytest.mark.skipif(not HAS_CONDA, reason=\"Missing conda command.\")\n    def test_conda_env_create_verbose(make_conda):\n        venv, dir_ = make_conda()\n        with mock.patch(\"nox.virtualenv.nox.command.run\") as mock_run:\n            venv.create()\n    \n        args, kwargs = mock_run.call_args\n>       assert kwargs[\"log\"] is False\nE       assert True is False\n\ntests/test_virtualenv.py:220: AssertionError\n----------- generated xml file: /opt/receipts/reports/agent1-29.xml ------------\n=========================== short test summary info ============================\nFAILED tests/test_virtualenv.py::test_conda_env_create_verbose - assert True ...\n============================== 1 failed in 0.17s ===============================\n","stderr_tail":"","stdout_sha256":"00b0ffb7322941a7b74a3a3d2e3b1691ce6623cc3fcac2a5ea6752ee0d193514","log_path":"~/dev/nebius-hackathon/pilot/v2-P/theacodes__nox-466/runs/pilot-theacodes__nox-466-7cd2d00d26/logs/agent1/agent1-29.log","tree_digest":"5a265ccc8387d585ec29abbc5109171cf3f94b6e2ff50aec2c8257b6acafe189","tree_download_s":2.9235974999610335,"started_at":"2026-10-03T18:07:09.156038Z","duration_s":0.794654,"timed_out":false,"image_before":"33eb659a-02b8-4c9c-b202-3ad312a2bbe5","image_after":"eb2b9184-e490-4dd4-84cc-dc2249ecf82f","junit":{"passed":[],"failed":["tests/test_virtualenv.py::test_conda_env_create_verbose"],"errors":[],"skipped":[],"collection_errors":[],"failure_text":{"tests/test_virtualenv.py::test_conda_env_create_verbose":"assert True is False\nmake_conda = <function make_conda.<locals>.factory at 0x7ffff5acf130>\n\n    @pytest.mark.skipif(not HAS_CONDA, reason=\"Missing conda command.\")\n    def test_conda_env_create_verbose(make_conda):\n        venv, dir_ = make_conda()\n        with mock.patch(\"nox.virtualenv.nox.command.run\") as mock_run:\n            venv.create()\n    \n        args, kwargs = mock_run.call_args\n>       assert kwargs[\"log\"] is False\nE       assert True is False\n\ntests/test_virtualenv.py:220: AssertionError"}},"diff":null,"patch_sha256":null,"dropped_paths":[],"snapshot_sha":null}
{"receipt_id":"agent1-30","seq":30,"branch_id":"agent1","kind":"write","cmd":"/opt/receipts-7c645b7ad58941a39ef6bc1e8a71e193/bin/busybox sh -c 'mkdir -p /nox/nox && cp /opt/receipts-7c645b7ad58941a39ef6bc1e8a71e193/incoming/28a572d94bbb3a93ec1109cf6d6dabc41411587a6d8709d374f4f7e2a1707160 /nox/nox/virtualenv.py'","path":"nox/virtualenv.py","exit_code":0,"stdout_tail":"","stderr_tail":"","stdout_sha256":"28a572d94bbb3a93ec1109cf6d6dabc41411587a6d8709d374f4f7e2a1707160","log_path":"~/dev/nebius-hackathon/pilot/v2-P/theacodes__nox-466/runs/pilot-theacodes__nox-466-7cd2d00d26/logs/agent1/agent1-30.log","tree_digest":null,"tree_download_s":null,"started_at":"2026-10-03T18:07:18.540680Z","duration_s":0.004713,"timed_out":false,"image_before":"eb2b9184-e490-4dd4-84cc-dc2249ecf82f","image_after":"139cbcbf-4659-4e03-aa7f-84c1f854eab2","junit":null,"diff":null,"patch_sha256":null,"dropped_paths":[],"snapshot_sha":null}
{"receipt_id":"agent1-31","seq":31,"branch_id":"agent1","kind":"command","cmd":"/opt/receipts-b93677d2d82c44629a2bd29ed42f89d7/bin/busybox mkdir -p /opt/receipts/reports && python -I /opt/receipts-b93677d2d82c44629a2bd29ed42f89d7/receipts_pytest.py tests/test_virtualenv.py::test_conda_env_create_verbose -v -s -o junit_family=xunit1 -p no:cacheprovider -rA --continue-on-collection-errors --junitxml=/opt/receipts/reports/agent1-31.xml","path":null,"exit_code":1,"stdout_tail":"============================= test session starts ==============================\nplatform linux -- Python 3.10.19, pytest-9.0.2, pluggy-1.6.0 -- /usr/local/bin/python\nrootdir: /nox\nconfigfile: pyproject.toml\nplugins: anyio-4.12.1, cov-7.0.0\ncollecting ... collected 1 item\n\ntests/test_virtualenv.py::test_conda_env_create_verbose DEBUG: verbose=False, log=True\nFAILED\n\n=================================== FAILURES ===================================\n________________________ test_conda_env_create_verbose _________________________\n\nmake_conda = <function make_conda.<locals>.factory at 0x7ffff5b83130>\n\n    @pytest.mark.skipif(not HAS_CONDA, reason=\"Missing conda command.\")\n    def test_conda_env_create_verbose(make_conda):\n        venv, dir_ = make_conda()\n        with mock.patch(\"nox.virtualenv.nox.command.run\") as mock_run:\n            venv.create()\n    \n        args, kwargs = mock_run.call_args\n>       assert kwargs[\"log\"] is False\nE       assert True is False\n\ntests/test_virtualenv.py:220: AssertionError\n----------- generated xml file: /opt/receipts/reports/agent1-31.xml ------------\n=========================== short test summary info ============================\nFAILED tests/test_virtualenv.py::test_conda_env_create_verbose - assert True ...\n============================== 1 failed in 0.18s ===============================\n","stderr_tail":"","stdout_sha256":"b6f03e1fb6cd9b61e45cbbffa03d34b59e640af9386f312896545573f0cb0b72","log_path":"~/dev/nebius-hackathon/pilot/v2-P/theacodes__nox-466/runs/pilot-theacodes__nox-466-7cd2d00d26/logs/agent1/agent1-31.log","tree_digest":"3fc766577c33025339661097f9e3d0195a59b1610003bc8800aa1e982878a29d","tree_download_s":4.834661375032738,"started_at":"2026-10-03T18:07:23.114028Z","duration_s":0.800419,"timed_out":false,"image_before":"139cbcbf-4659-4e03-aa7f-84c1f854eab2","image_after":"2f7d8f72-763c-49bf-9f06-4104363f204e","junit":{"passed":[],"failed":["tests/test_virtualenv.py::test_conda_env_create_verbose"],"errors":[],"skipped":[],"collection_errors":[],"failure_text":{"tests/test_virtualenv.py::test_conda_env_create_verbose":"assert True is False\nmake_conda = <function make_conda.<locals>.factory at 0x7ffff5b83130>\n\n    @pytest.mark.skipif(not HAS_CONDA, reason=\"Missing conda command.\")\n    def test_conda_env_create_verbose(make_conda):\n        venv, dir_ = make_conda()\n        with mock.patch(\"nox.virtualenv.nox.command.run\") as mock_run:\n            venv.create()\n    \n        args, kwargs = mock_run.call_args\n>       assert kwargs[\"log\"] is False\nE       assert True is False\n\ntests/test_virtualenv.py:220: AssertionError"}},"diff":null,"patch_sha256":null,"dropped_paths":[],"snapshot_sha":null}
{"receipt_id":"agent1-32","seq":32,"branch_id":"agent1","kind":"write","cmd":"/opt/receipts-eb5a84915e8a4af1881b0dfb22504121/bin/busybox sh -c 'mkdir -p /nox/nox && cp /opt/receipts-eb5a84915e8a4af1881b0dfb22504121/incoming/249dd80bcefd5817f7da65d22f602e7b289805b4c0bd0ea0dac151e907babfca /nox/nox/virtualenv.py'","path":"nox/virtualenv.py","exit_code":0,"stdout_tail":"","stderr_tail":"","stdout_sha256":"249dd80bcefd5817f7da65d22f602e7b289805b4c0bd0ea0dac151e907babfca","log_path":"~/dev/nebius-hackathon/pilot/v2-P/theacodes__nox-466/runs/pilot-theacodes__nox-466-7cd2d00d26/logs/agent1/agent1-32.log","tree_digest":null,"tree_download_s":null,"started_at":"2026-10-03T18:07:45.804629Z","duration_s":0.004792,"timed_out":false,"image_before":"2f7d8f72-763c-49bf-9f06-4104363f204e","image_after":"2d8fc982-ff50-4632-bfb9-475d508bad21","junit":null,"diff":null,"patch_sha256":null,"dropped_paths":[],"snapshot_sha":null}
{"receipt_id":"agent1-33","seq":33,"branch_id":"agent1","kind":"command","cmd":"/opt/receipts-ef7624b935c94d52a38c32a043cddf57/bin/busybox mkdir -p /opt/receipts/reports && python -I /opt/receipts-ef7624b935c94d52a38c32a043cddf57/receipts_pytest.py tests/test_virtualenv.py::test_conda_env_create_verbose -v -s -o junit_family=xunit1 -p no:cacheprovider -rA --continue-on-collection-errors --junitxml=/opt/receipts/reports/agent1-33.xml","path":null,"exit_code":0,"stdout_tail":"============================= test session starts ==============================\nplatform linux -- Python 3.10.19, pytest-9.0.2, pluggy-1.6.0 -- /usr/local/bin/python\nrootdir: /nox\nconfigfile: pyproject.toml\nplugins: anyio-4.12.1, cov-7.0.0\ncollecting ... collected 1 item\n\ntests/test_virtualenv.py::test_conda_env_create_verbose DEBUG: verbose=False, log=False\nDEBUG: verbose=True, log=True\nPASSED\n\n==================================== PASSES ====================================\n----------- generated xml file: /opt/receipts/reports/agent1-33.xml ------------\n=========================== short test summary info ============================\nPASSED tests/test_virtualenv.py::test_conda_env_create_verbose\n============================== 1 passed in 0.15s ===============================\n","stderr_tail":"","stdout_sha256":"cf6af89033e5bc356b336161ed76da361848cbd2cc7e292466d939ceedf3bb5e","log_path":"~/dev/nebius-hackathon/pilot/v2-P/theacodes__nox-466/runs/pilot-theacodes__nox-466-7cd2d00d26/logs/agent1/agent1-33.log","tree_digest":"1398dcc505c893e5551a42dda1670fee377f2762196d66d92c71a8c62c3d5397","tree_download_s":2.9520778749138117,"started_at":"2026-10-03T18:07:48.365254Z","duration_s":0.7741790000000001,"timed_out":false,"image_before":"2d8fc982-ff50-4632-bfb9-475d508bad21","image_after":"e81f5d12-a2cf-47ba-a668-778a6c36526b","junit":{"passed":["tests/test_virtualenv.py::test_conda_env_create_verbose"],"failed":[],"errors":[],"skipped":[],"collection_errors":[],"failure_text":{}},"diff":null,"patch_sha256":null,"dropped_paths":[],"snapshot_sha":null}
{"receipt_id":"agent1-34","seq":34,"branch_id":"agent1","kind":"write","cmd":"/opt/receipts-4ba9b6cd10fe4149ad8f5fecd61be131/bin/busybox sh -c 'mkdir -p /nox/nox && cp /opt/receipts-4ba9b6cd10fe4149ad8f5fecd61be131/incoming/d3e9c82a53ba5900ab76de283b6a25c66150349850631f905589921c46dc0df9 /nox/nox/virtualenv.py'","path":"nox/virtualenv.py","exit_code":0,"stdout_tail":"","stderr_tail":"","stdout_sha256":"d3e9c82a53ba5900ab76de283b6a25c66150349850631f905589921c46dc0df9","log_path":"~/dev/nebius-hackathon/pilot/v2-P/theacodes__nox-466/runs/pilot-theacodes__nox-466-7cd2d00d26/logs/agent1/agent1-34.log","tree_digest":null,"tree_download_s":null,"started_at":"2026-10-03T18:07:58.580054Z","duration_s":0.004746,"timed_out":false,"image_before":"e81f5d12-a2cf-47ba-a668-778a6c36526b","image_after":"b4d44e28-bb70-48b7-a0cd-f386a651a293","junit":null,"diff":null,"patch_sha256":null,"dropped_paths":[],"snapshot_sha":null}
{"receipt_id":"agent1-35","seq":35,"branch_id":"agent1","kind":"command","cmd":"/opt/receipts-927c37c969f74b8f87baa12f8489ac47/bin/busybox mkdir -p /opt/receipts/reports && python -I /opt/receipts-927c37c969f74b8f87baa12f8489ac47/receipts_pytest.py tests/test_virtualenv.py::test_conda_env_create_verbose -v -o junit_family=xunit1 -p no:cacheprovider -rA --continue-on-collection-errors --junitxml=/opt/receipts/reports/agent1-35.xml","path":null,"exit_code":0,"stdout_tail":"============================= test session starts ==============================\nplatform linux -- Python 3.10.19, pytest-9.0.2, pluggy-1.6.0 -- /usr/local/bin/python\nrootdir: /nox\nconfigfile: pyproject.toml\nplugins: anyio-4.12.1, cov-7.0.0\ncollecting ... collected 1 item\n\ntests/test_virtualenv.py::test_conda_env_create_verbose PASSED           [100%]\n\n==================================== PASSES ====================================\n----------- generated xml file: /opt/receipts/reports/agent1-35.xml ------------\n=========================== short test summary info ============================\nPASSED tests/test_virtualenv.py::test_conda_env_create_verbose\n============================== 1 passed in 0.15s ===============================\n","stderr_tail":"","stdout_sha256":"f8173905eea27f3f1e4c326804319c085b5caa450cfcdc09b94e4a368a26b89b","log_path":"~/dev/nebius-hackathon/pilot/v2-P/theacodes__nox-466/runs/pilot-theacodes__nox-466-7cd2d00d26/logs/agent1/agent1-35.log","tree_digest":"fde87bf4f3eaf4d9fbb2ccb8a13f5284ee32a3ab54adc707d750539527153aa9","tree_download_s":2.897312582936138,"started_at":"2026-10-03T18:08:01.542178Z","duration_s":0.776233,"timed_out":false,"image_before":"b4d44e28-bb70-48b7-a0cd-f386a651a293","image_after":"ea21449a-4376-4e68-8366-df18dc706baf","junit":{"passed":["tests/test_virtualenv.py::test_conda_env_create_verbose"],"failed":[],"errors":[],"skipped":[],"collection_errors":[],"failure_text":{}},"diff":null,"patch_sha256":null,"dropped_paths":[],"snapshot_sha":null}
{"receipt_id":"agent1-36","seq":36,"branch_id":"agent1","kind":"command","cmd":"/opt/receipts-ff54919834cd4bae8e727524c54408e1/bin/busybox mkdir -p /opt/receipts/reports && python -I /opt/receipts-ff54919834cd4bae8e727524c54408e1/receipts_pytest.py tests/test_virtualenv.py -x -o junit_family=xunit1 -p no:cacheprovider -rA --continue-on-collection-errors --junitxml=/opt/receipts/reports/agent1-36.xml","path":null,"exit_code":0,"stdout_tail":"============================= test session starts ==============================\nplatform linux -- Python 3.10.19, pytest-9.0.2, pluggy-1.6.0\nrootdir: /nox\nconfigfile: pyproject.toml\nplugins: anyio-4.12.1, cov-7.0.0\ncollected 59 items\n\ntests/test_virtualenv.py ........................s...................... [ 79%]\n............                                                             [100%]\n\n==================================== PASSES ====================================\n----------- generated xml file: /opt/receipts/reports/agent1-36.xml ------------\n=========================== short test summary info ============================\nPASSED tests/test_virtualenv.py::test_process_env_constructor\nPASSED tests/test_virtualenv.py::test_process_env_create\nPASSED tests/test_virtualenv.py::test_condaenv_constructor_defaults\nPASSED tests/test_virtualenv.py::test_condaenv_constructor_explicit\nPASSED tests/test_virtualenv.py::test_condaenv_create\nPASSED tests/test_virtualenv.py::test_condaenv_create_with_params\nPASSED tests/test_virtualenv.py::test_condaenv_create_interpreter\nPASSED tests/test_virtualenv.py::test_conda_env_create_verbose\nPASSED tests/test_virtualenv.py::test_condaenv_bin_windows\nPASSED tests/test_virtualenv.py::test_condaenv_\nPASSED tests/test_virtualenv.py::test_constructor_defaults\nPASSED tests/test_virtualenv.py::test_constructor_explicit\nPASSED tests/test_virtualenv.py::test_env\nPASSED tests/test_virtualenv.py::test_blacklisted_env\nPASSED tests/test_virtualenv.py::test__clean_location\nPASSED tests/test_virtualenv.py::test_bin_paths\nPASSED tests/test_virtualenv.py::test_bin_windows\nPASSED tests/test_virtualenv.py::test_create\nPASSED tests/test_virtualenv.py::test_create_reuse_environment\nPASSED tests/test_virtualenv.py::test_create_reuse_environment_with_different_interpreter\nPASSED tests/test_virtualenv.py::test_create_reuse_stale_venv_environment\nPASSED tests/test_virtualenv.py::test_create_reuse_stale_virtualenv_environment\nPASSED tests/test_virtualenv.py::test_create_reuse_venv_environment\nPASSED tests/test_virtualenv.py::test_create_reuse_oldstyle_virtualenv_environment\nPASSED tests/test_virtualenv.py::test_create_venv_backend\nPASSED tests/test_virtualenv.py::test_create_interpreter\nPASSED tests/test_virtualenv.py::test__resolved_interpreter_none\nPASSED tests/test_virtualenv.py::test__resolved_interpreter_numerical_non_windows[3-python3]\nPASSED tests/test_virtualenv.py::test__resolved_interpreter_numerical_non_windows[3.6-python3.6]\nPASSED tests/test_virtualenv.py::test__resolved_interpreter_numerical_non_windows[3.6.2-python3.6]\nPASSED tests/test_virtualenv.py::test__resolved_interpreter_numerical_non_windows[3.10-python3.10]\nPASSED tests/test_virtualenv.py::test__resolved_interpreter_numerical_non_windows[2.7.15-python2.7]\nPASSED tests/test_virtualenv.py::test__resolved_interpreter_invalid_numerical_id[2.]\nPASSED tests/test_virtualenv.py::test__resolved_interpreter_invalid_numerical_id[2.7.]\nPASSED tests/test_virtualenv.py::test__resolved_interpreter_32_bit_non_windows\nPASSED tests/test_virtualenv.py::test__resolved_interpreter_non_windows\nPASSED tests/test_virtualenv.py::test__resolved_interpreter_windows_full_path\nPASSED tests/test_virtualenv.py::test__resolved_interpreter_windows_pyexe[3.7-c:\\\\python37-x64\\\\python.exe]\nPASSED tests/test_virtualenv.py::test__resolved_interpreter_windows_pyexe[python3.6-c:\\\\python36-x64\\\\python.exe]\nPASSED tests/test_virtualenv.py::test__resolved_interpreter_windows_pyexe[2.7-32-c:\\\\python27\\\\python.exe]\nPASSED tests/test_virtualenv.py::test__resolved_interpreter_windows_pyexe_fails\nPASSED tests/test_virtualenv.py::test__resolved_interpreter_windows_path_and_version\nPASSED tests/test_virtualenv.py::test__resolved_interpreter_windows_path_and_version_fails[3.7.3\\\\n-c:\\\\python37-x64\\\\python.exe-2.7]\nPASSED tests/test_virtualenv.py::test__resolved_interpreter_windows_path_and_version_fails[3.7.3\\\\n-c:\\\\python37-x64\\\\python.exe-python3.7]\nPASSED tests/test_virtualenv.py::test__resolved_interpreter_windows_path_and_version_fails[3.7.3\\\\n-c:\\\\python37-x64\\\\python.exe-goofy]\nPASSED tests/test_virtualenv.py::test__resolved_interpreter_windows_path_and_version_fails[3.7.3\\\\n-None-2.7]\nPASSED tests/test_virtualenv.py::test__resolved_interpreter_windows_path_and_version_fails[3.7.3\\\\n-None-python3.7]\nPASSED tests/test_virtualenv.py::test__resolved_interpreter_windows_path_and_version_fails[3.7.3\\\\n-None-goofy]\nPASSED tests/test_virtualenv.py::test__resolved_interpreter_windows_path_and_version_fails[RAISE_ERROR-c:\\\\python37-x64\\\\python.exe-2.7]\nPASSED tests/test_virtualenv.py::test__resolved_interpreter_windows_path_and_version_fails[RAISE_ERROR-c:\\\\python37-x64\\\\python.exe-python3.7]\nPASSED tests/test_virtualenv.py::test__resolved_interpreter_windows_path_and_version_fails[RAISE_ERROR-c:\\\\python37-x64\\\\python.exe-goofy]\nPASSED tests/test_virtualenv.py::test__resolved_interpreter_windows_path_and_version_fails[RAISE_ERROR-None-2.7]\nPASSED tests/test_virtualenv.py::test__resolved_interpreter_windows_path_and_version_fails[RAISE_ERROR-None-python3.7]\nPASSED tests/test_virtualenv.py::test__resolved_interpreter_windows_path_and_version_fails[RAISE_ERROR-None-goofy]\nPASSED tests/test_virtualenv.py::test__resolved_interpreter_not_found\nPASSED tests/test_virtualenv.py::test__resolved_interpreter_nonstandard\nPASSED tests/test_virtualenv.py::test__resolved_interpreter_cache_result\nPASSED tests/test_virtualenv.py::test__resolved_interpreter_cache_failure\nSKIPPED [1] tests/test_virtualenv.py:482: Requires Python 2.7 installation.\n======================== 58 passed, 1 skipped in 45.96s ========================\n","stderr_tail":"","stdout_sha256":"38af0508db27ed5cdc0c3476e9e0be8ee8c90d05d3f45f41f10c0fdb9fba3b8e","log_path":"~/dev/nebius-hackathon/pilot/v2-P/theacodes__nox-466/runs/pilot-theacodes__nox-466-7cd2d00d26/logs/agent1/agent1-36.log","tree_digest":"fde87bf4f3eaf4d9fbb2ccb8a13f5284ee32a3ab54adc707d750539527153aa9","tree_download_s":3.8277417910285294,"started_at":"2026-10-03T18:08:09.566347Z","duration_s":25.695593000000002,"timed_out":false,"image_before":"ea21449a-4376-4e68-8366-df18dc706baf","image_after":"e61d85d5-b0f0-4418-b303-973490775710","junit":{"passed":["tests/test_virtualenv.py::test_process_env_constructor","tests/test_virtualenv.py::test_process_env_create","tests/test_virtualenv.py::test_condaenv_constructor_defaults","tests/test_virtualenv.py::test_condaenv_constructor_explicit","tests/test_virtualenv.py::test_condaenv_create","tests/test_virtualenv.py::test_condaenv_create_with_params","tests/test_virtualenv.py::test_condaenv_create_interpreter","tests/test_virtualenv.py::test_conda_env_create_verbose","tests/test_virtualenv.py::test_condaenv_bin_windows","tests/test_virtualenv.py::test_condaenv_","tests/test_virtualenv.py::test_constructor_defaults","tests/test_virtualenv.py::test_constructor_explicit","tests/test_virtualenv.py::test_env","tests/test_virtualenv.py::test_blacklisted_env","tests/test_virtualenv.py::test__clean_location","tests/test_virtualenv.py::test_bin_paths","tests/test_virtualenv.py::test_bin_windows","tests/test_virtualenv.py::test_create","tests/test_virtualenv.py::test_create_reuse_environment","tests/test_virtualenv.py::test_create_reuse_environment_with_different_interpreter","tests/test_virtualenv.py::test_create_reuse_stale_venv_environment","tests/test_virtualenv.py::test_create_reuse_stale_virtualenv_environment","tests/test_virtualenv.py::test_create_reuse_venv_environment","tests/test_virtualenv.py::test_create_reuse_oldstyle_virtualenv_environment","tests/test_virtualenv.py::test_create_venv_backend","tests/test_virtualenv.py::test_create_interpreter","tests/test_virtualenv.py::test__resolved_interpreter_none","tests/test_virtualenv.py::test__resolved_interpreter_numerical_non_windows[3-python3]","tests/test_virtualenv.py::test__resolved_interpreter_numerical_non_windows[3.6-python3.6]","tests/test_virtualenv.py::test__resolved_interpreter_numerical_non_windows[3.6.2-python3.6]","tests/test_virtualenv.py::test__resolved_interpreter_numerical_non_windows[3.10-python3.10]","tests/test_virtualenv.py::test__resolved_interpreter_numerical_non_windows[2.7.15-python2.7]","tests/test_virtualenv.py::test__resolved_interpreter_invalid_numerical_id[2.]","tests/test_virtualenv.py::test__resolved_interpreter_invalid_numerical_id[2.7.]","tests/test_virtualenv.py::test__resolved_interpreter_32_bit_non_windows","tests/test_virtualenv.py::test__resolved_interpreter_non_windows","tests/test_virtualenv.py::test__resolved_interpreter_windows_full_path","tests/test_virtualenv.py::test__resolved_interpreter_windows_pyexe[3.7-c:\\\\python37-x64\\\\python.exe]","tests/test_virtualenv.py::test__resolved_interpreter_windows_pyexe[python3.6-c:\\\\python36-x64\\\\python.exe]","tests/test_virtualenv.py::test__resolved_interpreter_windows_pyexe[2.7-32-c:\\\\python27\\\\python.exe]","tests/test_virtualenv.py::test__resolved_interpreter_windows_pyexe_fails","tests/test_virtualenv.py::test__resolved_interpreter_windows_path_and_version","tests/test_virtualenv.py::test__resolved_interpreter_windows_path_and_version_fails[3.7.3\\\\n-c:\\\\python37-x64\\\\python.exe-2.7]","tests/test_virtualenv.py::test__resolved_interpreter_windows_path_and_version_fails[3.7.3\\\\n-c:\\\\python37-x64\\\\python.exe-python3.7]","tests/test_virtualenv.py::test__resolved_interpreter_windows_path_and_version_fails[3.7.3\\\\n-c:\\\\python37-x64\\\\python.exe-goofy]","tests/test_virtualenv.py::test__resolved_interpreter_windows_path_and_version_fails[3.7.3\\\\n-None-2.7]","tests/test_virtualenv.py::test__resolved_interpreter_windows_path_and_version_fails[3.7.3\\\\n-None-python3.7]","tests/test_virtualenv.py::test__resolved_interpreter_windows_path_and_version_fails[3.7.3\\\\n-None-goofy]","tests/test_virtualenv.py::test__resolved_interpreter_windows_path_and_version_fails[RAISE_ERROR-c:\\\\python37-x64\\\\python.exe-2.7]","tests/test_virtualenv.py::test__resolved_interpreter_windows_path_and_version_fails[RAISE_ERROR-c:\\\\python37-x64\\\\python.exe-python3.7]","tests/test_virtualenv.py::test__resolved_interpreter_windows_path_and_version_fails[RAISE_ERROR-c:\\\\python37-x64\\\\python.exe-goofy]","tests/test_virtualenv.py::test__resolved_interpreter_windows_path_and_version_fails[RAISE_ERROR-None-2.7]","tests/test_virtualenv.py::test__resolved_interpreter_windows_path_and_version_fails[RAISE_ERROR-None-python3.7]","tests/test_virtualenv.py::test__resolved_interpreter_windows_path_and_version_fails[RAISE_ERROR-None-goofy]","tests/test_virtualenv.py::test__resolved_interpreter_not_found","tests/test_virtualenv.py::test__resolved_interpreter_nonstandard","tests/test_virtualenv.py::test__resolved_interpreter_cache_result","tests/test_virtualenv.py::test__resolved_interpreter_cache_failure"],"failed":[],"errors":[],"skipped":["tests/test_virtualenv.py::test_create_reuse_python2_environment"],"collection_errors":[],"failure_text":{}},"diff":null,"patch_sha256":null,"dropped_paths":[],"snapshot_sha":null}
{"receipt_id":"agent1-37","seq":37,"branch_id":"agent1","kind":"diff","cmd":"compute patch in executor staging agent1-5c0458a62b7d479a87d092f7dee3db70: /opt/homebrew/Cellar/git/2.53.0/bin/git -c core.hooksPath=/dev/null -c core.attributesFile=/dev/null -c diff.external= -c core.quotePath=false add -A && /opt/homebrew/Cellar/git/2.53.0/bin/git -c core.hooksPath=/dev/null -c core.attributesFile=/dev/null -c diff.external= -c core.quotePath=false diff --cached --binary --no-ext-diff --no-textconv --no-renames 30a0d6663df6baf8db134360a9f33a90bb0f3fdc","path":null,"exit_code":0,"stdout_tail":"diff --git a/nox/virtualenv.py b/nox/virtualenv.py\nindex a6bf844..8caddc8 100644\n--- a/nox/virtualenv.py\n+++ b/nox/virtualenv.py\n@@ -250,7 +250,14 @@ class CondaEnv(ProcessEnv):\n         logger.info(\n             \"Creating conda env in {} with {}\".format(self.location_name, python_dep)\n         )\n-        nox.command.run(cmd, silent=True, log=False)\n+        # Import locally to avoid circular imports\n+        from nox._options import noxfile_options as options\n+        # Handle both possible interfaces for accessing verbose flag\n+        verbose = getattr(options, 'verbose', False)\n+        # Convert None to False for boolean evaluation\n+        if verbose is None:\n+            verbose = False\n+        nox.command.run(cmd, silent=True, log=verbose)\n \n         return True\n \n","stderr_tail":"","stdout_sha256":"5d002f8d1a87dcb7ee96b0b6eacf0bff95e76d915653a9f0407d3fbe954e5f60","log_path":null,"tree_digest":"fde87bf4f3eaf4d9fbb2ccb8a13f5284ee32a3ab54adc707d750539527153aa9","tree_download_s":2.3420545840635896,"started_at":"2026-10-03T18:09:20.955365Z","duration_s":0.0536721667740494,"timed_out":false,"image_before":"e61d85d5-b0f0-4418-b303-973490775710","image_after":"e61d85d5-b0f0-4418-b303-973490775710","junit":null,"diff":{"files":[{"path":"nox/virtualenv.py","added":8,"deleted":1,"category":"source","status":"modified"}],"patch_sha256":"5d002f8d1a87dcb7ee96b0b6eacf0bff95e76d915653a9f0407d3fbe954e5f60","patch_path":"~/dev/nebius-hackathon/pilot/v2-P/theacodes__nox-466/runs/pilot-theacodes__nox-466-7cd2d00d26/artifacts/agent1/agent1-37.patch"},"patch_sha256":"5d002f8d1a87dcb7ee96b0b6eacf0bff95e76d915653a9f0407d3fbe954e5f60","dropped_paths":[],"snapshot_sha":"30a0d6663df6baf8db134360a9f33a90bb0f3fdc"}
