{"receipt_id":"agent1-1","seq":1,"branch_id":"agent1","kind":"command","cmd":"git ls-files -z","path":null,"exit_code":0,"stdout_tail":".deepsource.toml\u0000.github/ISSUE_TEMPLATE/bug.md\u0000.github/ISSUE_TEMPLATE/feature_request.md\u0000.github/PULL_REQUEST_TEMPLATE.md\u0000.github/dependabot.yml\u0000.github/workflows/create_tests_package_lists.yml\u0000.github/workflows/exhaustive_package_test.yml\u0000.github/workflows/tests.yml\u0000.gitignore\u0000.pre-commit-config.yaml\u0000.pre-commit-hooks.yaml\u0000.readthedocs.yml\u0000CHANGELOG.md\u0000CONTRIBUTING.md\u0000LICENSE\u0000README.md\u0000changelog.d/.gitignore\u0000changelog.d/1300.bugfix.md\u0000changelog.d/1304.bugfix.md\u0000changelog.d/1312.doc.md\u0000changelog.d/1321.doc.md\u0000changelog.d/1324.bugfix.md\u0000changelog.d/1325.doc.md\u0000changelog.d/1336.feature.md\u0000changelog.d/687.feature.md\u0000changelog.d/965.bugfix.md\u0000docs/changelog.md\u0000docs/comparisons.md\u0000docs/contributing.md\u0000docs/examples.md\u0000docs/getting-started.md\u0000docs/how-pipx-works.md\u0000docs/index.md\u0000docs/installation.md\u0000docs/programs-to-try.md\u0000docs/troubleshooting.md\u0000get-pipx.py\u0000installation.md\u0000logo.svg\u0000mkdocs.yml\u0000noxfile.py\u0000pipx_demo.gif\u0000pyproject.toml\u0000scripts/gen_doc_pages.py\u0000scripts/generate_man.py\u0000scripts/list_test_packages.py\u0000scripts/migrate_pipsi_to_pipx.py\u0000scripts/templates/docs.md\u0000scripts/test_packages_support.py\u0000scripts/update_package_cache.py\u0000src/pipx/__init__.py\u0000src/pipx/__main__.py\u0000src/pipx/animate.py\u0000src/pipx/colors.py\u0000src/pipx/commands/__init__.py\u0000src/pipx/commands/common.py\u0000src/pipx/commands/ensure_path.py\u0000src/pipx/commands/environment.py\u0000src/pipx/commands/inject.py\u0000src/pipx/commands/install.py\u0000src/pipx/commands/interpreter.py\u0000src/pipx/commands/list_packages.py\u0000src/pipx/commands/reinstall.py\u0000src/pipx/commands/run.py\u0000src/pipx/commands/run_pip.py\u0000src/pipx/commands/uninject.py\u0000src/pipx/commands/uninstall.py\u0000src/pipx/commands/upgrade.py\u0000src/pipx/constants.py\u0000src/pipx/emojis.py\u0000src/pipx/interpreter.py\u0000src/pipx/main.py\u0000src/pipx/package_specifier.py\u0000src/pipx/paths.py\u0000src/pipx/pipx_metadata_file.py\u0000src/pipx/shared_libs.py\u0000src/pipx/standalone_python.py\u0000src/pipx/util.py\u0000src/pipx/venv.py\u0000src/pipx/venv_inspect.py\u0000src/pipx/version.pyi\u0000testdata/empty_project/README.md\u0000testdata/empty_project/empty_project/__init__.py\u0000testdata/empty_project/empty_project/main.py\u0000testdata/empty_project/pyproject.toml\u0000testdata/standalone_python_index.json\u0000testdata/test_package_specifier/local_extras/repeatme/__init__.py\u0000testdata/test_package_specifier/local_extras/repeatme/main.py\u0000testdata/test_package_specifier/local_extras/setup.py\u0000testdata/tests_packages/README.md\u0000testdata/tests_packages/macos21-python3.12.txt\u0000testdata/tests_packages/primary_packages.txt\u0000testdata/tests_packages/unix-python3.10.txt\u0000testdata/tests_packages/unix-python3.11.txt\u0000testdata/tests_packages/unix-python3.12.txt\u0000testdata/tests_packages/unix-python3.8.txt\u0000testdata/tests_packages/unix-python3.9.txt\u0000testdata/tests_packages/win-python3.12.txt\u0000tests/conftest.py\u0000tests/helpers.py\u0000tests/package_info.py\u0000tests/test_animate.py\u0000tests/test_completions.py\u0000tests/test_emojis.py\u0000tests/test_environment.py\u0000tests/test_inject.py\u0000tests/test_install.py\u0000tests/test_install_all_packages.py\u0000tests/test_interpreter.py\u0000tests/test_list.py\u0000tests/test_main.py\u0000tests/test_package_specifier.py\u0000tests/test_pipx_metadata_file.py\u0000tests/test_reinstall.py\u0000tests/test_reinstall_all.py\u0000tests/test_run.py\u0000tests/test_runpip.py\u0000tests/test_shared_libs.py\u0000tests/test_standalone_interpreter.py\u0000tests/test_uninject.py\u0000tests/test_uninstall.py\u0000tests/test_uninstall_all.py\u0000tests/test_upgrade.py\u0000tests/test_upgrade_all.py\u0000","stderr_tail":"","stdout_sha256":"26457f7d40f1c7ca778f69aaf1ca4794487d9792e7597f2ad1ca48460ae97600","log_path":"~/dev/nebius-hackathon/pilot/v2-P/pypa__pipx-1350/runs/pilot-pypa__pipx-1350-54fbd8f247/logs/agent1/agent1-1.log","tree_digest":null,"tree_download_s":null,"started_at":"2026-10-03T18:32:43.541422Z","duration_s":0.0039629999999999995,"timed_out":false,"image_before":"f63ff0d5-762c-423f-816f-4200b9a0b684","image_after":"5b98062f-fcbb-42c3-aeeb-3c904606d918","junit":null,"diff":null,"patch_sha256":null,"dropped_paths":[],"snapshot_sha":null}
{"receipt_id":"agent1-2","seq":2,"branch_id":"agent1","kind":"command","cmd":"find . -name '*.py' -exec grep -l \\\"fetch.missing.python\\\\|fetch_missing_python\\\" {} \\;","path":null,"exit_code":127,"stdout_tail":"","stderr_tail":"/bin/sh: 1: fetch_missing_python\": not found\nfind: missing argument to `-exec'\n","stdout_sha256":"001b5d1524ee77f000fef09f0ecd349d3918ca1ad9039b82cc5277b1d9926686","log_path":"~/dev/nebius-hackathon/pilot/v2-P/pypa__pipx-1350/runs/pilot-pypa__pipx-1350-54fbd8f247/logs/agent1/agent1-2.log","tree_digest":null,"tree_download_s":null,"started_at":"2026-10-03T18:32:48.521743Z","duration_s":0.003508,"timed_out":false,"image_before":"5b98062f-fcbb-42c3-aeeb-3c904606d918","image_after":"b7cdd956-dd07-4678-8d91-acb1b0e0b980","junit":null,"diff":null,"patch_sha256":null,"dropped_paths":[],"snapshot_sha":null}
{"receipt_id":"agent1-3","seq":3,"branch_id":"agent1","kind":"command","cmd":"find . -name '*.py' -exec grep -l \"fetch_missing_python\" {} +","path":null,"exit_code":0,"stdout_tail":"./src/pipx/interpreter.py\n./src/pipx/main.py\n./tests/test_interpreter.py\n./tests/test_install.py\n","stderr_tail":"","stdout_sha256":"6fab2fd83eb931a1298a282a226e1b8fbc66fd33d7e0e83c47a2ba705885c140","log_path":"~/dev/nebius-hackathon/pilot/v2-P/pypa__pipx-1350/runs/pilot-pypa__pipx-1350-54fbd8f247/logs/agent1/agent1-3.log","tree_digest":null,"tree_download_s":null,"started_at":"2026-10-03T18:32:51.789361Z","duration_s":0.008654,"timed_out":false,"image_before":"b7cdd956-dd07-4678-8d91-acb1b0e0b980","image_after":"54bc38e4-6cfe-4b0e-aec6-5b5f9bfc1a1a","junit":null,"diff":null,"patch_sha256":null,"dropped_paths":[],"snapshot_sha":null}
{"receipt_id":"agent1-4","seq":4,"branch_id":"agent1","kind":"write","cmd":"/opt/receipts-9f0cea9891b34f39b65a47f54b0c0fa8/bin/busybox sh -c 'mkdir -p /pipx/src/pipx && cp /opt/receipts-9f0cea9891b34f39b65a47f54b0c0fa8/incoming/123ba28b66b4199741a69a892f26b3f899e28d6246ce6d80460f6a14d507c91d /pipx/src/pipx/standalone_python.py'","path":"./src/pipx/standalone_python.py","exit_code":0,"stdout_tail":"","stderr_tail":"","stdout_sha256":"123ba28b66b4199741a69a892f26b3f899e28d6246ce6d80460f6a14d507c91d","log_path":"~/dev/nebius-hackathon/pilot/v2-P/pypa__pipx-1350/runs/pilot-pypa__pipx-1350-54fbd8f247/logs/agent1/agent1-4.log","tree_digest":null,"tree_download_s":null,"started_at":"2026-10-03T18:33:00.203552Z","duration_s":0.005106,"timed_out":false,"image_before":"54bc38e4-6cfe-4b0e-aec6-5b5f9bfc1a1a","image_after":"dd4f92f4-4e52-49cf-ab98-4580a71c562c","junit":null,"diff":null,"patch_sha256":null,"dropped_paths":[],"snapshot_sha":null}
{"receipt_id":"agent1-5","seq":5,"branch_id":"agent1","kind":"command","cmd":"/opt/receipts-95141102dc5245dcb8971456d04c06dc/bin/busybox mkdir -p /opt/receipts/reports && python -I /opt/receipts-95141102dc5245dcb8971456d04c06dc/receipts_pytest.py tests/test_install.py::test_install_fetch_missing_python_invalid -k 3.1 --no-header -rA --tb=line --color=no -p no:cacheprovider -W ignore::DeprecationWarning -o junit_family=xunit1 -p no:cacheprovider -rA --continue-on-collection-errors --junitxml=/opt/receipts/reports/agent1-5.xml","path":null,"exit_code":0,"stdout_tail":"============================= test session starts ==============================\ncollected 2 items / 1 deselected / 1 selected\n\ntests/test_install.py .                                                  [100%]\n\n==================================== PASSES ====================================\n________________ test_install_fetch_missing_python_invalid[3.1] ________________\n---------------------------- Captured stdout setup -----------------------------\nUsing the following file to specify needed package files:\n    testdata/tests_packages/unix-python3.10.txt\nEnsuring the following directory contains necessary package files:\n    /pipx/.pipx_tests/package_cache/3.10\nMISSING FILES: 0\nEXISTING (found) FILES: 197\nLEFTOVER (unused) FILES: 0\n<LocalRequest: GET http://127.0.0.1:58989/simple/>\n200 OK\n127.0.0.1 - - [03/Oct/2026 18:33:04] \"GET /simple/ HTTP/1.1\" 200 10404\n\n---------------------------- Captured stderr setup -----------------------------\nBottle v0.12.25 server starting up (using AutoServer(handler_class=<class 'pypiserver.__main__.WsgiHandler'>))...\nListening on http://127.0.0.1:58989/\nHit Ctrl-C to quit.\n\n------------------------------ Captured log call -------------------------------\nDEBUG    pipx.main:main.py:988 2026-10-03 18:33:04\nDEBUG    pipx.main:main.py:989 pipx install --python 3.1 --fetch-missing-python pycowsay\nINFO     pipx.main:main.py:990 pipx version is 1.5.1.dev14+g440236287\nINFO     pipx.main:main.py:991 Default python interpreter is '/usr/local/bin/python3.10'\nDEBUG    pipx.main:main.py:235 Failed to resolve interpreter:\nTraceback (most recent call last):\n  File \"/pipx/src/pipx/standalone_python.py\", line 72, in download_python_build_standalone\n    full_version, download_link = resolve_python_version(python_version)\n  File \"/pipx/src/pipx/standalone_python.py\", line 204, in resolve_python_version\n    raise NotAvailable(f\"Python version {requested_version} is not available.\")\npipx.standalone_python.NotAvailable: Python version 3.1 is not available.\n\nThe above exception was the direct cause of the following exception:\n\nTraceback (most recent call last):\n  File \"/pipx/src/pipx/interpreter.py\", line 67, in find_python_interpreter\n    standalone_executable = download_python_build_standalone(python_version)\n  File \"/pipx/src/pipx/standalone_python.py\", line 74, in download_python_build_standalone\n    raise PipxError(f\"Unable to acquire a standalone python build matching {python_version}.\") from e\npipx.util.PipxError: Unable to acquire a standalone python build matching 3.1.\n\nThe above exception was the direct cause of the following exception:\n\nTraceback (most recent call last):\n  File \"/pipx/src/pipx/main.py\", line 230, in run_pipx_command\n    interpreter = find_python_interpreter(\n  File \"/pipx/src/pipx/interpreter.py\", line 70, in find_python_interpreter\n    raise InterpreterResolutionError(source=\"the python-build-standalone project\", version=python_version) from e\npipx.interpreter.InterpreterResolutionError: No executable for the provided Python version '3.1' found in the\npython-build-standalone project. Please make sure the provided version is\nlisted in https://github.com/indygreg/python-build-standalone/releases/latest.\nDEBUG    pipx.main:main.py:1067 pipx finished.\n------------ generated xml file: /opt/receipts/reports/agent1-5.xml ------------\n=========================== short test summary info ============================\nPASSED tests/test_install.py::test_install_fetch_missing_python_invalid[3.1]\n======================= 1 passed, 1 deselected in 0.34s ========================\n","stderr_tail":"","stdout_sha256":"89dd64e7485a1c9216e84ddb6fb3669682af75b26a9aaa034f2250f3b8493877","log_path":"~/dev/nebius-hackathon/pilot/v2-P/pypa__pipx-1350/runs/pilot-pypa__pipx-1350-54fbd8f247/logs/agent1/agent1-5.log","tree_digest":"097811e15fb85db329b4835f294eb1cd45f0b2daf4a23209b221bad8a37e6926","tree_download_s":18.80906291701831,"started_at":"2026-10-03T18:33:02.891190Z","duration_s":1.013744,"timed_out":false,"image_before":"dd4f92f4-4e52-49cf-ab98-4580a71c562c","image_after":"8657457e-e271-46d9-9519-2e0b9f22a896","junit":{"passed":["tests/test_install.py::test_install_fetch_missing_python_invalid[3.1]"],"failed":[],"errors":[],"skipped":[],"collection_errors":[],"failure_text":{}},"diff":null,"patch_sha256":null,"dropped_paths":[],"snapshot_sha":null}
{"receipt_id":"agent1-6","seq":6,"branch_id":"agent1","kind":"command","cmd":"/opt/receipts-b3b14de78bbb41049bcd0d1a1bd17116/bin/busybox mkdir -p /opt/receipts/reports && python -I /opt/receipts-b3b14de78bbb41049bcd0d1a1bd17116/receipts_pytest.py tests/test_install.py --no-header -rA --tb=line --color=no -p no:cacheprovider -W ignore::DeprecationWarning -o junit_family=xunit1 -p no:cacheprovider -rA --continue-on-collection-errors --junitxml=/opt/receipts/reports/agent1-6.xml","path":null,"exit_code":0,"stdout_tail":"ffff77c8280>, origin='/tmp/pytest-of-root/pytest-3/session_shareddir0/lib/python3.10/site-packages/pip/__init__.py', submodule_search_locations=['/tmp/pytest-of-root/pytest-3/session_shareddir0/lib/python3.10/site-packages/pip'])\nDEBUG    pipx.util:util.py:197 returncode: 0\nINFO     pipx.util:util.py:174 running /tmp/pytest-of-root/pytest-3/test_do_not_wait_for_input0/subdir/pipxhome/venvs/pycowsay/bin/python -c import sysconfig; print(sysconfig.get_path('purelib'))\nDEBUG    pipx.util:util.py:194 stdout: /tmp/pytest-of-root/pytest-3/test_do_not_wait_for_input0/subdir/pipxhome/venvs/pycowsay/lib/python3.10/site-packages\nDEBUG    pipx.util:util.py:197 returncode: 0\nINFO     pipx.util:util.py:174 running /tmp/pytest-of-root/pytest-3/session_shareddir0/bin/python -c import sysconfig; print(sysconfig.get_path('purelib'))\nDEBUG    pipx.util:util.py:194 stdout: /tmp/pytest-of-root/pytest-3/session_shareddir0/lib/python3.10/site-packages\nDEBUG    pipx.util:util.py:197 returncode: 0\nINFO     pipx.util:util.py:174 running /tmp/pytest-of-root/pytest-3/test_do_not_wait_for_input0/subdir/pipxhome/venvs/pycowsay/bin/python --version\nDEBUG    pipx.util:util.py:194 stdout: Python 3.10.19\nDEBUG    pipx.util:util.py:196 stderr:\nDEBUG    pipx.util:util.py:197 returncode: 0\nINFO     pipx.package_specifier:package_specifier.py:137 cleaned package spec: pycowsay\nINFO     pipx.util:util.py:174 running /tmp/pytest-of-root/pytest-3/test_do_not_wait_for_input0/subdir/pipxhome/venvs/pycowsay/bin/python -m pip --no-input install pycowsay\nDEBUG    pipx.util:util.py:197 returncode: 1\nINFO     pipx.util:util.py:331 '/tmp/pytest-of-root/pytest-3/test_do_not_wait_for_input0/subdir/pipxhome/venvs/pycowsay/bin/python -m pip --no-input install pycowsay' failed\nERROR    pipx.util:util.py:346 Fatal error from pip prevented installation. Full pip output in file:\n    /root/.local/state/pipx/log/cmd_2026-10-03_18.36.14_pip_errors.log\nINFO     pipx.util:util.py:55 removing directory /tmp/pytest-of-root/pytest-3/test_do_not_wait_for_input0/subdir/pipxhome/venvs/pycowsay\nDEBUG    pipx.main:main.py:1059 PipxError: Error installing pycowsay.\nTraceback (most recent call last):\n  File \"/pipx/src/pipx/main.py\", line 1056, in cli\n    return run_pipx_command(parsed_pipx_args, subparsers)\n  File \"/pipx/src/pipx/main.py\", line 260, in run_pipx_command\n    return commands.install(\n  File \"/pipx/src/pipx/commands/install.py\", line 94, in install\n    venv.install_package(\n  File \"/pipx/src/pipx/venv.py\", line 263, in install_package\n    raise PipxError(f\"Error installing {full_package_description(package_name, package_or_url)}.\")\npipx.util.PipxError: Error installing pycowsay.\nDEBUG    pipx.main:main.py:1067 pipx finished.\n------------ generated xml file: /opt/receipts/reports/agent1-6.xml ------------\n=========================== short test summary info ============================\nPASSED tests/test_install.py::test_help_text\nPASSED tests/test_install.py::test_install_easy_packages[pycowsay-pycowsay]\nPASSED tests/test_install.py::test_install_easy_packages[black-black==22.8.0]\nPASSED tests/test_install.py::test_install_easy_multiple_packages\nPASSED tests/test_install.py::test_install_easy_packages_globally[pycowsay-pycowsay]\nPASSED tests/test_install.py::test_install_easy_packages_globally[black-black==22.8.0]\nPASSED tests/test_install.py::test_install_tricky_packages[cloudtoken-cloudtoken==0.1.707]\nPASSED tests/test_install.py::test_install_tricky_packages[awscli-awscli==1.18.168]\nPASSED tests/test_install.py::test_install_tricky_packages[ansible-ansible==2.9.13]\nPASSED tests/test_install.py::test_install_tricky_packages[shell-functools-shell-functools==0.3.0]\nPASSED tests/test_install.py::test_install_tricky_multiple_packages\nPASSED tests/test_install.py::test_install_package_specs[pycowsay-git+https://github.com/cs01/pycowsay.git@master]\nPASSED tests/test_install.py::test_install_package_specs[pylint-pylint==2.3.1]\nPASSED tests/test_install.py::test_install_package_specs[nox-https://github.com/wntrblm/nox/archive/2022.1.7.zip]\nPASSED tests/test_install.py::test_force_install\nPASSED tests/test_install.py::test_install_no_packages_found\nPASSED tests/test_install.py::test_install_same_package_twice_no_force\nPASSED tests/test_install.py::test_include_deps\nPASSED tests/test_install.py::test_name_tricky_characters[zest-releaser-zest.releaser==8.0.0]\nPASSED tests/test_install.py::test_name_tricky_characters[tox-ini-fmt-tox-ini-fmt==0.5.0]\nPASSED tests/test_install.py::test_extra\nPASSED tests/test_install.py::test_install_local_extra\nPASSED tests/test_install.py::test_path_warning\nPASSED tests/test_install.py::test_existing_symlink_points_to_existing_wrong_location_warning\nPASSED tests/test_install.py::test_existing_man_page_symlink_points_to_existing_wrong_location_warning\nPASSED tests/test_install.py::test_existing_symlink_points_to_nothing\nPASSED tests/test_install.py::test_existing_man_page_symlink_points_to_nothing\nPASSED tests/test_install.py::test_pip_args_forwarded_to_shared_libs\nPASSED tests/test_install.py::test_pip_args_forwarded_to_package_name_determination\nPASSED tests/test_install.py::test_install_suffix\nPASSED tests/test_install.py::test_man_page_install\nPASSED tests/test_install.py::test_install_pip_failure\nPASSED tests/test_install.py::test_install_local_archive\nPASSED tests/test_install.py::test_force_install_changes\nPASSED tests/test_install.py::test_force_install_changes_editable\nPASSED tests/test_install.py::test_preinstall\nPASSED tests/test_install.py::test_preinstall_multiple\nPASSED tests/test_install.py::test_passed_python_and_force_flag_warning\nPASSED tests/test_install.py::test_install_fetch_missing_python_invalid[3.0]\nPASSED tests/test_install.py::test_install_fetch_missing_python_invalid[3.1]\nSKIPPED [1] tests/test_install.py:253: Test pip arguments with Windows path on Windows only.\nXPASS tests/test_install.py::test_do_not_wait_for_input\n============= 40 passed, 1 skipped, 1 xpassed in 175.42s (0:02:55) =============\n","stderr_tail":"","stdout_sha256":"c06d2fb465cc507105060e34ce1b10b097727cc0d5fb2f11c50c02a3fb914a06","log_path":"~/dev/nebius-hackathon/pilot/v2-P/pypa__pipx-1350/runs/pilot-pypa__pipx-1350-54fbd8f247/logs/agent1/agent1-6.log","tree_digest":"090ef41296b9b32e05cb92fb115213439ada19aa66a7adc7a7aec54c8497138a","tree_download_s":22.222104124957696,"started_at":"2026-10-03T18:33:28.013352Z","duration_s":104.40388300000001,"timed_out":false,"image_before":"8657457e-e271-46d9-9519-2e0b9f22a896","image_after":"5e197588-9a1a-4afc-a9b2-70fae02a8a3e","junit":{"passed":["tests/test_install.py::test_help_text","tests/test_install.py::test_install_easy_packages[pycowsay-pycowsay]","tests/test_install.py::test_install_easy_packages[black-black==22.8.0]","tests/test_install.py::test_install_easy_multiple_packages","tests/test_install.py::test_install_easy_packages_globally[pycowsay-pycowsay]","tests/test_install.py::test_install_easy_packages_globally[black-black==22.8.0]","tests/test_install.py::test_install_tricky_packages[cloudtoken-cloudtoken==0.1.707]","tests/test_install.py::test_install_tricky_packages[awscli-awscli==1.18.168]","tests/test_install.py::test_install_tricky_packages[ansible-ansible==2.9.13]","tests/test_install.py::test_install_tricky_packages[shell-functools-shell-functools==0.3.0]","tests/test_install.py::test_install_tricky_multiple_packages","tests/test_install.py::test_install_package_specs[pycowsay-git+https://github.com/cs01/pycowsay.git@master]","tests/test_install.py::test_install_package_specs[pylint-pylint==2.3.1]","tests/test_install.py::test_install_package_specs[nox-https://github.com/wntrblm/nox/archive/2022.1.7.zip]","tests/test_install.py::test_force_install","tests/test_install.py::test_install_no_packages_found","tests/test_install.py::test_install_same_package_twice_no_force","tests/test_install.py::test_include_deps","tests/test_install.py::test_name_tricky_characters[zest-releaser-zest.releaser==8.0.0]","tests/test_install.py::test_name_tricky_characters[tox-ini-fmt-tox-ini-fmt==0.5.0]","tests/test_install.py::test_extra","tests/test_install.py::test_install_local_extra","tests/test_install.py::test_path_warning","tests/test_install.py::test_existing_symlink_points_to_existing_wrong_location_warning","tests/test_install.py::test_existing_man_page_symlink_points_to_existing_wrong_location_warning","tests/test_install.py::test_existing_symlink_points_to_nothing","tests/test_install.py::test_existing_man_page_symlink_points_to_nothing","tests/test_install.py::test_pip_args_forwarded_to_shared_libs","tests/test_install.py::test_pip_args_forwarded_to_package_name_determination","tests/test_install.py::test_install_suffix","tests/test_install.py::test_man_page_install","tests/test_install.py::test_install_pip_failure","tests/test_install.py::test_install_local_archive","tests/test_install.py::test_force_install_changes","tests/test_install.py::test_force_install_changes_editable","tests/test_install.py::test_preinstall","tests/test_install.py::test_preinstall_multiple","tests/test_install.py::test_do_not_wait_for_input","tests/test_install.py::test_passed_python_and_force_flag_warning","tests/test_install.py::test_install_fetch_missing_python_invalid[3.0]","tests/test_install.py::test_install_fetch_missing_python_invalid[3.1]"],"failed":[],"errors":[],"skipped":["tests/test_install.py::test_pip_args_with_windows_path"],"collection_errors":[],"failure_text":{}},"diff":null,"patch_sha256":null,"dropped_paths":[],"snapshot_sha":null}
{"receipt_id":"agent1-7","seq":7,"branch_id":"agent1","kind":"diff","cmd":"compute patch in executor staging agent1-7c0e493493504992ad3c7d0e65c35fdd: /opt/homebrew/Cellar/git/2.53.0/bin/git -c core.hooksPath=/dev/null -c core.attributesFile=/dev/null -c diff.external= -c core.quotePath=false add -A && /opt/homebrew/Cellar/git/2.53.0/bin/git -c core.hooksPath=/dev/null -c core.attributesFile=/dev/null -c diff.external= -c core.quotePath=false diff --cached --binary --no-ext-diff --no-textconv --no-renames 7233182cd15918909459a8c4afa42df3c3370c02","path":null,"exit_code":0,"stdout_tail":"diff --git a/src/pipx/standalone_python.py b/src/pipx/standalone_python.py\nindex 8d772f5..51322f4 100644\n--- a/src/pipx/standalone_python.py\n+++ b/src/pipx/standalone_python.py\n@@ -193,8 +193,10 @@ def list_pythons() -> Dict[str, str]:\n def resolve_python_version(requested_version: str):\n     pythons = list_pythons()\n \n+    requested_parts = [int(part) for part in requested_version.split(\".\")]\n     for version, version_download_link in pythons.items():\n-        if version.startswith(requested_version):\n+        version_parts = [int(part) for part in version.split(\".\")]\n+        if version_parts[:len(requested_parts)] == requested_parts:\n             python_version = version\n             download_link = version_download_link\n             break\n","stderr_tail":"","stdout_sha256":"93dd989b7aef8bcd53a72e6535932e242ef2e7a44e613c8db3f3f7b9a329dc71","log_path":null,"tree_digest":"090ef41296b9b32e05cb92fb115213439ada19aa66a7adc7a7aec54c8497138a","tree_download_s":21.310081166913733,"started_at":"2026-10-03T18:38:17.996209Z","duration_s":0.044095832854509354,"timed_out":false,"image_before":"5e197588-9a1a-4afc-a9b2-70fae02a8a3e","image_after":"5e197588-9a1a-4afc-a9b2-70fae02a8a3e","junit":null,"diff":{"files":[{"path":"src/pipx/standalone_python.py","added":3,"deleted":1,"category":"source","status":"modified"}],"patch_sha256":"93dd989b7aef8bcd53a72e6535932e242ef2e7a44e613c8db3f3f7b9a329dc71","patch_path":"~/dev/nebius-hackathon/pilot/v2-P/pypa__pipx-1350/runs/pilot-pypa__pipx-1350-54fbd8f247/artifacts/agent1/agent1-7.patch"},"patch_sha256":"93dd989b7aef8bcd53a72e6535932e242ef2e7a44e613c8db3f3f7b9a329dc71","dropped_paths":[],"snapshot_sha":"7233182cd15918909459a8c4afa42df3c3370c02"}
