{"receipt_id":"agent1-1","seq":1,"branch_id":"agent1","kind":"command","cmd":"git ls-files -z","path":null,"exit_code":0,"stdout_tail":".github/workflows/ci.yml\u0000.gitignore\u0000.pre-commit-hooks.yaml\u0000AUTHORS.rst\u0000LICENSE\u0000MANIFEST.in\u0000Makefile\u0000README.rst\u0000docformatter.py\u0000images/pycharm-file-watcher-configurations.png\u0000pyproject.toml\u0000setup.py\u0000tests/__init__.py\u0000tests/_data/pyproject.toml\u0000tests/_data/setup.cfg\u0000tests/_data/tox.ini\u0000tests/conftest.py\u0000tests/test_configuration_functions.py\u0000tests/test_docformatter.py\u0000tests/test_encoding_functions.py\u0000tests/test_format_code.py\u0000tests/test_format_docstring.py\u0000tests/test_string_functions.py\u0000tests/test_utility_functions.py\u0000","stderr_tail":"","stdout_sha256":"881592a98967a9925f692b244dd36c569f6ca3e69d82e51e797ac986c39be459","log_path":"~/dev/nebius-hackathon/pilot/v2-P/pycqa__docformatter-104/runs/pilot-pycqa__docformatter-104-81a216bf2b/logs/agent1/agent1-1.log","tree_digest":null,"tree_download_s":null,"started_at":"2026-10-03T18:46:51.097160Z","duration_s":0.003329,"timed_out":false,"image_before":"f585575b-28cb-4e7c-975b-bc78eaa9bdcf","image_after":"4217743d-8837-48bc-96ca-fe54d5ec46c2","junit":null,"diff":null,"patch_sha256":null,"dropped_paths":[],"snapshot_sha":null}
{"receipt_id":"agent1-2","seq":2,"branch_id":"agent1","kind":"command","cmd":"grep -rn -- close_quotes_on_newline tests","path":null,"exit_code":0,"stdout_tail":"tests/test_format_docstring.py:461:                close_quotes_on_newline=True,\ntests/test_format_docstring.py:481:                close_quotes_on_newline=True,\n","stderr_tail":"","stdout_sha256":"5b9c45def6ad78d28e8e42ce5e6bc384aaacf3f7fa2ca709a5af67c35d7896e8","log_path":"~/dev/nebius-hackathon/pilot/v2-P/pycqa__docformatter-104/runs/pilot-pycqa__docformatter-104-81a216bf2b/logs/agent1/agent1-2.log","tree_digest":null,"tree_download_s":null,"started_at":"2026-10-03T18:47:03.908853Z","duration_s":0.003608,"timed_out":false,"image_before":"4217743d-8837-48bc-96ca-fe54d5ec46c2","image_after":"5298e8ce-3cef-48d7-9bcd-b7007627a7ab","junit":null,"diff":null,"patch_sha256":null,"dropped_paths":[],"snapshot_sha":null}
{"receipt_id":"agent1-3","seq":3,"branch_id":"agent1","kind":"write","cmd":"/opt/receipts-9163f25d10304156998e518b716f4d86/bin/busybox sh -c 'mkdir -p /docformatter && cp /opt/receipts-9163f25d10304156998e518b716f4d86/incoming/97e4afe83f107fe6f3116d10e8ac90cc327dfa90f80cfad53b020bd2f1d09983 /docformatter/docformatter.py'","path":"docformatter.py","exit_code":0,"stdout_tail":"","stderr_tail":"","stdout_sha256":"97e4afe83f107fe6f3116d10e8ac90cc327dfa90f80cfad53b020bd2f1d09983","log_path":"~/dev/nebius-hackathon/pilot/v2-P/pycqa__docformatter-104/runs/pilot-pycqa__docformatter-104-81a216bf2b/logs/agent1/agent1-3.log","tree_digest":null,"tree_download_s":null,"started_at":"2026-10-03T18:47:14.736468Z","duration_s":0.004537,"timed_out":false,"image_before":"5298e8ce-3cef-48d7-9bcd-b7007627a7ab","image_after":"0a1ec669-1fc3-424e-8a37-012f91113445","junit":null,"diff":null,"patch_sha256":null,"dropped_paths":[],"snapshot_sha":null}
{"receipt_id":"agent1-4","seq":4,"branch_id":"agent1","kind":"write","cmd":"/opt/receipts-ba4f8e906f7c410bb456795127e95fd8/bin/busybox sh -c 'mkdir -p /docformatter && cp /opt/receipts-ba4f8e906f7c410bb456795127e95fd8/incoming/b5330dc0fba40743b1d09a0f255f77a9a10e1b5f7308d5a880e168682c3da789 /docformatter/docformatter.py'","path":"docformatter.py","exit_code":0,"stdout_tail":"","stderr_tail":"","stdout_sha256":"b5330dc0fba40743b1d09a0f255f77a9a10e1b5f7308d5a880e168682c3da789","log_path":"~/dev/nebius-hackathon/pilot/v2-P/pycqa__docformatter-104/runs/pilot-pycqa__docformatter-104-81a216bf2b/logs/agent1/agent1-4.log","tree_digest":null,"tree_download_s":null,"started_at":"2026-10-03T18:47:19.842318Z","duration_s":0.004637,"timed_out":false,"image_before":"0a1ec669-1fc3-424e-8a37-012f91113445","image_after":"eab902fa-dc47-4d38-b414-a3c98941ca22","junit":null,"diff":null,"patch_sha256":null,"dropped_paths":[],"snapshot_sha":null}
{"receipt_id":"agent1-5","seq":5,"branch_id":"agent1","kind":"command","cmd":"grep -rn -- 'format_docstring\\(' docformatter.py","path":null,"exit_code":2,"stdout_tail":"","stderr_tail":"grep: Unmatched ( or \\(\n","stdout_sha256":"7e0342684c6f997b8b0b70aa9fcb6329958e7d0b91befd48a4ef3b32e8deb801","log_path":"~/dev/nebius-hackathon/pilot/v2-P/pycqa__docformatter-104/runs/pilot-pycqa__docformatter-104-81a216bf2b/logs/agent1/agent1-5.log","tree_digest":null,"tree_download_s":null,"started_at":"2026-10-03T18:47:25.018821Z","duration_s":0.002827,"timed_out":false,"image_before":"eab902fa-dc47-4d38-b414-a3c98941ca22","image_after":"93627304-44bf-4e32-9645-a4bda1c0ed5e","junit":null,"diff":null,"patch_sha256":null,"dropped_paths":[],"snapshot_sha":null}
{"receipt_id":"agent1-6","seq":6,"branch_id":"agent1","kind":"command","cmd":"grep -rn -- format_docstring docformatter.py","path":null,"exit_code":0,"stdout_tail":"446:            token_string = format_docstring(\n483:def format_docstring(\n","stderr_tail":"","stdout_sha256":"71f512d81bbb98f82aea0fc82bb3e7492a85bd0ebb5a751aec8430381e63f02b","log_path":"~/dev/nebius-hackathon/pilot/v2-P/pycqa__docformatter-104/runs/pilot-pycqa__docformatter-104-81a216bf2b/logs/agent1/agent1-6.log","tree_digest":null,"tree_download_s":null,"started_at":"2026-10-03T18:47:28.007475Z","duration_s":0.002827,"timed_out":false,"image_before":"93627304-44bf-4e32-9645-a4bda1c0ed5e","image_after":"e5385a40-18dd-42e0-91cd-953cba6e0207","junit":null,"diff":null,"patch_sha256":null,"dropped_paths":[],"snapshot_sha":null}
{"receipt_id":"agent1-7","seq":7,"branch_id":"agent1","kind":"write","cmd":"/opt/receipts-95f075b97ad540f8a7570c99fcd92ab3/bin/busybox sh -c 'mkdir -p /docformatter && cp /opt/receipts-95f075b97ad540f8a7570c99fcd92ab3/incoming/c2d6cb21e2da17cbe0a5b940b5c1d37a1bcc97cfc18d95861a2690012729cf8b /docformatter/docformatter.py'","path":"docformatter.py","exit_code":0,"stdout_tail":"","stderr_tail":"","stdout_sha256":"c2d6cb21e2da17cbe0a5b940b5c1d37a1bcc97cfc18d95861a2690012729cf8b","log_path":"~/dev/nebius-hackathon/pilot/v2-P/pycqa__docformatter-104/runs/pilot-pycqa__docformatter-104-81a216bf2b/logs/agent1/agent1-7.log","tree_digest":null,"tree_download_s":null,"started_at":"2026-10-03T18:47:35.390781Z","duration_s":0.004887,"timed_out":false,"image_before":"e5385a40-18dd-42e0-91cd-953cba6e0207","image_after":"8fb6e95a-c992-4363-b114-077f5a238887","junit":null,"diff":null,"patch_sha256":null,"dropped_paths":[],"snapshot_sha":null}
{"receipt_id":"agent1-8","seq":8,"branch_id":"agent1","kind":"command","cmd":"/opt/receipts-6eaff2e367db48c5a3a06158b2de83ef/bin/busybox mkdir -p /opt/receipts/reports && python -I /opt/receipts-6eaff2e367db48c5a3a06158b2de83ef/receipts_pytest.py tests/test_format_docstring.py::TestFormatWrap::test_format_docstring_for_multi_line_summary_alone -xvs -o junit_family=xunit1 -p no:cacheprovider -rA --continue-on-collection-errors --junitxml=/opt/receipts/reports/agent1-8.xml","path":null,"exit_code":0,"stdout_tail":"============================= test session starts ==============================\nplatform linux -- Python 3.10.19, pytest-9.0.2, pluggy-1.6.0 -- /usr/local/bin/python\nrootdir: /docformatter\nconfigfile: pyproject.toml\nplugins: cov-7.0.0\ncollecting ... collected 1 item\n\ntests/test_format_docstring.py::TestFormatWrap::test_format_docstring_for_multi_line_summary_alone PASSED\n\n==================================== PASSES ====================================\n------------ generated xml file: /opt/receipts/reports/agent1-8.xml ------------\n=========================== short test summary info ============================\nPASSED tests/test_format_docstring.py::TestFormatWrap::test_format_docstring_for_multi_line_summary_alone\n============================== 1 passed in 0.05s ===============================\n","stderr_tail":"","stdout_sha256":"4f545728909f4c46fef0be2f544f329454d028828454bc70f0164adc34e22d52","log_path":"~/dev/nebius-hackathon/pilot/v2-P/pycqa__docformatter-104/runs/pilot-pycqa__docformatter-104-81a216bf2b/logs/agent1/agent1-8.log","tree_digest":"8bedad0c78d92306a368b08940c4bc0525368298f5549f3bc616aae7413d63b2","tree_download_s":2.198788624955341,"started_at":"2026-10-03T18:47:41.832150Z","duration_s":0.575077,"timed_out":false,"image_before":"8fb6e95a-c992-4363-b114-077f5a238887","image_after":"36acdd0a-0925-47f8-ae64-b4cfc1d4ceb0","junit":{"passed":["tests/test_format_docstring.py::TestFormatWrap::test_format_docstring_for_multi_line_summary_alone"],"failed":[],"errors":[],"skipped":[],"collection_errors":[],"failure_text":{}},"diff":null,"patch_sha256":null,"dropped_paths":[],"snapshot_sha":null}
{"receipt_id":"agent1-9","seq":9,"branch_id":"agent1","kind":"command","cmd":"/opt/receipts-8d8c17cd9d4c4d6ca5b7333329af9599/bin/busybox mkdir -p /opt/receipts/reports && python -I /opt/receipts-8d8c17cd9d4c4d6ca5b7333329af9599/receipts_pytest.py tests/test_format_docstring.py::TestFormatWrap::test_format_docstring_for_one_line_summary_alone_but_too_long -xvs -o junit_family=xunit1 -p no:cacheprovider -rA --continue-on-collection-errors --junitxml=/opt/receipts/reports/agent1-9.xml","path":null,"exit_code":1,"stdout_tail":"============================= test session starts ==============================\nplatform linux -- Python 3.10.19, pytest-9.0.2, pluggy-1.6.0 -- /usr/local/bin/python\nrootdir: /docformatter\nconfigfile: pyproject.toml\nplugins: cov-7.0.0\ncollecting ... collected 1 item\n\ntests/test_format_docstring.py::TestFormatWrap::test_format_docstring_for_one_line_summary_alone_but_too_long FAILED\n\n=================================== FAILURES ===================================\n_ TestFormatWrap.test_format_docstring_for_one_line_summary_alone_but_too_long _\n\nself = <tests.test_format_docstring.TestFormatWrap object at 0x7ffff6e13100>\n\n        @pytest.mark.unit\n        def test_format_docstring_for_one_line_summary_alone_but_too_long(self):\n            \"\"\"\"\"\"\n>           assert (\n                (\n                    '''\\\n    \"\"\"This one-line docstring will not be wrapped and quotes will be in-line.\"\"\"\\\n    '''\n                )\n                == docformatter.format_docstring(\n                    \"    \",\n                    '''\\\n    \"\"\"This one-line docstring will not be wrapped and quotes will be\n    in-line.\"\"\"\\\n    ''',\n                    summary_wrap_length=88,\n                    close_quotes_on_newline=True,\n                )\n            )\nE           assert '\"\"\"This one-...e in-line.\"\"\"' == '\"\"\"This one-...ine.\\n    \"\"\"'\nE             \nE             - \"\"\"This one-line docstring will not be wrapped and quotes will be in-line.\nE             ?                                                                           ^\nE             + \"\"\"This one-line docstring will not be wrapped and quotes will be in-line.\"\"\"\nE             ?                                                                           ^^^\nE             -     \"\"\"\n\ntests/test_format_docstring.py:468: AssertionError\n------------ generated xml file: /opt/receipts/reports/agent1-9.xml ------------\n=========================== short test summary info ============================\nFAILED tests/test_format_docstring.py::TestFormatWrap::test_format_docstring_for_one_line_summary_alone_but_too_long\n!!!!!!!!!!!!!!!!!!!!!!!!!! stopping after 1 failures !!!!!!!!!!!!!!!!!!!!!!!!!!!\n============================== 1 failed in 0.07s ===============================\n","stderr_tail":"","stdout_sha256":"5b0cdc083802bf110422ac577a069b5a8510d0a205a733a531df6dc09328954d","log_path":"~/dev/nebius-hackathon/pilot/v2-P/pycqa__docformatter-104/runs/pilot-pycqa__docformatter-104-81a216bf2b/logs/agent1/agent1-9.log","tree_digest":"8bedad0c78d92306a368b08940c4bc0525368298f5549f3bc616aae7413d63b2","tree_download_s":2.6233237080741674,"started_at":"2026-10-03T18:47:47.465598Z","duration_s":0.570659,"timed_out":false,"image_before":"36acdd0a-0925-47f8-ae64-b4cfc1d4ceb0","image_after":"162cbc26-1521-4124-8dc5-9059ca7abb97","junit":{"passed":[],"failed":["tests/test_format_docstring.py::TestFormatWrap::test_format_docstring_for_one_line_summary_alone_but_too_long"],"errors":[],"skipped":[],"collection_errors":[],"failure_text":{"tests/test_format_docstring.py::TestFormatWrap::test_format_docstring_for_one_line_summary_alone_but_too_long":"assert '\"\"\"This one-...e in-line.\"\"\"' == '\"\"\"This one-...ine.\\n    \"\"\"'\n  \n  - \"\"\"This one-line docstring will not be wrapped and quotes will be in-line.\n  ?                                                                           ^\n  + \"\"\"This one-line docstring will not be wrapped and quotes will be in-line.\"\"\"\n  ?                                                                           ^^^\n  -     \"\"\"\nself = <tests.test_format_docstring.TestFormatWrap object at 0x7ffff6e13100>\n\n        @pytest.mark.unit\n        def test_format_docstring_for_one_line_summary_alone_but_too_long(self):\n            \"\"\"\"\"\"\n>           assert (\n                (\n                    '''\\\n    \"\"\"This one-line docstring will not be wrapped and quotes will be in-line.\"\"\"\\\n    '''\n                )\n                == docformatter.format_docstring(\n                    \"    \",\n                    '''\\\n    \"\"\"This one-line docstring will not be wrapped and quotes will be\n    in-line.\"\"\"\\\n    ''',\n                    summary_wrap_length=88,\n                    close_quotes_on_newline=True,\n                )\n            )\nE           assert '\"\"\"This one-...e in-line.\"\"\"' == '\"\"\"This one-...ine.\\n    \"\"\"'\nE             \nE             - \"\"\"This one-line docstring will not be wrapped and quotes will be in-line.\nE             ?                                                                           ^\nE             + \"\"\"This one-line docstring will not be wrapped and quotes will be in-line.\"\"\"\nE             ?                                                                           ^^^\nE             -     \"\"\"\n\ntests/test_format_docstring.py:468: AssertionError"}},"diff":null,"patch_sha256":null,"dropped_paths":[],"snapshot_sha":null}
{"receipt_id":"agent1-10","seq":10,"branch_id":"agent1","kind":"write","cmd":"/opt/receipts-7757fbb4107941d9aa5d6ab5173bea01/bin/busybox sh -c 'mkdir -p /docformatter && cp /opt/receipts-7757fbb4107941d9aa5d6ab5173bea01/incoming/7630a212461d9df61d3e709a9afb9ec8fb6d361d56fd5020e5859d4249818d09 /docformatter/docformatter.py'","path":"docformatter.py","exit_code":0,"stdout_tail":"","stderr_tail":"","stdout_sha256":"7630a212461d9df61d3e709a9afb9ec8fb6d361d56fd5020e5859d4249818d09","log_path":"~/dev/nebius-hackathon/pilot/v2-P/pycqa__docformatter-104/runs/pilot-pycqa__docformatter-104-81a216bf2b/logs/agent1/agent1-10.log","tree_digest":null,"tree_download_s":null,"started_at":"2026-10-03T18:47:58.937188Z","duration_s":0.005097,"timed_out":false,"image_before":"162cbc26-1521-4124-8dc5-9059ca7abb97","image_after":"26513dc4-2a8d-45a4-929f-09413c6bc7d4","junit":null,"diff":null,"patch_sha256":null,"dropped_paths":[],"snapshot_sha":null}
{"receipt_id":"agent1-11","seq":11,"branch_id":"agent1","kind":"command","cmd":"/opt/receipts-0835e7fe8a864d839fd0886d0fa8ee82/bin/busybox mkdir -p /opt/receipts/reports && python -I /opt/receipts-0835e7fe8a864d839fd0886d0fa8ee82/receipts_pytest.py tests/test_format_docstring.py::TestFormatWrap::test_format_docstring_for_one_line_summary_alone_but_too_long -xvs -o junit_family=xunit1 -p no:cacheprovider -rA --continue-on-collection-errors --junitxml=/opt/receipts/reports/agent1-11.xml","path":null,"exit_code":0,"stdout_tail":"============================= test session starts ==============================\nplatform linux -- Python 3.10.19, pytest-9.0.2, pluggy-1.6.0 -- /usr/local/bin/python\nrootdir: /docformatter\nconfigfile: pyproject.toml\nplugins: cov-7.0.0\ncollecting ... collected 1 item\n\ntests/test_format_docstring.py::TestFormatWrap::test_format_docstring_for_one_line_summary_alone_but_too_long PASSED\n\n==================================== PASSES ====================================\n----------- generated xml file: /opt/receipts/reports/agent1-11.xml ------------\n=========================== short test summary info ============================\nPASSED tests/test_format_docstring.py::TestFormatWrap::test_format_docstring_for_one_line_summary_alone_but_too_long\n============================== 1 passed in 0.05s ===============================\n","stderr_tail":"","stdout_sha256":"64e25d86f7105ab1f20c5e066e056f017e9dfebe4b81858ee93800577c97349a","log_path":"~/dev/nebius-hackathon/pilot/v2-P/pycqa__docformatter-104/runs/pilot-pycqa__docformatter-104-81a216bf2b/logs/agent1/agent1-11.log","tree_digest":"06c93ff8bce5a21c2ee066f88ee46ea6e55c4620e266814e280c8d473d5c04c3","tree_download_s":1.953963665990159,"started_at":"2026-10-03T18:48:01.379525Z","duration_s":0.556572,"timed_out":false,"image_before":"26513dc4-2a8d-45a4-929f-09413c6bc7d4","image_after":"d077b03a-8a30-480a-9276-2a2c0907d75a","junit":{"passed":["tests/test_format_docstring.py::TestFormatWrap::test_format_docstring_for_one_line_summary_alone_but_too_long"],"failed":[],"errors":[],"skipped":[],"collection_errors":[],"failure_text":{}},"diff":null,"patch_sha256":null,"dropped_paths":[],"snapshot_sha":null}
{"receipt_id":"agent1-12","seq":12,"branch_id":"agent1","kind":"command","cmd":"/opt/receipts-1cc9adeecc8642bbbbc62665230e2a8c/bin/busybox mkdir -p /opt/receipts/reports && python -I /opt/receipts-1cc9adeecc8642bbbbc62665230e2a8c/receipts_pytest.py tests/test_format_docstring.py --no-header -rA --tb=line --color=no -p no:cacheprovider -W ignore::DeprecationWarning -o junit_family=xunit1 -p no:cacheprovider -rA --continue-on-collection-errors --junitxml=/opt/receipts/reports/agent1-12.xml","path":null,"exit_code":1,"stdout_tail":"============================= test session starts ==============================\ncollected 30 items\n\ntests/test_format_docstring.py ...............F......Fx......            [100%]\n\n=================================== FAILURES ===================================\nE   assert 78 <= 75\n     +  where 78 = len('         \"\"\"i cOxpLqZsBQmFwWVrHeXTvG IHK KpRUfGaiTxmhNlBP LchDjPVKJCE SEMC.\"\"\"')\n/docformatter/tests/test_format_docstring.py:292: assert 78 <= 75\nE   assert '\"\"\"num_itera...nvergence.\"\"\"' == '\"\"\"num_itera...nce.\\n    \"\"\"'\n      \n      Skipping 72 identical leading characters in diff, use -v to show\n      - inition of convergence.\n      -     \"\"\"\n      + inition of\n      +     convergence.\"\"\"\n/docformatter/tests/test_format_docstring.py:403: assert '\"\"\"num_itera...nvergence.\"\"\"' == '\"\"\"num_itera...nce.\\n    \"\"\"'\n==================================== PASSES ====================================\n----------- generated xml file: /opt/receipts/reports/agent1-12.xml ------------\n=========================== short test summary info ============================\nPASSED tests/test_format_docstring.py::TestFormatDocstring::test_format_docstring\nPASSED tests/test_format_docstring.py::TestFormatDocstring::test_format_docstring_with_summary_that_ends_in_quote\nPASSED tests/test_format_docstring.py::TestFormatDocstring::test_format_docstring_with_bad_indentation\nPASSED tests/test_format_docstring.py::TestFormatDocstring::test_format_docstring_with_too_much_indentation\nPASSED tests/test_format_docstring.py::TestFormatDocstring::test_format_docstring_with_trailing_whitespace\nPASSED tests/test_format_docstring.py::TestFormatDocstring::test_format_docstring_with_empty_docstring\nPASSED tests/test_format_docstring.py::TestFormatDocstring::test_format_docstring_with_no_period\nPASSED tests/test_format_docstring.py::TestFormatDocstring::test_format_docstring_with_single_quotes\nPASSED tests/test_format_docstring.py::TestFormatDocstring::test_format_docstring_with_single_quotes_multi_line\nPASSED tests/test_format_docstring.py::TestFormatDocstring::test_format_docstring_leave_underlined_summaries_alone\nPASSED tests/test_format_docstring.py::TestFormatLists::test_format_docstring_should_ignore_numbered_lists\nPASSED tests/test_format_docstring.py::TestFormatLists::test_format_docstring_should_ignore_parameter_lists\nPASSED tests/test_format_docstring.py::TestFormatLists::test_format_docstring_should_ignore_colon_parameter_lists\nPASSED tests/test_format_docstring.py::TestFormatLists::test_format_docstring_should_leave_list_alone\nPASSED tests/test_format_docstring.py::TestFormatWrap::test_unwrap_summary\nPASSED tests/test_format_docstring.py::TestFormatWrap::test_format_docstring_with_weird_indentation_and_punctuation\nPASSED tests/test_format_docstring.py::TestFormatWrap::test_format_docstring_with_description_wrapping\nPASSED tests/test_format_docstring.py::TestFormatWrap::test_format_docstring_should_ignore_multi_paragraph\nPASSED tests/test_format_docstring.py::TestFormatWrap::test_format_docstring_should_ignore_doctests\nPASSED tests/test_format_docstring.py::TestFormatWrap::test_format_docstring_should_ignore_doctests_in_summary\nPASSED tests/test_format_docstring.py::TestFormatWrap::test_format_docstring_should_maintain_indentation_of_doctest\nPASSED tests/test_format_docstring.py::TestFormatWrap::test_format_docstring_for_multi_line_summary_alone\nPASSED tests/test_format_docstring.py::TestFormatWrap::test_format_docstring_for_one_line_summary_alone_but_too_long\nPASSED tests/test_format_docstring.py::TestFormatStyleOptions::test_format_docstring_with_no_post_description_blank\nPASSED tests/test_format_docstring.py::TestFormatStyleOptions::test_format_docstring_with_pre_summary_newline\nPASSED tests/test_format_docstring.py::TestFormatStyleOptions::test_format_docstring_make_summary_multi_line\nPASSED tests/test_format_docstring.py::TestFormatStyleOptions::test_format_docstring_pre_summary_space\nXFAIL tests/test_format_docstring.py::TestFormatWrap::test_format_docstring_with_summary_only_and_wrap_and_tab_indentation\nFAILED tests/test_format_docstring.py::TestFormatWrap::test_format_docstring_with_wrap\nFAILED tests/test_format_docstring.py::TestFormatWrap::test_force_wrap - asse...\n=================== 2 failed, 27 passed, 1 xfailed in 0.15s ====================\n","stderr_tail":"","stdout_sha256":"002cf9f88e2cf4f8d576f76cec2ee5db0a3f5505ed064b8c03428fd07df371ef","log_path":"~/dev/nebius-hackathon/pilot/v2-P/pycqa__docformatter-104/runs/pilot-pycqa__docformatter-104-81a216bf2b/logs/agent1/agent1-12.log","tree_digest":"06c93ff8bce5a21c2ee066f88ee46ea6e55c4620e266814e280c8d473d5c04c3","tree_download_s":2.0600147501099855,"started_at":"2026-10-03T18:48:06.803197Z","duration_s":0.64338,"timed_out":false,"image_before":"d077b03a-8a30-480a-9276-2a2c0907d75a","image_after":"bf09af1f-8cdc-4997-a672-5bc182483079","junit":{"passed":["tests/test_format_docstring.py::TestFormatDocstring::test_format_docstring","tests/test_format_docstring.py::TestFormatDocstring::test_format_docstring_with_summary_that_ends_in_quote","tests/test_format_docstring.py::TestFormatDocstring::test_format_docstring_with_bad_indentation","tests/test_format_docstring.py::TestFormatDocstring::test_format_docstring_with_too_much_indentation","tests/test_format_docstring.py::TestFormatDocstring::test_format_docstring_with_trailing_whitespace","tests/test_format_docstring.py::TestFormatDocstring::test_format_docstring_with_empty_docstring","tests/test_format_docstring.py::TestFormatDocstring::test_format_docstring_with_no_period","tests/test_format_docstring.py::TestFormatDocstring::test_format_docstring_with_single_quotes","tests/test_format_docstring.py::TestFormatDocstring::test_format_docstring_with_single_quotes_multi_line","tests/test_format_docstring.py::TestFormatDocstring::test_format_docstring_leave_underlined_summaries_alone","tests/test_format_docstring.py::TestFormatLists::test_format_docstring_should_ignore_numbered_lists","tests/test_format_docstring.py::TestFormatLists::test_format_docstring_should_ignore_parameter_lists","tests/test_format_docstring.py::TestFormatLists::test_format_docstring_should_ignore_colon_parameter_lists","tests/test_format_docstring.py::TestFormatLists::test_format_docstring_should_leave_list_alone","tests/test_format_docstring.py::TestFormatWrap::test_unwrap_summary","tests/test_format_docstring.py::TestFormatWrap::test_format_docstring_with_weird_indentation_and_punctuation","tests/test_format_docstring.py::TestFormatWrap::test_format_docstring_with_description_wrapping","tests/test_format_docstring.py::TestFormatWrap::test_format_docstring_should_ignore_multi_paragraph","tests/test_format_docstring.py::TestFormatWrap::test_format_docstring_should_ignore_doctests","tests/test_format_docstring.py::TestFormatWrap::test_format_docstring_should_ignore_doctests_in_summary","tests/test_format_docstring.py::TestFormatWrap::test_format_docstring_should_maintain_indentation_of_doctest","tests/test_format_docstring.py::TestFormatWrap::test_format_docstring_for_multi_line_summary_alone","tests/test_format_docstring.py::TestFormatWrap::test_format_docstring_for_one_line_summary_alone_but_too_long","tests/test_format_docstring.py::TestFormatStyleOptions::test_format_docstring_with_no_post_description_blank","tests/test_format_docstring.py::TestFormatStyleOptions::test_format_docstring_with_pre_summary_newline","tests/test_format_docstring.py::TestFormatStyleOptions::test_format_docstring_make_summary_multi_line","tests/test_format_docstring.py::TestFormatStyleOptions::test_format_docstring_pre_summary_space"],"failed":["tests/test_format_docstring.py::TestFormatWrap::test_format_docstring_with_wrap","tests/test_format_docstring.py::TestFormatWrap::test_force_wrap"],"errors":[],"skipped":["tests/test_format_docstring.py::TestFormatWrap::test_format_docstring_with_summary_only_and_wrap_and_tab_indentation"],"collection_errors":[],"failure_text":{"tests/test_format_docstring.py::TestFormatWrap::test_format_docstring_with_wrap":"assert 78 <= 75\n +  where 78 = len('         \"\"\"i cOxpLqZsBQmFwWVrHeXTvG IHK KpRUfGaiTxmhNlBP LchDjPVKJCE SEMC.\"\"\"')\nE   assert 78 <= 75\n     +  where 78 = len('         \"\"\"i cOxpLqZsBQmFwWVrHeXTvG IHK KpRUfGaiTxmhNlBP LchDjPVKJCE SEMC.\"\"\"')","tests/test_format_docstring.py::TestFormatWrap::test_force_wrap":"assert '\"\"\"num_itera...nvergence.\"\"\"' == '\"\"\"num_itera...nce.\\n    \"\"\"'\n  \n  Skipping 72 identical leading characters in diff, use -v to show\n  - inition of convergence.\n  -     \"\"\"\n  + inition of\n  +     convergence.\"\"\"\nE   assert '\"\"\"num_itera...nvergence.\"\"\"' == '\"\"\"num_itera...nce.\\n    \"\"\"'\n      \n      Skipping 72 identical leading characters in diff, use -v to show\n      - inition of convergence.\n      -     \"\"\"\n      + inition of\n      +     convergence.\"\"\""}},"diff":null,"patch_sha256":null,"dropped_paths":[],"snapshot_sha":null}
{"receipt_id":"agent1-13","seq":13,"branch_id":"agent1","kind":"command","cmd":"grep -rn -- test_format_docstring_with_wrap tests/test_format_docstring.py","path":null,"exit_code":0,"stdout_tail":"270:    def test_format_docstring_with_wrap(self):\n","stderr_tail":"","stdout_sha256":"54334012ec630741af6370f7aaf6dc6d0bc9ee40ba9ed5938eb8a60439c04122","log_path":"~/dev/nebius-hackathon/pilot/v2-P/pycqa__docformatter-104/runs/pilot-pycqa__docformatter-104-81a216bf2b/logs/agent1/agent1-13.log","tree_digest":null,"tree_download_s":null,"started_at":"2026-10-03T18:48:14.025730Z","duration_s":0.00297,"timed_out":false,"image_before":"bf09af1f-8cdc-4997-a672-5bc182483079","image_after":"d11bf3c5-41e2-407d-a630-d08f925d0f9c","junit":null,"diff":null,"patch_sha256":null,"dropped_paths":[],"snapshot_sha":null}
{"receipt_id":"agent1-14","seq":14,"branch_id":"agent1","kind":"write","cmd":"/opt/receipts-27c31e7983864088a67fd509982f8b89/bin/busybox sh -c 'mkdir -p /docformatter && cp /opt/receipts-27c31e7983864088a67fd509982f8b89/incoming/5f448de023ec1c7f945e9fc57c1855a79f1e63d4d4c1adb8bd3a20b3dd041cfd /docformatter/docformatter.py'","path":"docformatter.py","exit_code":0,"stdout_tail":"","stderr_tail":"","stdout_sha256":"5f448de023ec1c7f945e9fc57c1855a79f1e63d4d4c1adb8bd3a20b3dd041cfd","log_path":"~/dev/nebius-hackathon/pilot/v2-P/pycqa__docformatter-104/runs/pilot-pycqa__docformatter-104-81a216bf2b/logs/agent1/agent1-14.log","tree_digest":null,"tree_download_s":null,"started_at":"2026-10-03T18:48:27.261167Z","duration_s":0.004668,"timed_out":false,"image_before":"d11bf3c5-41e2-407d-a630-d08f925d0f9c","image_after":"d11f8e3e-7e69-4f82-a1d9-665af657aaa5","junit":null,"diff":null,"patch_sha256":null,"dropped_paths":[],"snapshot_sha":null}
{"receipt_id":"agent1-15","seq":15,"branch_id":"agent1","kind":"command","cmd":"/opt/receipts-f7949663287c48388fb7be430a269889/bin/busybox mkdir -p /opt/receipts/reports && python -I /opt/receipts-f7949663287c48388fb7be430a269889/receipts_pytest.py tests/test_format_docstring.py::TestFormatWrap::test_format_docstring_with_wrap -xvs -o junit_family=xunit1 -p no:cacheprovider -rA --continue-on-collection-errors --junitxml=/opt/receipts/reports/agent1-15.xml","path":null,"exit_code":0,"stdout_tail":"============================= test session starts ==============================\nplatform linux -- Python 3.10.19, pytest-9.0.2, pluggy-1.6.0 -- /usr/local/bin/python\nrootdir: /docformatter\nconfigfile: pyproject.toml\nplugins: cov-7.0.0\ncollecting ... collected 1 item\n\ntests/test_format_docstring.py::TestFormatWrap::test_format_docstring_with_wrap PASSED\n\n==================================== PASSES ====================================\n----------- generated xml file: /opt/receipts/reports/agent1-15.xml ------------\n=========================== short test summary info ============================\nPASSED tests/test_format_docstring.py::TestFormatWrap::test_format_docstring_with_wrap\n============================== 1 passed in 0.18s ===============================\n","stderr_tail":"","stdout_sha256":"dad92eac240a2c248cfb6c1ede446e0a793589a4bb278cc434a99e324bd453ef","log_path":"~/dev/nebius-hackathon/pilot/v2-P/pycqa__docformatter-104/runs/pilot-pycqa__docformatter-104-81a216bf2b/logs/agent1/agent1-15.log","tree_digest":"67d39ec4ea2355f9469d8977c2e9663ad59dff2539645a3d0217d4dc42d7f203","tree_download_s":2.7382965839933604,"started_at":"2026-10-03T18:48:30.587426Z","duration_s":0.699842,"timed_out":false,"image_before":"d11f8e3e-7e69-4f82-a1d9-665af657aaa5","image_after":"9450dd95-1eae-4b57-9cd6-3c7c87d00015","junit":{"passed":["tests/test_format_docstring.py::TestFormatWrap::test_format_docstring_with_wrap"],"failed":[],"errors":[],"skipped":[],"collection_errors":[],"failure_text":{}},"diff":null,"patch_sha256":null,"dropped_paths":[],"snapshot_sha":null}
{"receipt_id":"agent1-16","seq":16,"branch_id":"agent1","kind":"command","cmd":"/opt/receipts-10adc8bc298241b69e05dc87ca01b880/bin/busybox mkdir -p /opt/receipts/reports && python -I /opt/receipts-10adc8bc298241b69e05dc87ca01b880/receipts_pytest.py tests/test_format_docstring.py::TestFormatWrap::test_force_wrap -xvs -o junit_family=xunit1 -p no:cacheprovider -rA --continue-on-collection-errors --junitxml=/opt/receipts/reports/agent1-16.xml","path":null,"exit_code":1,"stdout_tail":"============================= test session starts ==============================\nplatform linux -- Python 3.10.19, pytest-9.0.2, pluggy-1.6.0 -- /usr/local/bin/python\nrootdir: /docformatter\nconfigfile: pyproject.toml\nplugins: cov-7.0.0\ncollecting ... collected 1 item\n\ntests/test_format_docstring.py::TestFormatWrap::test_force_wrap FAILED\n\n=================================== FAILURES ===================================\n________________________ TestFormatWrap.test_force_wrap ________________________\n\nself = <tests.test_format_docstring.TestFormatWrap object at 0x7ffff6e138e0>\n\n        @pytest.mark.unit\n        def test_force_wrap(self):\n            \"\"\"Force even lists to be wrapped.\"\"\"\n>           assert (\n                (\n                    '''\\\n    \"\"\"num_iterations is the number of updates -\n        instead of a better definition of\n        convergence.\"\"\"\\\n    '''\n                )\n                == docformatter.format_docstring(\n                    \"    \",\n                    '''\\\n    \"\"\"\n    num_iterations is the number of updates - instead of a better definition of convergence.\n    \"\"\"\\\n    ''',\n                    description_wrap_length=50,\n                    summary_wrap_length=50,\n                    force_wrap=True,\n                )\n            )\nE           assert '\"\"\"num_itera...nvergence.\"\"\"' == '\"\"\"num_itera...nce.\\n    \"\"\"'\nE             \nE               \"\"\"num_iterations is the number of updates -\nE                   instead of a better definition of\nE             -     convergence.\nE             ?                 ^\nE             +     convergence.\"\"\"\nE             ?                 ^^^\nE             -     \"\"\"\n\ntests/test_format_docstring.py:403: AssertionError\n----------- generated xml file: /opt/receipts/reports/agent1-16.xml ------------\n=========================== short test summary info ============================\nFAILED tests/test_format_docstring.py::TestFormatWrap::test_force_wrap - asse...\n!!!!!!!!!!!!!!!!!!!!!!!!!! stopping after 1 failures !!!!!!!!!!!!!!!!!!!!!!!!!!!\n============================== 1 failed in 0.07s ===============================\n","stderr_tail":"","stdout_sha256":"aafff2df21f81b25f265d81d703ebabe27d7c900226b98e3e50a8ea6b3c7ee43","log_path":"~/dev/nebius-hackathon/pilot/v2-P/pycqa__docformatter-104/runs/pilot-pycqa__docformatter-104-81a216bf2b/logs/agent1/agent1-16.log","tree_digest":"67d39ec4ea2355f9469d8977c2e9663ad59dff2539645a3d0217d4dc42d7f203","tree_download_s":2.769255500053987,"started_at":"2026-10-03T18:48:37.745092Z","duration_s":0.577053,"timed_out":false,"image_before":"9450dd95-1eae-4b57-9cd6-3c7c87d00015","image_after":"766564c1-254f-4d2a-9440-7b1c68d6593e","junit":{"passed":[],"failed":["tests/test_format_docstring.py::TestFormatWrap::test_force_wrap"],"errors":[],"skipped":[],"collection_errors":[],"failure_text":{"tests/test_format_docstring.py::TestFormatWrap::test_force_wrap":"assert '\"\"\"num_itera...nvergence.\"\"\"' == '\"\"\"num_itera...nce.\\n    \"\"\"'\n  \n    \"\"\"num_iterations is the number of updates -\n        instead of a better definition of\n  -     convergence.\n  ?                 ^\n  +     convergence.\"\"\"\n  ?                 ^^^\n  -     \"\"\"\nself = <tests.test_format_docstring.TestFormatWrap object at 0x7ffff6e138e0>\n\n        @pytest.mark.unit\n        def test_force_wrap(self):\n            \"\"\"Force even lists to be wrapped.\"\"\"\n>           assert (\n                (\n                    '''\\\n    \"\"\"num_iterations is the number of updates -\n        instead of a better definition of\n        convergence.\"\"\"\\\n    '''\n                )\n                == docformatter.format_docstring(\n                    \"    \",\n                    '''\\\n    \"\"\"\n    num_iterations is the number of updates - instead of a better definition of convergence.\n    \"\"\"\\\n    ''',\n                    description_wrap_length=50,\n                    summary_wrap_length=50,\n                    force_wrap=True,\n                )\n            )\nE           assert '\"\"\"num_itera...nvergence.\"\"\"' == '\"\"\"num_itera...nce.\\n    \"\"\"'\nE             \nE               \"\"\"num_iterations is the number of updates -\nE                   instead of a better definition of\nE             -     convergence.\nE             ?                 ^\nE             +     convergence.\"\"\"\nE             ?                 ^^^\nE             -     \"\"\"\n\ntests/test_format_docstring.py:403: AssertionError"}},"diff":null,"patch_sha256":null,"dropped_paths":[],"snapshot_sha":null}
{"receipt_id":"agent1-17","seq":17,"branch_id":"agent1","kind":"write","cmd":"/opt/receipts-af0e97f9a3084e128b214db02ef6e073/bin/busybox sh -c 'mkdir -p /docformatter && cp /opt/receipts-af0e97f9a3084e128b214db02ef6e073/incoming/a72526387a4913c159e01ea6766626fb2731fa0c641d70806ae4b31a08e385cf /docformatter/docformatter.py'","path":"docformatter.py","exit_code":0,"stdout_tail":"","stderr_tail":"","stdout_sha256":"a72526387a4913c159e01ea6766626fb2731fa0c641d70806ae4b31a08e385cf","log_path":"~/dev/nebius-hackathon/pilot/v2-P/pycqa__docformatter-104/runs/pilot-pycqa__docformatter-104-81a216bf2b/logs/agent1/agent1-17.log","tree_digest":null,"tree_download_s":null,"started_at":"2026-10-03T18:49:03.287155Z","duration_s":0.004847,"timed_out":false,"image_before":"766564c1-254f-4d2a-9440-7b1c68d6593e","image_after":"3d44d326-0ef0-4d6f-a5ea-55c8eeadaf3e","junit":null,"diff":null,"patch_sha256":null,"dropped_paths":[],"snapshot_sha":null}
{"receipt_id":"agent1-18","seq":18,"branch_id":"agent1","kind":"command","cmd":"/opt/receipts-4304289d73f841b18d288eefd50d4285/bin/busybox mkdir -p /opt/receipts/reports && python -I /opt/receipts-4304289d73f841b18d288eefd50d4285/receipts_pytest.py tests/test_format_docstring.py::TestFormatWrap::test_force_wrap -xvs -o junit_family=xunit1 -p no:cacheprovider -rA --continue-on-collection-errors --junitxml=/opt/receipts/reports/agent1-18.xml","path":null,"exit_code":1,"stdout_tail":"============================= test session starts ==============================\nplatform linux -- Python 3.10.19, pytest-9.0.2, pluggy-1.6.0 -- /usr/local/bin/python\nrootdir: /docformatter\nconfigfile: pyproject.toml\nplugins: cov-7.0.0\ncollecting ... collected 1 item\n\ntests/test_format_docstring.py::TestFormatWrap::test_force_wrap FAILED\n\n=================================== FAILURES ===================================\n________________________ TestFormatWrap.test_force_wrap ________________________\n\nself = <tests.test_format_docstring.TestFormatWrap object at 0x7ffff6e138e0>\n\n        @pytest.mark.unit\n        def test_force_wrap(self):\n            \"\"\"Force even lists to be wrapped.\"\"\"\n>           assert (\n                (\n                    '''\\\n    \"\"\"num_iterations is the number of updates -\n        instead of a better definition of\n        convergence.\"\"\"\\\n    '''\n                )\n                == docformatter.format_docstring(\n                    \"    \",\n                    '''\\\n    \"\"\"\n    num_iterations is the number of updates - instead of a better definition of convergence.\n    \"\"\"\\\n    ''',\n                    description_wrap_length=50,\n                    summary_wrap_length=50,\n                    force_wrap=True,\n                )\n            )\nE           assert '\"\"\"num_itera...nvergence.\"\"\"' == '\"\"\"num_itera...nce.\\n    \"\"\"'\nE             \nE               \"\"\"num_iterations is the number of updates -\nE                   instead of a better definition of\nE             -     convergence.\nE             ?                 ^\nE             +     convergence.\"\"\"\nE             ?                 ^^^\nE             -     \"\"\"\n\ntests/test_format_docstring.py:403: AssertionError\n----------- generated xml file: /opt/receipts/reports/agent1-18.xml ------------\n=========================== short test summary info ============================\nFAILED tests/test_format_docstring.py::TestFormatWrap::test_force_wrap - asse...\n!!!!!!!!!!!!!!!!!!!!!!!!!! stopping after 1 failures !!!!!!!!!!!!!!!!!!!!!!!!!!!\n============================== 1 failed in 0.07s ===============================\n","stderr_tail":"","stdout_sha256":"de156d4b343a27d33369beb70d136883b3a83348efe604be156d32621f1e0888","log_path":"~/dev/nebius-hackathon/pilot/v2-P/pycqa__docformatter-104/runs/pilot-pycqa__docformatter-104-81a216bf2b/logs/agent1/agent1-18.log","tree_digest":"7c37b4e4ffd6a1ba95ccd211647d8343205a97c7b10220dd4bd66050eaabfa4c","tree_download_s":2.087287750095129,"started_at":"2026-10-03T18:49:06.166083Z","duration_s":0.5703269999999999,"timed_out":false,"image_before":"3d44d326-0ef0-4d6f-a5ea-55c8eeadaf3e","image_after":"42415469-b756-4885-9760-58284cb6e833","junit":{"passed":[],"failed":["tests/test_format_docstring.py::TestFormatWrap::test_force_wrap"],"errors":[],"skipped":[],"collection_errors":[],"failure_text":{"tests/test_format_docstring.py::TestFormatWrap::test_force_wrap":"assert '\"\"\"num_itera...nvergence.\"\"\"' == '\"\"\"num_itera...nce.\\n    \"\"\"'\n  \n    \"\"\"num_iterations is the number of updates -\n        instead of a better definition of\n  -     convergence.\n  ?                 ^\n  +     convergence.\"\"\"\n  ?                 ^^^\n  -     \"\"\"\nself = <tests.test_format_docstring.TestFormatWrap object at 0x7ffff6e138e0>\n\n        @pytest.mark.unit\n        def test_force_wrap(self):\n            \"\"\"Force even lists to be wrapped.\"\"\"\n>           assert (\n                (\n                    '''\\\n    \"\"\"num_iterations is the number of updates -\n        instead of a better definition of\n        convergence.\"\"\"\\\n    '''\n                )\n                == docformatter.format_docstring(\n                    \"    \",\n                    '''\\\n    \"\"\"\n    num_iterations is the number of updates - instead of a better definition of convergence.\n    \"\"\"\\\n    ''',\n                    description_wrap_length=50,\n                    summary_wrap_length=50,\n                    force_wrap=True,\n                )\n            )\nE           assert '\"\"\"num_itera...nvergence.\"\"\"' == '\"\"\"num_itera...nce.\\n    \"\"\"'\nE             \nE               \"\"\"num_iterations is the number of updates -\nE                   instead of a better definition of\nE             -     convergence.\nE             ?                 ^\nE             +     convergence.\"\"\"\nE             ?                 ^^^\nE             -     \"\"\"\n\ntests/test_format_docstring.py:403: AssertionError"}},"diff":null,"patch_sha256":null,"dropped_paths":[],"snapshot_sha":null}
{"receipt_id":"agent1-19","seq":19,"branch_id":"agent1","kind":"write","cmd":"/opt/receipts-e125aa96bd3d488aa857dbf6ac3c48f4/bin/busybox sh -c 'mkdir -p /docformatter && cp /opt/receipts-e125aa96bd3d488aa857dbf6ac3c48f4/incoming/e2131abff7d34caea944c6aadd21537adee3ff65a09bfe36ea2db945b9c3209f /docformatter/docformatter.py'","path":"docformatter.py","exit_code":0,"stdout_tail":"","stderr_tail":"","stdout_sha256":"e2131abff7d34caea944c6aadd21537adee3ff65a09bfe36ea2db945b9c3209f","log_path":"~/dev/nebius-hackathon/pilot/v2-P/pycqa__docformatter-104/runs/pilot-pycqa__docformatter-104-81a216bf2b/logs/agent1/agent1-19.log","tree_digest":null,"tree_download_s":null,"started_at":"2026-10-03T18:49:24.950865Z","duration_s":0.004579,"timed_out":false,"image_before":"42415469-b756-4885-9760-58284cb6e833","image_after":"76f51fdf-992c-47a7-83b2-67f3fedb7619","junit":null,"diff":null,"patch_sha256":null,"dropped_paths":[],"snapshot_sha":null}
{"receipt_id":"agent1-20","seq":20,"branch_id":"agent1","kind":"command","cmd":"/opt/receipts-998afd8a6f874ababec0200a26551cc3/bin/busybox mkdir -p /opt/receipts/reports && python -I /opt/receipts-998afd8a6f874ababec0200a26551cc3/receipts_pytest.py tests/test_format_docstring.py::TestFormatWrap::test_force_wrap -xvs -o junit_family=xunit1 -p no:cacheprovider -rA --continue-on-collection-errors --junitxml=/opt/receipts/reports/agent1-20.xml","path":null,"exit_code":0,"stdout_tail":"============================= test session starts ==============================\nplatform linux -- Python 3.10.19, pytest-9.0.2, pluggy-1.6.0 -- /usr/local/bin/python\nrootdir: /docformatter\nconfigfile: pyproject.toml\nplugins: cov-7.0.0\ncollecting ... collected 1 item\n\ntests/test_format_docstring.py::TestFormatWrap::test_force_wrap PASSED\n\n==================================== PASSES ====================================\n----------- generated xml file: /opt/receipts/reports/agent1-20.xml ------------\n=========================== short test summary info ============================\nPASSED tests/test_format_docstring.py::TestFormatWrap::test_force_wrap\n============================== 1 passed in 0.05s ===============================\n","stderr_tail":"","stdout_sha256":"090d808a4781eb24065926388bb5a3a6903f718a68bd2de84d3b489b2a086ef9","log_path":"~/dev/nebius-hackathon/pilot/v2-P/pycqa__docformatter-104/runs/pilot-pycqa__docformatter-104-81a216bf2b/logs/agent1/agent1-20.log","tree_digest":"87d27a4eda4a65ce622d660c393ecc94db06b708b43a802fafaffa32eadbdbd4","tree_download_s":2.4081849998328835,"started_at":"2026-10-03T18:49:27.866844Z","duration_s":0.554541,"timed_out":false,"image_before":"76f51fdf-992c-47a7-83b2-67f3fedb7619","image_after":"69b2d87a-cfae-4cab-bc06-21dd050065c3","junit":{"passed":["tests/test_format_docstring.py::TestFormatWrap::test_force_wrap"],"failed":[],"errors":[],"skipped":[],"collection_errors":[],"failure_text":{}},"diff":null,"patch_sha256":null,"dropped_paths":[],"snapshot_sha":null}
{"receipt_id":"agent1-21","seq":21,"branch_id":"agent1","kind":"command","cmd":"/opt/receipts-ab3e439ff0cd4decbc57d65ca045b788/bin/busybox mkdir -p /opt/receipts/reports && python -I /opt/receipts-ab3e439ff0cd4decbc57d65ca045b788/receipts_pytest.py tests/test_format_docstring.py::TestFormatWrap::test_format_docstring_for_multi_line_summary_alone tests/test_format_docstring.py::TestFormatWrap::test_format_docstring_for_one_line_summary_alone_but_too_long -xvs -o junit_family=xunit1 -p no:cacheprovider -rA --continue-on-collection-errors --junitxml=/opt/receipts/reports/agent1-21.xml","path":null,"exit_code":1,"stdout_tail":"============================= test session starts ==============================\nplatform linux -- Python 3.10.19, pytest-9.0.2, pluggy-1.6.0 -- /usr/local/bin/python\nrootdir: /docformatter\nconfigfile: pyproject.toml\nplugins: cov-7.0.0\ncollecting ... collected 2 items\n\ntests/test_format_docstring.py::TestFormatWrap::test_format_docstring_for_multi_line_summary_alone PASSED\ntests/test_format_docstring.py::TestFormatWrap::test_format_docstring_for_one_line_summary_alone_but_too_long FAILED\n\n=================================== FAILURES ===================================\n_ TestFormatWrap.test_format_docstring_for_one_line_summary_alone_but_too_long _\n\nself = <tests.test_format_docstring.TestFormatWrap object at 0x7ffff6a5bb50>\n\n        @pytest.mark.unit\n        def test_format_docstring_for_one_line_summary_alone_but_too_long(self):\n            \"\"\"\"\"\"\n>           assert (\n                (\n                    '''\\\n    \"\"\"This one-line docstring will not be wrapped and quotes will be in-line.\"\"\"\\\n    '''\n                )\n                == docformatter.format_docstring(\n                    \"    \",\n                    '''\\\n    \"\"\"This one-line docstring will not be wrapped and quotes will be\n    in-line.\"\"\"\\\n    ''',\n                    summary_wrap_length=88,\n                    close_quotes_on_newline=True,\n                )\n            )\nE           assert '\"\"\"This one-...e in-line.\"\"\"' == '\"\"\"This one-...ine.\\n    \"\"\"'\nE             \nE             - \"\"\"This one-line docstring will not be wrapped and quotes will be in-line.\nE             ?                                                                           ^\nE             + \"\"\"This one-line docstring will not be wrapped and quotes will be in-line.\"\"\"\nE             ?                                                                           ^^^\nE             -     \"\"\"\n\ntests/test_format_docstring.py:468: AssertionError\n==================================== PASSES ====================================\n----------- generated xml file: /opt/receipts/reports/agent1-21.xml ------------\n=========================== short test summary info ============================\nPASSED tests/test_format_docstring.py::TestFormatWrap::test_format_docstring_for_multi_line_summary_alone\nFAILED tests/test_format_docstring.py::TestFormatWrap::test_format_docstring_for_one_line_summary_alone_but_too_long\n!!!!!!!!!!!!!!!!!!!!!!!!!! stopping after 1 failures !!!!!!!!!!!!!!!!!!!!!!!!!!!\n========================= 1 failed, 1 passed in 0.07s ==========================\n","stderr_tail":"","stdout_sha256":"98ee40face52ecb1423ca00e2cc522fc3e56fee9b31c04030f53cda0715ffa5f","log_path":"~/dev/nebius-hackathon/pilot/v2-P/pycqa__docformatter-104/runs/pilot-pycqa__docformatter-104-81a216bf2b/logs/agent1/agent1-21.log","tree_digest":"87d27a4eda4a65ce622d660c393ecc94db06b708b43a802fafaffa32eadbdbd4","tree_download_s":3.057670332957059,"started_at":"2026-10-03T18:49:34.776151Z","duration_s":0.570118,"timed_out":false,"image_before":"69b2d87a-cfae-4cab-bc06-21dd050065c3","image_after":"4906b50d-8f86-4d7b-8aa2-cae9be1774d2","junit":{"passed":["tests/test_format_docstring.py::TestFormatWrap::test_format_docstring_for_multi_line_summary_alone"],"failed":["tests/test_format_docstring.py::TestFormatWrap::test_format_docstring_for_one_line_summary_alone_but_too_long"],"errors":[],"skipped":[],"collection_errors":[],"failure_text":{"tests/test_format_docstring.py::TestFormatWrap::test_format_docstring_for_one_line_summary_alone_but_too_long":"assert '\"\"\"This one-...e in-line.\"\"\"' == '\"\"\"This one-...ine.\\n    \"\"\"'\n  \n  - \"\"\"This one-line docstring will not be wrapped and quotes will be in-line.\n  ?                                                                           ^\n  + \"\"\"This one-line docstring will not be wrapped and quotes will be in-line.\"\"\"\n  ?                                                                           ^^^\n  -     \"\"\"\nself = <tests.test_format_docstring.TestFormatWrap object at 0x7ffff6a5bb50>\n\n        @pytest.mark.unit\n        def test_format_docstring_for_one_line_summary_alone_but_too_long(self):\n            \"\"\"\"\"\"\n>           assert (\n                (\n                    '''\\\n    \"\"\"This one-line docstring will not be wrapped and quotes will be in-line.\"\"\"\\\n    '''\n                )\n                == docformatter.format_docstring(\n                    \"    \",\n                    '''\\\n    \"\"\"This one-line docstring will not be wrapped and quotes will be\n    in-line.\"\"\"\\\n    ''',\n                    summary_wrap_length=88,\n                    close_quotes_on_newline=True,\n                )\n            )\nE           assert '\"\"\"This one-...e in-line.\"\"\"' == '\"\"\"This one-...ine.\\n    \"\"\"'\nE             \nE             - \"\"\"This one-line docstring will not be wrapped and quotes will be in-line.\nE             ?                                                                           ^\nE             + \"\"\"This one-line docstring will not be wrapped and quotes will be in-line.\"\"\"\nE             ?                                                                           ^^^\nE             -     \"\"\"\n\ntests/test_format_docstring.py:468: AssertionError"}},"diff":null,"patch_sha256":null,"dropped_paths":[],"snapshot_sha":null}
{"receipt_id":"agent1-22","seq":22,"branch_id":"agent1","kind":"write","cmd":"/opt/receipts-d9ef4d85a1294729af37bec0205bc16c/bin/busybox sh -c 'mkdir -p /docformatter && cp /opt/receipts-d9ef4d85a1294729af37bec0205bc16c/incoming/050f763a1864753ce8d2f46d1676c9c72cd3edf2fd9e778214bcc4716e96caab /docformatter/docformatter.py'","path":"docformatter.py","exit_code":0,"stdout_tail":"","stderr_tail":"","stdout_sha256":"050f763a1864753ce8d2f46d1676c9c72cd3edf2fd9e778214bcc4716e96caab","log_path":"~/dev/nebius-hackathon/pilot/v2-P/pycqa__docformatter-104/runs/pilot-pycqa__docformatter-104-81a216bf2b/logs/agent1/agent1-22.log","tree_digest":null,"tree_download_s":null,"started_at":"2026-10-03T18:49:47.284825Z","duration_s":0.004424,"timed_out":false,"image_before":"4906b50d-8f86-4d7b-8aa2-cae9be1774d2","image_after":"10a2e837-dbb4-4b57-bafe-a5fad28b9d36","junit":null,"diff":null,"patch_sha256":null,"dropped_paths":[],"snapshot_sha":null}
{"receipt_id":"agent1-23","seq":23,"branch_id":"agent1","kind":"command","cmd":"/opt/receipts-5518bb9621df420881fbcfc257d1b99c/bin/busybox mkdir -p /opt/receipts/reports && python -I /opt/receipts-5518bb9621df420881fbcfc257d1b99c/receipts_pytest.py tests/test_format_docstring.py::TestFormatWrap::test_format_docstring_for_multi_line_summary_alone tests/test_format_docstring.py::TestFormatWrap::test_format_docstring_for_one_line_summary_alone_but_too_long tests/test_format_docstring.py::TestFormatWrap::test_force_wrap -xvs -o junit_family=xunit1 -p no:cacheprovider -rA --continue-on-collection-errors --junitxml=/opt/receipts/reports/agent1-23.xml","path":null,"exit_code":0,"stdout_tail":"============================= test session starts ==============================\nplatform linux -- Python 3.10.19, pytest-9.0.2, pluggy-1.6.0 -- /usr/local/bin/python\nrootdir: /docformatter\nconfigfile: pyproject.toml\nplugins: cov-7.0.0\ncollecting ... collected 3 items\n\ntests/test_format_docstring.py::TestFormatWrap::test_format_docstring_for_multi_line_summary_alone PASSED\ntests/test_format_docstring.py::TestFormatWrap::test_format_docstring_for_one_line_summary_alone_but_too_long PASSED\ntests/test_format_docstring.py::TestFormatWrap::test_force_wrap PASSED\n\n==================================== PASSES ====================================\n----------- generated xml file: /opt/receipts/reports/agent1-23.xml ------------\n=========================== short test summary info ============================\nPASSED tests/test_format_docstring.py::TestFormatWrap::test_format_docstring_for_multi_line_summary_alone\nPASSED tests/test_format_docstring.py::TestFormatWrap::test_format_docstring_for_one_line_summary_alone_but_too_long\nPASSED tests/test_format_docstring.py::TestFormatWrap::test_force_wrap\n============================== 3 passed in 0.05s ===============================\n","stderr_tail":"","stdout_sha256":"8b17adab4de2bf52acead475debe26b5cb2b16752f0984900181f5ba093a9362","log_path":"~/dev/nebius-hackathon/pilot/v2-P/pycqa__docformatter-104/runs/pilot-pycqa__docformatter-104-81a216bf2b/logs/agent1/agent1-23.log","tree_digest":"8282a894cb28cbcfd5f822a265eb6037d7cab64dcea1762afcf7fcc28848497a","tree_download_s":2.787359375040978,"started_at":"2026-10-03T18:49:50.231092Z","duration_s":0.5636840000000001,"timed_out":false,"image_before":"10a2e837-dbb4-4b57-bafe-a5fad28b9d36","image_after":"2ad10fcd-eaba-4752-824b-3afd3a0c760d","junit":{"passed":["tests/test_format_docstring.py::TestFormatWrap::test_format_docstring_for_multi_line_summary_alone","tests/test_format_docstring.py::TestFormatWrap::test_format_docstring_for_one_line_summary_alone_but_too_long","tests/test_format_docstring.py::TestFormatWrap::test_force_wrap"],"failed":[],"errors":[],"skipped":[],"collection_errors":[],"failure_text":{}},"diff":null,"patch_sha256":null,"dropped_paths":[],"snapshot_sha":null}
{"receipt_id":"agent1-24","seq":24,"branch_id":"agent1","kind":"command","cmd":"/opt/receipts-86208042428f4aab93236f92a59d4bb3/bin/busybox mkdir -p /opt/receipts/reports && python -I /opt/receipts-86208042428f4aab93236f92a59d4bb3/receipts_pytest.py tests/test_format_docstring.py --no-header -rA --tb=line --color=no -p no:cacheprovider -W ignore::DeprecationWarning -o junit_family=xunit1 -p no:cacheprovider -rA --continue-on-collection-errors --junitxml=/opt/receipts/reports/agent1-24.xml","path":null,"exit_code":0,"stdout_tail":"============================= test session starts ==============================\ncollected 30 items\n\ntests/test_format_docstring.py .......................x......            [100%]\n\n==================================== PASSES ====================================\n----------- generated xml file: /opt/receipts/reports/agent1-24.xml ------------\n=========================== short test summary info ============================\nPASSED tests/test_format_docstring.py::TestFormatDocstring::test_format_docstring\nPASSED tests/test_format_docstring.py::TestFormatDocstring::test_format_docstring_with_summary_that_ends_in_quote\nPASSED tests/test_format_docstring.py::TestFormatDocstring::test_format_docstring_with_bad_indentation\nPASSED tests/test_format_docstring.py::TestFormatDocstring::test_format_docstring_with_too_much_indentation\nPASSED tests/test_format_docstring.py::TestFormatDocstring::test_format_docstring_with_trailing_whitespace\nPASSED tests/test_format_docstring.py::TestFormatDocstring::test_format_docstring_with_empty_docstring\nPASSED tests/test_format_docstring.py::TestFormatDocstring::test_format_docstring_with_no_period\nPASSED tests/test_format_docstring.py::TestFormatDocstring::test_format_docstring_with_single_quotes\nPASSED tests/test_format_docstring.py::TestFormatDocstring::test_format_docstring_with_single_quotes_multi_line\nPASSED tests/test_format_docstring.py::TestFormatDocstring::test_format_docstring_leave_underlined_summaries_alone\nPASSED tests/test_format_docstring.py::TestFormatLists::test_format_docstring_should_ignore_numbered_lists\nPASSED tests/test_format_docstring.py::TestFormatLists::test_format_docstring_should_ignore_parameter_lists\nPASSED tests/test_format_docstring.py::TestFormatLists::test_format_docstring_should_ignore_colon_parameter_lists\nPASSED tests/test_format_docstring.py::TestFormatLists::test_format_docstring_should_leave_list_alone\nPASSED tests/test_format_docstring.py::TestFormatWrap::test_unwrap_summary\nPASSED tests/test_format_docstring.py::TestFormatWrap::test_format_docstring_with_wrap\nPASSED tests/test_format_docstring.py::TestFormatWrap::test_format_docstring_with_weird_indentation_and_punctuation\nPASSED tests/test_format_docstring.py::TestFormatWrap::test_format_docstring_with_description_wrapping\nPASSED tests/test_format_docstring.py::TestFormatWrap::test_format_docstring_should_ignore_multi_paragraph\nPASSED tests/test_format_docstring.py::TestFormatWrap::test_format_docstring_should_ignore_doctests\nPASSED tests/test_format_docstring.py::TestFormatWrap::test_format_docstring_should_ignore_doctests_in_summary\nPASSED tests/test_format_docstring.py::TestFormatWrap::test_format_docstring_should_maintain_indentation_of_doctest\nPASSED tests/test_format_docstring.py::TestFormatWrap::test_force_wrap\nPASSED tests/test_format_docstring.py::TestFormatWrap::test_format_docstring_for_multi_line_summary_alone\nPASSED tests/test_format_docstring.py::TestFormatWrap::test_format_docstring_for_one_line_summary_alone_but_too_long\nPASSED tests/test_format_docstring.py::TestFormatStyleOptions::test_format_docstring_with_no_post_description_blank\nPASSED tests/test_format_docstring.py::TestFormatStyleOptions::test_format_docstring_with_pre_summary_newline\nPASSED tests/test_format_docstring.py::TestFormatStyleOptions::test_format_docstring_make_summary_multi_line\nPASSED tests/test_format_docstring.py::TestFormatStyleOptions::test_format_docstring_pre_summary_space\nXFAIL tests/test_format_docstring.py::TestFormatWrap::test_format_docstring_with_summary_only_and_wrap_and_tab_indentation\n======================== 29 passed, 1 xfailed in 0.21s =========================\n","stderr_tail":"","stdout_sha256":"0c9f85bbee203d4c7c0e0fb589cd30ccfcf79c969839a3cc8c40a67485bfa52c","log_path":"~/dev/nebius-hackathon/pilot/v2-P/pycqa__docformatter-104/runs/pilot-pycqa__docformatter-104-81a216bf2b/logs/agent1/agent1-24.log","tree_digest":"8282a894cb28cbcfd5f822a265eb6037d7cab64dcea1762afcf7fcc28848497a","tree_download_s":2.1277942080050707,"started_at":"2026-10-03T18:49:58.233637Z","duration_s":0.711824,"timed_out":false,"image_before":"2ad10fcd-eaba-4752-824b-3afd3a0c760d","image_after":"ef23953c-af0e-48d9-bccd-9b3bffd9dc4a","junit":{"passed":["tests/test_format_docstring.py::TestFormatDocstring::test_format_docstring","tests/test_format_docstring.py::TestFormatDocstring::test_format_docstring_with_summary_that_ends_in_quote","tests/test_format_docstring.py::TestFormatDocstring::test_format_docstring_with_bad_indentation","tests/test_format_docstring.py::TestFormatDocstring::test_format_docstring_with_too_much_indentation","tests/test_format_docstring.py::TestFormatDocstring::test_format_docstring_with_trailing_whitespace","tests/test_format_docstring.py::TestFormatDocstring::test_format_docstring_with_empty_docstring","tests/test_format_docstring.py::TestFormatDocstring::test_format_docstring_with_no_period","tests/test_format_docstring.py::TestFormatDocstring::test_format_docstring_with_single_quotes","tests/test_format_docstring.py::TestFormatDocstring::test_format_docstring_with_single_quotes_multi_line","tests/test_format_docstring.py::TestFormatDocstring::test_format_docstring_leave_underlined_summaries_alone","tests/test_format_docstring.py::TestFormatLists::test_format_docstring_should_ignore_numbered_lists","tests/test_format_docstring.py::TestFormatLists::test_format_docstring_should_ignore_parameter_lists","tests/test_format_docstring.py::TestFormatLists::test_format_docstring_should_ignore_colon_parameter_lists","tests/test_format_docstring.py::TestFormatLists::test_format_docstring_should_leave_list_alone","tests/test_format_docstring.py::TestFormatWrap::test_unwrap_summary","tests/test_format_docstring.py::TestFormatWrap::test_format_docstring_with_wrap","tests/test_format_docstring.py::TestFormatWrap::test_format_docstring_with_weird_indentation_and_punctuation","tests/test_format_docstring.py::TestFormatWrap::test_format_docstring_with_description_wrapping","tests/test_format_docstring.py::TestFormatWrap::test_format_docstring_should_ignore_multi_paragraph","tests/test_format_docstring.py::TestFormatWrap::test_format_docstring_should_ignore_doctests","tests/test_format_docstring.py::TestFormatWrap::test_format_docstring_should_ignore_doctests_in_summary","tests/test_format_docstring.py::TestFormatWrap::test_format_docstring_should_maintain_indentation_of_doctest","tests/test_format_docstring.py::TestFormatWrap::test_force_wrap","tests/test_format_docstring.py::TestFormatWrap::test_format_docstring_for_multi_line_summary_alone","tests/test_format_docstring.py::TestFormatWrap::test_format_docstring_for_one_line_summary_alone_but_too_long","tests/test_format_docstring.py::TestFormatStyleOptions::test_format_docstring_with_no_post_description_blank","tests/test_format_docstring.py::TestFormatStyleOptions::test_format_docstring_with_pre_summary_newline","tests/test_format_docstring.py::TestFormatStyleOptions::test_format_docstring_make_summary_multi_line","tests/test_format_docstring.py::TestFormatStyleOptions::test_format_docstring_pre_summary_space"],"failed":[],"errors":[],"skipped":["tests/test_format_docstring.py::TestFormatWrap::test_format_docstring_with_summary_only_and_wrap_and_tab_indentation"],"collection_errors":[],"failure_text":{}},"diff":null,"patch_sha256":null,"dropped_paths":[],"snapshot_sha":null}
{"receipt_id":"agent1-25","seq":25,"branch_id":"agent1","kind":"diff","cmd":"compute patch in executor staging agent1-a2eb231f0ec84b96bd5a83fc153cf780: /opt/homebrew/Cellar/git/2.53.0/bin/git -c core.hooksPath=/dev/null -c core.attributesFile=/dev/null -c diff.external= -c core.quotePath=false add -A && /opt/homebrew/Cellar/git/2.53.0/bin/git -c core.hooksPath=/dev/null -c core.attributesFile=/dev/null -c diff.external= -c core.quotePath=false diff --cached --binary --no-ext-diff --no-textconv --no-renames f743c7f0fab2fa914a1b2c8e7553f846b12262f4","path":null,"exit_code":0,"stdout_tail":"diff --git a/docformatter.py b/docformatter.py\nindex 37140c0..4cc469d 100755\n--- a/docformatter.py\n+++ b/docformatter.py\n@@ -491,6 +491,7 @@ def format_docstring(\n     post_description_blank=False,\n     force_wrap=False,\n     strict=True,\n+    close_quotes_on_newline=True,\n ):\n     \"\"\"Return formatted version of docstring.\n \n@@ -555,12 +556,23 @@ def format_docstring(\n '''\n     else:\n         if not make_summary_multi_line:\n-            return wrap_summary(\n-                open_quote + normalize_summary(contents) + '\"\"\"',\n+            combined = open_quote + normalize_summary(contents) + '\"\"\"'\n+            # Determine if the combined summary (without newlines from wrapping) fits\n+            # within the summary wrap limit.\n+            combined_len = len(open_quote + normalize_summary(contents))\n+            fits_on_one_line = summary_wrap_length == 0 or combined_len <= summary_wrap_length\n+            wrapped = wrap_summary(\n+                combined,\n                 wrap_length=summary_wrap_length,\n                 initial_indent=indentation,\n                 subsequent_indent=indentation,\n             ).strip()\n+            if close_quotes_on_newline and not fits_on_one_line and not force_wrap and wrapped.rstrip().strip() != '\"\"\"':\n+                # Move closing quotes to a new line\n+                without_close = wrapped.rsplit('\"\"\"', 1)[0].rstrip()\n+                return without_close + '\\n' + indentation + '\"\"\"'\n+            else:\n+                return wrapped\n         beginning = f\"{open_quote}\\n{indentation}\"\n         ending = f'\\n{indentation}\"\"\"'\n         summary_wrapped = wrap_summary(\n","stderr_tail":"","stdout_sha256":"bbbfa80639a823bbeccdfadbf73863ea6efce9e073a589c2f2d7659a8348d521","log_path":null,"tree_digest":"8282a894cb28cbcfd5f822a265eb6037d7cab64dcea1762afcf7fcc28848497a","tree_download_s":2.5858448748476803,"started_at":"2026-10-03T18:50:11.213556Z","duration_s":0.03839737502858043,"timed_out":false,"image_before":"ef23953c-af0e-48d9-bccd-9b3bffd9dc4a","image_after":"ef23953c-af0e-48d9-bccd-9b3bffd9dc4a","junit":null,"diff":{"files":[{"path":"docformatter.py","added":14,"deleted":2,"category":"source","status":"modified"}],"patch_sha256":"bbbfa80639a823bbeccdfadbf73863ea6efce9e073a589c2f2d7659a8348d521","patch_path":"~/dev/nebius-hackathon/pilot/v2-P/pycqa__docformatter-104/runs/pilot-pycqa__docformatter-104-81a216bf2b/artifacts/agent1/agent1-25.patch"},"patch_sha256":"bbbfa80639a823bbeccdfadbf73863ea6efce9e073a589c2f2d7659a8348d521","dropped_paths":[],"snapshot_sha":"f743c7f0fab2fa914a1b2c8e7553f846b12262f4"}
