{"receipt_id":"agent1-1","seq":1,"branch_id":"agent1","kind":"command","cmd":"git ls-files -z","path":null,"exit_code":0,"stdout_tail":".deepsource.toml\u0000.flake8\u0000.github/ISSUE_TEMPLATE/bug.md\u0000.github/ISSUE_TEMPLATE/feature_request.md\u0000.github/PULL_REQUEST_TEMPLATE.md\u0000.github/workflows/on-push.yml\u0000.github/workflows/publish-testpypi.yml\u0000.github/workflows/publish_docs.yml\u0000.github/workflows/test_all_packages_slow.yml\u0000.gitignore\u0000.pre-commit-config.yaml\u0000LICENSE\u0000MANIFEST.in\u0000README.md\u0000docs/changelog.md\u0000docs/comparisons.md\u0000docs/contributing.md\u0000docs/examples.md\u0000docs/getting-started.md\u0000docs/how-pipx-works.md\u0000docs/index.md\u0000docs/installation.md\u0000docs/programs-to-try.md\u0000docs/troubleshooting.md\u0000get-pipx.py\u0000logo.png\u0000makefile\u0000mkdocs.yml\u0000noxfile.py\u0000pipx_demo.gif\u0000pyproject.toml\u0000scripts/generate_docs.py\u0000scripts/migrate_pipsi_to_pipx.py\u0000scripts/pipx_postrelease.py\u0000scripts/pipx_prerelease.py\u0000scripts/pipx_release.py\u0000setup.cfg\u0000setup.py\u0000src/pipx/__init__.py\u0000src/pipx/__main__.py\u0000src/pipx/animate.py\u0000src/pipx/colors.py\u0000src/pipx/commands/__init__.py\u0000src/pipx/commands/common.py\u0000src/pipx/commands/ensure_path.py\u0000src/pipx/commands/inject.py\u0000src/pipx/commands/install.py\u0000src/pipx/commands/list_packages.py\u0000src/pipx/commands/reinstall.py\u0000src/pipx/commands/run.py\u0000src/pipx/commands/run_pip.py\u0000src/pipx/commands/uninstall.py\u0000src/pipx/commands/upgrade.py\u0000src/pipx/constants.py\u0000src/pipx/emojis.py\u0000src/pipx/interpreter.py\u0000src/pipx/main.py\u0000src/pipx/package_specifier.py\u0000src/pipx/pipx_metadata_file.py\u0000src/pipx/shared_libs.py\u0000src/pipx/util.py\u0000src/pipx/venv.py\u0000src/pipx/venv_inspect.py\u0000src/pipx/version.py\u0000templates/docs.md\u0000testdata/test_package_specifier/local_extras/repeatme/__init__.py\u0000testdata/test_package_specifier/local_extras/repeatme/main.py\u0000testdata/test_package_specifier/local_extras/setup.py\u0000tests/conftest.py\u0000tests/helpers.py\u0000tests/package_info.py\u0000tests/test_animate.py\u0000tests/test_completions.py\u0000tests/test_emojis.py\u0000tests/test_inject.py\u0000tests/test_install.py\u0000tests/test_install_all_packages.py\u0000tests/test_interpreter.py\u0000tests/test_list.py\u0000tests/test_main.py\u0000tests/test_package_specifier.py\u0000tests/test_pipx_metadata_file.py\u0000tests/test_reinstall.py\u0000tests/test_reinstall_all.py\u0000tests/test_run.py\u0000tests/test_runpip.py\u0000tests/test_shared_libs.py\u0000tests/test_uninstall.py\u0000tests/test_uninstall_all.py\u0000tests/test_upgrade.py\u0000tests/test_upgrade_all.py\u0000","stderr_tail":"","stdout_sha256":"4566c63e7bee85b1eadbfd55b89b3fbcf4c209874c48248396151c77b88d6bb3","log_path":"~/dev/nebius-hackathon/pilot/v2-P/pipxproject__pipx-680/runs/pilot-pipxproject__pipx-680-183a4a2cf5/logs/agent1/agent1-1.log","tree_digest":null,"tree_download_s":null,"started_at":"2026-10-03T20:14:59.522334Z","duration_s":0.0037540000000000004,"timed_out":false,"image_before":"7d6dd7ff-79cc-43b1-91f9-3cdd70600ef5","image_after":"a64e52d9-9c8c-4e89-a0ec-45ac2f9d4d43","junit":null,"diff":null,"patch_sha256":null,"dropped_paths":[],"snapshot_sha":null}
{"receipt_id":"agent1-2","seq":2,"branch_id":"agent1","kind":"write","cmd":"/opt/receipts-39bdfbaeb43f42f88d6af600fb4c7ee7/bin/busybox sh -c 'mkdir -p /pipx/src/pipx/commands && cp /opt/receipts-39bdfbaeb43f42f88d6af600fb4c7ee7/incoming/21105245cd8e213e22e5691e4c735266258c6fb23949c76183b1d3f593e8229d /pipx/src/pipx/commands/list_packages.py'","path":"src/pipx/commands/list_packages.py","exit_code":0,"stdout_tail":"","stderr_tail":"","stdout_sha256":"21105245cd8e213e22e5691e4c735266258c6fb23949c76183b1d3f593e8229d","log_path":"~/dev/nebius-hackathon/pilot/v2-P/pipxproject__pipx-680/runs/pilot-pipxproject__pipx-680-183a4a2cf5/logs/agent1/agent1-2.log","tree_digest":null,"tree_download_s":null,"started_at":"2026-10-03T20:15:10.487383Z","duration_s":0.00475,"timed_out":false,"image_before":"a64e52d9-9c8c-4e89-a0ec-45ac2f9d4d43","image_after":"3d857aaa-c00f-460a-ab35-6733a4ac106c","junit":null,"diff":null,"patch_sha256":null,"dropped_paths":[],"snapshot_sha":null}
{"receipt_id":"agent1-3","seq":3,"branch_id":"agent1","kind":"command","cmd":"/opt/receipts-d46f2b165e554c0c83f5f64c3b20bd2c/bin/busybox mkdir -p /opt/receipts/reports && python -I /opt/receipts-d46f2b165e554c0c83f5f64c3b20bd2c/receipts_pytest.py tests/test_list.py::test_cli tests/test_list.py::test_missing_interpreter tests/test_list.py::test_list_legacy_venv -v -o junit_family=xunit1 -p no:cacheprovider -rA --continue-on-collection-errors --junitxml=/opt/receipts/reports/agent1-3.xml","path":null,"exit_code":1,"stdout_tail":"wsay 0.0.0.1,' in 'creating virtual environment...\\ninstalling pycowsay...\\n  installed package pycowsay 0.0.0.2, Python 3.10.19\\n  These apps are now globally available\\n    - pycowsay\\nvenvs are in /tmp/pytest-of-root/pytest-2/test_list_legacy_venv_0_1_0/subdir/pipxhome/venvs\\napps are exposed on your $PATH at /tmp/pytest-of-root/pytest-2/test_list_legacy_venv_0_1_0/otherdir/pipxbindir\\n   package pycowsay 0.0.0.2, Python 3.10.19\\n    - pycowsay\\n'\nE            +  where 'creating virtual environment...\\ninstalling pycowsay...\\n  installed package pycowsay 0.0.0.2, Python 3.10.19\\n  These apps are now globally available\\n    - pycowsay\\nvenvs are in /tmp/pytest-of-root/pytest-2/test_list_legacy_venv_0_1_0/subdir/pipxhome/venvs\\napps are exposed on your $PATH at /tmp/pytest-of-root/pytest-2/test_list_legacy_venv_0_1_0/otherdir/pipxbindir\\n   package pycowsay 0.0.0.2, Python 3.10.19\\n    - pycowsay\\n' = CaptureResult(out='creating virtual environment...\\ninstalling pycowsay...\\n  installed package pycowsay 0.0.0.2, Python 3.10.19\\n  These apps are now globally available\\n    - pycowsay\\nvenvs are in /tmp/pytest-of-root/pytest-2/test_list_legacy_venv_0_1_0/subdir/pipxhome/venvs\\napps are exposed on your $PATH at /tmp/pytest-of-root/pytest-2/test_list_legacy_venv_0_1_0/otherdir/pipxbindir\\n   package pycowsay 0.0.0.2, Python 3.10.19\\n    - pycowsay\\n', err='done! ✨ 🌟 ✨\\n').out\n\ntests/test_list.py:60: AssertionError\n------------------------------ Captured log call -------------------------------\nDEBUG    pipx.main:main.py:715 2026-10-03 20:15:21\nDEBUG    pipx.main:main.py:716 pipx install pycowsay\nINFO     pipx.main:main.py:717 pipx version is 0.16.2.0.1.dev0\nINFO     pipx.main:main.py:718 Default python interpreter is '/usr/local/bin/python'\nINFO     pipx.util:util.py:56 creating directory /tmp/pytest-of-root/pytest-2/test_list_legacy_venv_0_1_0/subdir/pipxhome/venvs\nINFO     pipx.util:util.py:56 creating directory /tmp/pytest-of-root/pytest-2/test_list_legacy_venv_0_1_0/otherdir/pipxbindir\nINFO     pipx.util:util.py:56 creating directory /tmp/pytest-of-root/pytest-2/test_list_legacy_venv_0_1_0/subdir/pipxhome/.cache\nINFO     pipx.commands.common:common.py:320 Determined package name: pycowsay\nINFO     pipx.commands.common:common.py:321 Package name determined in 0.0s\nINFO     pipx.util:util.py:135 running /usr/local/bin/python -m venv --without-pip /tmp/pytest-of-root/pytest-2/test_list_legacy_venv_0_1_0/subdir/pipxhome/venvs/pycowsay\nDEBUG    pipx.util:util.py:148 stdout:\nDEBUG    pipx.util:util.py:150 stderr:\nDEBUG    pipx.util:util.py:151 returncode: 0\nINFO     pipx.util:util.py:135 running /tmp/pytest-of-root/pytest-2/test_list_legacy_venv_0_1_0/subdir/pipxhome/venvs/pycowsay/bin/python -c import sysconfig; print(sysconfig.get_path('purelib'))\nDEBUG    pipx.util:util.py:148 stdout: /tmp/pytest-of-root/pytest-2/test_list_legacy_venv_0_1_0/subdir/pipxhome/venvs/pycowsay/lib/python3.10/site-packages\nDEBUG    pipx.util:util.py:151 returncode: 0\nINFO     pipx.util:util.py:135 running /tmp/pytest-of-root/pytest-2/session_shareddir0/bin/python -c import sysconfig; print(sysconfig.get_path('purelib'))\nDEBUG    pipx.util:util.py:148 stdout: /tmp/pytest-of-root/pytest-2/session_shareddir0/lib/python3.10/site-packages\nDEBUG    pipx.util:util.py:151 returncode: 0\nINFO     pipx.util:util.py:135 running /tmp/pytest-of-root/pytest-2/test_list_legacy_venv_0_1_0/subdir/pipxhome/venvs/pycowsay/bin/python --version\nDEBUG    pipx.util:util.py:148 stdout: Python 3.10.19\nDEBUG    pipx.util:util.py:150 stderr:\nDEBUG    pipx.util:util.py:151 returncode: 0\nINFO     pipx.package_specifier:package_specifier.py:128 cleaned package spec: pycowsay\nINFO     pipx.util:util.py:135 running /tmp/pytest-of-root/pytest-2/test_list_legacy_venv_0_1_0/subdir/pipxhome/venvs/pycowsay/bin/python -m pip install pycowsay\nDEBUG    pipx.util:util.py:151 returncode: 0\nINFO     pipx.util:util.py:135 running <fetch_info_in_venv commands>\nDEBUG    pipx.util:util.py:148 stdout: {\"sys_path\": [\"/usr/local/lib/python310.zip\", \"/usr/local/lib/python3.10\", \"/usr/local/lib/python3.10/lib-dynload\", \"/tmp/pytest-of-root/pytest-2/test_list_legacy_venv_0_1_0/subdir/pipxhome/venvs/pycowsay/lib/python3.10/site-packages\", \"/tmp/pytest-of-root/pytest-2/session_shareddir0/lib/python3.10/site-packages\"], \"python_version\": \"3.10.19\", \"environment\": {\"implementation_name\": \"cpython\", \"implementation_version\": \"3.10.19\", \"os_name\": \"posix\", \"platform_machine\": \"x86_64\", \"platform_release\": \"7.0.6\", \"platform_system\": \"Linux\", \"platform_version\": \"#1 SMP PREEMPT_DYNAMIC Mon Aug 24 09:29:13 UTC 2026\", \"python_full_version\": \"3.10.19\", \"platform_python_implementation\": \"CPython\", \"python_version\": \"3.10\", \"sys_platform\": \"linux\"}}\nDEBUG    pipx.util:util.py:151 returncode: 0\nINFO     pipx.venv:venv.py:303 get_venv_metadata_for_package: 27ms\nINFO     pipx.package_specifier:package_specifier.py:128 cleaned package spec: pycowsay\nINFO     pipx.shared_libs:shared_libs.py:69 Time since last upgrade of shared libs, in seconds: 1. Upgrade will be run by pipx if greater than 2592000.\nDEBUG    pipx.main:main.py:776 pipx finished.\nDEBUG    pipx.main:main.py:715 2026-10-03 20:15:22\nDEBUG    pipx.main:main.py:716 pipx list\nINFO     pipx.main:main.py:717 pipx version is 0.16.2.0.1.dev0\nINFO     pipx.main:main.py:718 Default python interpreter is '/usr/local/bin/python'\nDEBUG    pipx.main:main.py:776 pipx finished.\n------------ generated xml file: /opt/receipts/reports/agent1-3.xml ------------\n=========================== short test summary info ============================\nFAILED tests/test_list.py::test_cli - AssertionError: assert 'nothing has bee...\nFAILED tests/test_list.py::test_missing_interpreter - AssertionError: assert ...\nFAILED tests/test_list.py::test_list_legacy_venv[None] - AssertionError: asse...\nFAILED tests/test_list.py::test_list_legacy_venv[0.1] - AssertionError: asser...\n============================== 4 failed in 7.25s ===============================\n","stderr_tail":"","stdout_sha256":"a6ee31d278f6f3b00798734e049999493bb37b6e9bccc91e1e2f4e76099141bd","log_path":"~/dev/nebius-hackathon/pilot/v2-P/pipxproject__pipx-680/runs/pilot-pipxproject__pipx-680-183a4a2cf5/logs/agent1/agent1-3.log","tree_digest":"fb2aaf837bc5bcbb5a33f9fee7e0b46c695adb853965eea467c7276f68c72fdf","tree_download_s":2.7473899158649147,"started_at":"2026-10-03T20:15:13.322193Z","duration_s":5.982997,"timed_out":false,"image_before":"3d857aaa-c00f-460a-ab35-6733a4ac106c","image_after":"e860c42d-f37b-4717-b28e-b30c67410347","junit":{"passed":[],"failed":["tests/test_list.py::test_cli","tests/test_list.py::test_missing_interpreter","tests/test_list.py::test_list_legacy_venv[None]","tests/test_list.py::test_list_legacy_venv[0.1]"],"errors":[],"skipped":[],"collection_errors":[],"failure_text":{"tests/test_list.py::test_cli":"AssertionError: assert 'nothing has been installed with pipx' in ''\n +  where '' = CaptureResult(out='nothing has been installed with pipx #x1F634\\n', err='').err\npipx_temp_env = None\nmonkeypatch = <_pytest.monkeypatch.MonkeyPatch object at 0x7ffff6c5a8c0>\ncapsys = <_pytest.capture.CaptureFixture object at 0x7ffff6c5a5c0>\n\n    def test_cli(pipx_temp_env, monkeypatch, capsys):\n        assert not run_pipx_cli([\"list\"])\n        captured = capsys.readouterr()\n>       assert \"nothing has been installed with pipx\" in captured.err\nE       AssertionError: assert 'nothing has been installed with pipx' in ''\nE        +  where '' = CaptureResult(out='nothing has been installed with pipx #x1F634\\n', err='').err\n\ntests/test_list.py:22: AssertionError","tests/test_list.py::test_missing_interpreter":"AssertionError: assert 'package pycowsay has invalid interpreter' in ''\n +  where '' = CaptureResult(out='venvs are in /tmp/pytest-of-root/pytest-2/test_missing_interpreter0/subdir/pipxhome/venvs\\napps are exposed on your $PATH at /tmp/pytest-of-root/pytest-2/test_missing_interpreter0/otherdir/pipxbindir\\n   package pycowsay has invalid interpreter /tmp/pytest-of-root/pytest-2/test_missing_interpreter0/subdir/pipxhome/venvs/pycowsay/bin/python\\n\\nOne or more packages have a missing python interpreter.\\n    To fix, execute: pipx reinstall-all\\n\\n', err='').err\npipx_temp_env = None\nmonkeypatch = <_pytest.monkeypatch.MonkeyPatch object at 0x7ffff6c5a560>\ncapsys = <_pytest.capture.CaptureFixture object at 0x7ffff6c5b880>\n\n    def test_missing_interpreter(pipx_temp_env, monkeypatch, capsys):\n        assert not run_pipx_cli([\"install\", \"pycowsay\"])\n    \n        assert not run_pipx_cli([\"list\"])\n        captured = capsys.readouterr()\n        assert \"package pycowsay has invalid interpreter\" not in captured.err\n    \n        remove_venv_interpreter(\"pycowsay\")\n    \n        assert run_pipx_cli([\"list\"])\n        captured = capsys.readouterr()\n>       assert \"package pycowsay has invalid interpreter\" in captured.err\nE       AssertionError: assert 'package pycowsay has invalid interpreter' in ''\nE        +  where '' = CaptureResult(out='venvs are in /tmp/pytest-of-root/pytest-2/test_missing_interpreter0/subdir/pipxhome/venvs\\napps are exposed on your $PATH at /tmp/pytest-of-root/pytest-2/test_missing_interpreter0/otherdir/pipxbindir\\n   package pycowsay has invalid interpreter /tmp/pytest-of-root/pytest-2/test_missing_interpreter0/subdir/pipxhome/venvs/pycowsay/bin/python\\n\\nOne or more packages have a missing python interpreter.\\n    To fix, execute: pipx reinstall-all\\n\\n', err='').err\n\ntests/test_list.py:36: AssertionError","tests/test_list.py::test_list_legacy_venv[None]":"[...]t_legacy_venv_None_0/subdir/pipxhome/venvs\\napps are exposed on your $PATH at /tmp/pytest-of-root/pytest-2/test_list_legacy_venv_None_0/otherdir/pipxbindir\\n   package pycowsay has missing internal pipx metadata.\\n\\nOne or more packages have a missing internal pipx metadata.\\n   They were likely installed using a pipx version before 0.15.0.0.\\n   Please uninstall and install these package(s) to fix.\\n\\n', err='done! ✨ #x1F31F ✨\\n').err\npipx_temp_env = None\nmonkeypatch = <_pytest.monkeypatch.MonkeyPatch object at 0x7ffff6dfe590>\ncapsys = <_pytest.capture.CaptureFixture object at 0x7ffff6dfc160>\nmetadata_version = None\n\n    @pytest.mark.parametrize(\"metadata_version\", [None, \"0.1\"])\n    def test_list_legacy_venv(pipx_temp_env, monkeypatch, capsys, metadata_version):\n        assert not run_pipx_cli([\"install\", \"pycowsay\"])\n        mock_legacy_venv(\"pycowsay\", metadata_version=metadata_version)\n    \n        if metadata_version is None:\n            assert run_pipx_cli([\"list\"])\n            captured = capsys.readouterr()\n>           assert \"package pycowsay has missing internal pipx metadata\" in captured.err\nE           AssertionError: assert 'package pycowsay has missing internal pipx metadata' in 'done! ✨ #x1F31F ✨\\n'\nE            +  where 'done! ✨ #x1F31F ✨\\n' = CaptureResult(out='creating virtual environment...\\ninstalling pycowsay...\\n  installed package pycowsay 0.0.0.2, Python 3.10.19\\n  These apps are now globally available\\n    - pycowsay\\nvenvs are in /tmp/pytest-of-root/pytest-2/test_list_legacy_venv_None_0/subdir/pipxhome/venvs\\napps are exposed on your $PATH at /tmp/pytest-of-root/pytest-2/test_list_legacy_venv_None_0/otherdir/pipxbindir\\n   package pycowsay has missing internal pipx metadata.\\n\\nOne or more packages have a missing internal pipx metadata.\\n   They were likely installed using a pipx version before 0.15.0.0.\\n   Please uninstall and install these package(s) to fix.\\n\\n', err='done! ✨ #x1F31F ✨\\n').err\n\ntests/test_list.py:56: AssertionError","tests/test_list.py::test_list_legacy_venv[0.1]":"[...]   assert not run_pipx_cli([\"install\", \"pycowsay\"])\n        mock_legacy_venv(\"pycowsay\", metadata_version=metadata_version)\n    \n        if metadata_version is None:\n            assert run_pipx_cli([\"list\"])\n            captured = capsys.readouterr()\n            assert \"package pycowsay has missing internal pipx metadata\" in captured.err\n        else:\n            assert not run_pipx_cli([\"list\"])\n            captured = capsys.readouterr()\n>           assert \"package pycowsay 0.0.0.1,\" in captured.out\nE           AssertionError: assert 'package pycowsay 0.0.0.1,' in 'creating virtual environment...\\ninstalling pycowsay...\\n  installed package pycowsay 0.0.0.2, Python 3.10.19\\n  These apps are now globally available\\n    - pycowsay\\nvenvs are in /tmp/pytest-of-root/pytest-2/test_list_legacy_venv_0_1_0/subdir/pipxhome/venvs\\napps are exposed on your $PATH at /tmp/pytest-of-root/pytest-2/test_list_legacy_venv_0_1_0/otherdir/pipxbindir\\n   package pycowsay 0.0.0.2, Python 3.10.19\\n    - pycowsay\\n'\nE            +  where 'creating virtual environment...\\ninstalling pycowsay...\\n  installed package pycowsay 0.0.0.2, Python 3.10.19\\n  These apps are now globally available\\n    - pycowsay\\nvenvs are in /tmp/pytest-of-root/pytest-2/test_list_legacy_venv_0_1_0/subdir/pipxhome/venvs\\napps are exposed on your $PATH at /tmp/pytest-of-root/pytest-2/test_list_legacy_venv_0_1_0/otherdir/pipxbindir\\n   package pycowsay 0.0.0.2, Python 3.10.19\\n    - pycowsay\\n' = CaptureResult(out='creating virtual environment...\\ninstalling pycowsay...\\n  installed package pycowsay 0.0.0.2, Python 3.10.19\\n  These apps are now globally available\\n    - pycowsay\\nvenvs are in /tmp/pytest-of-root/pytest-2/test_list_legacy_venv_0_1_0/subdir/pipxhome/venvs\\napps are exposed on your $PATH at /tmp/pytest-of-root/pytest-2/test_list_legacy_venv_0_1_0/otherdir/pipxbindir\\n   package pycowsay 0.0.0.2, Python 3.10.19\\n    - pycowsay\\n', err='done! ✨ #x1F31F ✨\\n').out\n\ntests/test_list.py:60: AssertionError"}},"diff":null,"patch_sha256":null,"dropped_paths":[],"snapshot_sha":null}
{"receipt_id":"agent1-4","seq":4,"branch_id":"agent1","kind":"write","cmd":"/opt/receipts-52e85040e1724a53938c9aa5c347ca81/bin/busybox sh -c 'mkdir -p /pipx/src/pipx/commands && cp /opt/receipts-52e85040e1724a53938c9aa5c347ca81/incoming/4f1a33f88260a421b9486406b0e8f33b584ac8304d66669823cdd08370746268 /pipx/src/pipx/commands/list_packages.py'","path":"src/pipx/commands/list_packages.py","exit_code":0,"stdout_tail":"","stderr_tail":"","stdout_sha256":"4f1a33f88260a421b9486406b0e8f33b584ac8304d66669823cdd08370746268","log_path":"~/dev/nebius-hackathon/pilot/v2-P/pipxproject__pipx-680/runs/pilot-pipxproject__pipx-680-183a4a2cf5/logs/agent1/agent1-4.log","tree_digest":null,"tree_download_s":null,"started_at":"2026-10-03T20:15:39.376527Z","duration_s":0.004497,"timed_out":false,"image_before":"e860c42d-f37b-4717-b28e-b30c67410347","image_after":"e70120a8-a333-4ae1-bbfd-5af473354ff9","junit":null,"diff":null,"patch_sha256":null,"dropped_paths":[],"snapshot_sha":null}
{"receipt_id":"agent1-5","seq":5,"branch_id":"agent1","kind":"write","cmd":"/opt/receipts-4820139216564f0a81f33e6f4cdf0ac5/bin/busybox sh -c 'mkdir -p /pipx/src/pipx/commands && cp /opt/receipts-4820139216564f0a81f33e6f4cdf0ac5/incoming/21105245cd8e213e22e5691e4c735266258c6fb23949c76183b1d3f593e8229d /pipx/src/pipx/commands/list_packages.py'","path":"src/pipx/commands/list_packages.py","exit_code":0,"stdout_tail":"","stderr_tail":"","stdout_sha256":"21105245cd8e213e22e5691e4c735266258c6fb23949c76183b1d3f593e8229d","log_path":"~/dev/nebius-hackathon/pilot/v2-P/pipxproject__pipx-680/runs/pilot-pipxproject__pipx-680-183a4a2cf5/logs/agent1/agent1-5.log","tree_digest":null,"tree_download_s":null,"started_at":"2026-10-03T20:15:45.250568Z","duration_s":0.004591,"timed_out":false,"image_before":"e70120a8-a333-4ae1-bbfd-5af473354ff9","image_after":"db58f949-e40e-4dea-967a-3bdc58c7ebfb","junit":null,"diff":null,"patch_sha256":null,"dropped_paths":[],"snapshot_sha":null}
{"receipt_id":"agent1-6","seq":6,"branch_id":"agent1","kind":"command","cmd":"/opt/receipts-88d1a17cae2243d4acb871c80bac165a/bin/busybox mkdir -p /opt/receipts/reports && python -I /opt/receipts-88d1a17cae2243d4acb871c80bac165a/receipts_pytest.py tests/test_list.py::test_cli tests/test_list.py::test_missing_interpreter tests/test_list.py::test_list_legacy_venv -v -o junit_family=xunit1 -p no:cacheprovider -rA --continue-on-collection-errors --junitxml=/opt/receipts/reports/agent1-6.xml","path":null,"exit_code":1,"stdout_tail":"wsay 0.0.0.1,' in 'creating virtual environment...\\ninstalling pycowsay...\\n  installed package pycowsay 0.0.0.2, Python 3.10.19\\n  These apps are now globally available\\n    - pycowsay\\nvenvs are in /tmp/pytest-of-root/pytest-3/test_list_legacy_venv_0_1_0/subdir/pipxhome/venvs\\napps are exposed on your $PATH at /tmp/pytest-of-root/pytest-3/test_list_legacy_venv_0_1_0/otherdir/pipxbindir\\n   package pycowsay 0.0.0.2, Python 3.10.19\\n    - pycowsay\\n'\nE            +  where 'creating virtual environment...\\ninstalling pycowsay...\\n  installed package pycowsay 0.0.0.2, Python 3.10.19\\n  These apps are now globally available\\n    - pycowsay\\nvenvs are in /tmp/pytest-of-root/pytest-3/test_list_legacy_venv_0_1_0/subdir/pipxhome/venvs\\napps are exposed on your $PATH at /tmp/pytest-of-root/pytest-3/test_list_legacy_venv_0_1_0/otherdir/pipxbindir\\n   package pycowsay 0.0.0.2, Python 3.10.19\\n    - pycowsay\\n' = CaptureResult(out='creating virtual environment...\\ninstalling pycowsay...\\n  installed package pycowsay 0.0.0.2, Python 3.10.19\\n  These apps are now globally available\\n    - pycowsay\\nvenvs are in /tmp/pytest-of-root/pytest-3/test_list_legacy_venv_0_1_0/subdir/pipxhome/venvs\\napps are exposed on your $PATH at /tmp/pytest-of-root/pytest-3/test_list_legacy_venv_0_1_0/otherdir/pipxbindir\\n   package pycowsay 0.0.0.2, Python 3.10.19\\n    - pycowsay\\n', err='done! ✨ 🌟 ✨\\n').out\n\ntests/test_list.py:60: AssertionError\n------------------------------ Captured log call -------------------------------\nDEBUG    pipx.main:main.py:715 2026-10-03 20:15:56\nDEBUG    pipx.main:main.py:716 pipx install pycowsay\nINFO     pipx.main:main.py:717 pipx version is 0.16.2.0.1.dev0\nINFO     pipx.main:main.py:718 Default python interpreter is '/usr/local/bin/python'\nINFO     pipx.util:util.py:56 creating directory /tmp/pytest-of-root/pytest-3/test_list_legacy_venv_0_1_0/subdir/pipxhome/venvs\nINFO     pipx.util:util.py:56 creating directory /tmp/pytest-of-root/pytest-3/test_list_legacy_venv_0_1_0/otherdir/pipxbindir\nINFO     pipx.util:util.py:56 creating directory /tmp/pytest-of-root/pytest-3/test_list_legacy_venv_0_1_0/subdir/pipxhome/.cache\nINFO     pipx.commands.common:common.py:320 Determined package name: pycowsay\nINFO     pipx.commands.common:common.py:321 Package name determined in 0.0s\nINFO     pipx.util:util.py:135 running /usr/local/bin/python -m venv --without-pip /tmp/pytest-of-root/pytest-3/test_list_legacy_venv_0_1_0/subdir/pipxhome/venvs/pycowsay\nDEBUG    pipx.util:util.py:148 stdout:\nDEBUG    pipx.util:util.py:150 stderr:\nDEBUG    pipx.util:util.py:151 returncode: 0\nINFO     pipx.util:util.py:135 running /tmp/pytest-of-root/pytest-3/test_list_legacy_venv_0_1_0/subdir/pipxhome/venvs/pycowsay/bin/python -c import sysconfig; print(sysconfig.get_path('purelib'))\nDEBUG    pipx.util:util.py:148 stdout: /tmp/pytest-of-root/pytest-3/test_list_legacy_venv_0_1_0/subdir/pipxhome/venvs/pycowsay/lib/python3.10/site-packages\nDEBUG    pipx.util:util.py:151 returncode: 0\nINFO     pipx.util:util.py:135 running /tmp/pytest-of-root/pytest-3/session_shareddir0/bin/python -c import sysconfig; print(sysconfig.get_path('purelib'))\nDEBUG    pipx.util:util.py:148 stdout: /tmp/pytest-of-root/pytest-3/session_shareddir0/lib/python3.10/site-packages\nDEBUG    pipx.util:util.py:151 returncode: 0\nINFO     pipx.util:util.py:135 running /tmp/pytest-of-root/pytest-3/test_list_legacy_venv_0_1_0/subdir/pipxhome/venvs/pycowsay/bin/python --version\nDEBUG    pipx.util:util.py:148 stdout: Python 3.10.19\nDEBUG    pipx.util:util.py:150 stderr:\nDEBUG    pipx.util:util.py:151 returncode: 0\nINFO     pipx.package_specifier:package_specifier.py:128 cleaned package spec: pycowsay\nINFO     pipx.util:util.py:135 running /tmp/pytest-of-root/pytest-3/test_list_legacy_venv_0_1_0/subdir/pipxhome/venvs/pycowsay/bin/python -m pip install pycowsay\nDEBUG    pipx.util:util.py:151 returncode: 0\nINFO     pipx.util:util.py:135 running <fetch_info_in_venv commands>\nDEBUG    pipx.util:util.py:148 stdout: {\"sys_path\": [\"/usr/local/lib/python310.zip\", \"/usr/local/lib/python3.10\", \"/usr/local/lib/python3.10/lib-dynload\", \"/tmp/pytest-of-root/pytest-3/test_list_legacy_venv_0_1_0/subdir/pipxhome/venvs/pycowsay/lib/python3.10/site-packages\", \"/tmp/pytest-of-root/pytest-3/session_shareddir0/lib/python3.10/site-packages\"], \"python_version\": \"3.10.19\", \"environment\": {\"implementation_name\": \"cpython\", \"implementation_version\": \"3.10.19\", \"os_name\": \"posix\", \"platform_machine\": \"x86_64\", \"platform_release\": \"7.0.6\", \"platform_system\": \"Linux\", \"platform_version\": \"#1 SMP PREEMPT_DYNAMIC Mon Aug 24 09:29:13 UTC 2026\", \"python_full_version\": \"3.10.19\", \"platform_python_implementation\": \"CPython\", \"python_version\": \"3.10\", \"sys_platform\": \"linux\"}}\nDEBUG    pipx.util:util.py:151 returncode: 0\nINFO     pipx.venv:venv.py:303 get_venv_metadata_for_package: 25ms\nINFO     pipx.package_specifier:package_specifier.py:128 cleaned package spec: pycowsay\nINFO     pipx.shared_libs:shared_libs.py:69 Time since last upgrade of shared libs, in seconds: 1. Upgrade will be run by pipx if greater than 2592000.\nDEBUG    pipx.main:main.py:776 pipx finished.\nDEBUG    pipx.main:main.py:715 2026-10-03 20:15:57\nDEBUG    pipx.main:main.py:716 pipx list\nINFO     pipx.main:main.py:717 pipx version is 0.16.2.0.1.dev0\nINFO     pipx.main:main.py:718 Default python interpreter is '/usr/local/bin/python'\nDEBUG    pipx.main:main.py:776 pipx finished.\n------------ generated xml file: /opt/receipts/reports/agent1-6.xml ------------\n=========================== short test summary info ============================\nFAILED tests/test_list.py::test_cli - AssertionError: assert 'nothing has bee...\nFAILED tests/test_list.py::test_missing_interpreter - AssertionError: assert ...\nFAILED tests/test_list.py::test_list_legacy_venv[None] - AssertionError: asse...\nFAILED tests/test_list.py::test_list_legacy_venv[0.1] - AssertionError: asser...\n============================== 4 failed in 7.29s ===============================\n","stderr_tail":"","stdout_sha256":"f17952d88ff8a97ec963dff6d62109c288dbcf47b386676f63e9ef949078cbf1","log_path":"~/dev/nebius-hackathon/pilot/v2-P/pipxproject__pipx-680/runs/pilot-pipxproject__pipx-680-183a4a2cf5/logs/agent1/agent1-6.log","tree_digest":"fb2aaf837bc5bcbb5a33f9fee7e0b46c695adb853965eea467c7276f68c72fdf","tree_download_s":3.1141990409232676,"started_at":"2026-10-03T20:15:48.298304Z","duration_s":6.006363,"timed_out":false,"image_before":"db58f949-e40e-4dea-967a-3bdc58c7ebfb","image_after":"c69c7058-e2b4-43ce-a0b8-d7fc1614dc6a","junit":{"passed":[],"failed":["tests/test_list.py::test_cli","tests/test_list.py::test_missing_interpreter","tests/test_list.py::test_list_legacy_venv[None]","tests/test_list.py::test_list_legacy_venv[0.1]"],"errors":[],"skipped":[],"collection_errors":[],"failure_text":{"tests/test_list.py::test_cli":"AssertionError: assert 'nothing has been installed with pipx' in ''\n +  where '' = CaptureResult(out='nothing has been installed with pipx #x1F634\\n', err='').err\npipx_temp_env = None\nmonkeypatch = <_pytest.monkeypatch.MonkeyPatch object at 0x7ffff6c5b310>\ncapsys = <_pytest.capture.CaptureFixture object at 0x7ffff6c5a410>\n\n    def test_cli(pipx_temp_env, monkeypatch, capsys):\n        assert not run_pipx_cli([\"list\"])\n        captured = capsys.readouterr()\n>       assert \"nothing has been installed with pipx\" in captured.err\nE       AssertionError: assert 'nothing has been installed with pipx' in ''\nE        +  where '' = CaptureResult(out='nothing has been installed with pipx #x1F634\\n', err='').err\n\ntests/test_list.py:22: AssertionError","tests/test_list.py::test_missing_interpreter":"AssertionError: assert 'package pycowsay has invalid interpreter' in ''\n +  where '' = CaptureResult(out='venvs are in /tmp/pytest-of-root/pytest-3/test_missing_interpreter0/subdir/pipxhome/venvs\\napps are exposed on your $PATH at /tmp/pytest-of-root/pytest-3/test_missing_interpreter0/otherdir/pipxbindir\\n   package pycowsay has invalid interpreter /tmp/pytest-of-root/pytest-3/test_missing_interpreter0/subdir/pipxhome/venvs/pycowsay/bin/python\\n\\nOne or more packages have a missing python interpreter.\\n    To fix, execute: pipx reinstall-all\\n\\n', err='').err\npipx_temp_env = None\nmonkeypatch = <_pytest.monkeypatch.MonkeyPatch object at 0x7ffff6c5a350>\ncapsys = <_pytest.capture.CaptureFixture object at 0x7ffff6c59630>\n\n    def test_missing_interpreter(pipx_temp_env, monkeypatch, capsys):\n        assert not run_pipx_cli([\"install\", \"pycowsay\"])\n    \n        assert not run_pipx_cli([\"list\"])\n        captured = capsys.readouterr()\n        assert \"package pycowsay has invalid interpreter\" not in captured.err\n    \n        remove_venv_interpreter(\"pycowsay\")\n    \n        assert run_pipx_cli([\"list\"])\n        captured = capsys.readouterr()\n>       assert \"package pycowsay has invalid interpreter\" in captured.err\nE       AssertionError: assert 'package pycowsay has invalid interpreter' in ''\nE        +  where '' = CaptureResult(out='venvs are in /tmp/pytest-of-root/pytest-3/test_missing_interpreter0/subdir/pipxhome/venvs\\napps are exposed on your $PATH at /tmp/pytest-of-root/pytest-3/test_missing_interpreter0/otherdir/pipxbindir\\n   package pycowsay has invalid interpreter /tmp/pytest-of-root/pytest-3/test_missing_interpreter0/subdir/pipxhome/venvs/pycowsay/bin/python\\n\\nOne or more packages have a missing python interpreter.\\n    To fix, execute: pipx reinstall-all\\n\\n', err='').err\n\ntests/test_list.py:36: AssertionError","tests/test_list.py::test_list_legacy_venv[None]":"[...]t_legacy_venv_None_0/subdir/pipxhome/venvs\\napps are exposed on your $PATH at /tmp/pytest-of-root/pytest-3/test_list_legacy_venv_None_0/otherdir/pipxbindir\\n   package pycowsay has missing internal pipx metadata.\\n\\nOne or more packages have a missing internal pipx metadata.\\n   They were likely installed using a pipx version before 0.15.0.0.\\n   Please uninstall and install these package(s) to fix.\\n\\n', err='done! ✨ #x1F31F ✨\\n').err\npipx_temp_env = None\nmonkeypatch = <_pytest.monkeypatch.MonkeyPatch object at 0x7ffff6dfcee0>\ncapsys = <_pytest.capture.CaptureFixture object at 0x7ffff6dfe320>\nmetadata_version = None\n\n    @pytest.mark.parametrize(\"metadata_version\", [None, \"0.1\"])\n    def test_list_legacy_venv(pipx_temp_env, monkeypatch, capsys, metadata_version):\n        assert not run_pipx_cli([\"install\", \"pycowsay\"])\n        mock_legacy_venv(\"pycowsay\", metadata_version=metadata_version)\n    \n        if metadata_version is None:\n            assert run_pipx_cli([\"list\"])\n            captured = capsys.readouterr()\n>           assert \"package pycowsay has missing internal pipx metadata\" in captured.err\nE           AssertionError: assert 'package pycowsay has missing internal pipx metadata' in 'done! ✨ #x1F31F ✨\\n'\nE            +  where 'done! ✨ #x1F31F ✨\\n' = CaptureResult(out='creating virtual environment...\\ninstalling pycowsay...\\n  installed package pycowsay 0.0.0.2, Python 3.10.19\\n  These apps are now globally available\\n    - pycowsay\\nvenvs are in /tmp/pytest-of-root/pytest-3/test_list_legacy_venv_None_0/subdir/pipxhome/venvs\\napps are exposed on your $PATH at /tmp/pytest-of-root/pytest-3/test_list_legacy_venv_None_0/otherdir/pipxbindir\\n   package pycowsay has missing internal pipx metadata.\\n\\nOne or more packages have a missing internal pipx metadata.\\n   They were likely installed using a pipx version before 0.15.0.0.\\n   Please uninstall and install these package(s) to fix.\\n\\n', err='done! ✨ #x1F31F ✨\\n').err\n\ntests/test_list.py:56: AssertionError","tests/test_list.py::test_list_legacy_venv[0.1]":"[...]   assert not run_pipx_cli([\"install\", \"pycowsay\"])\n        mock_legacy_venv(\"pycowsay\", metadata_version=metadata_version)\n    \n        if metadata_version is None:\n            assert run_pipx_cli([\"list\"])\n            captured = capsys.readouterr()\n            assert \"package pycowsay has missing internal pipx metadata\" in captured.err\n        else:\n            assert not run_pipx_cli([\"list\"])\n            captured = capsys.readouterr()\n>           assert \"package pycowsay 0.0.0.1,\" in captured.out\nE           AssertionError: assert 'package pycowsay 0.0.0.1,' in 'creating virtual environment...\\ninstalling pycowsay...\\n  installed package pycowsay 0.0.0.2, Python 3.10.19\\n  These apps are now globally available\\n    - pycowsay\\nvenvs are in /tmp/pytest-of-root/pytest-3/test_list_legacy_venv_0_1_0/subdir/pipxhome/venvs\\napps are exposed on your $PATH at /tmp/pytest-of-root/pytest-3/test_list_legacy_venv_0_1_0/otherdir/pipxbindir\\n   package pycowsay 0.0.0.2, Python 3.10.19\\n    - pycowsay\\n'\nE            +  where 'creating virtual environment...\\ninstalling pycowsay...\\n  installed package pycowsay 0.0.0.2, Python 3.10.19\\n  These apps are now globally available\\n    - pycowsay\\nvenvs are in /tmp/pytest-of-root/pytest-3/test_list_legacy_venv_0_1_0/subdir/pipxhome/venvs\\napps are exposed on your $PATH at /tmp/pytest-of-root/pytest-3/test_list_legacy_venv_0_1_0/otherdir/pipxbindir\\n   package pycowsay 0.0.0.2, Python 3.10.19\\n    - pycowsay\\n' = CaptureResult(out='creating virtual environment...\\ninstalling pycowsay...\\n  installed package pycowsay 0.0.0.2, Python 3.10.19\\n  These apps are now globally available\\n    - pycowsay\\nvenvs are in /tmp/pytest-of-root/pytest-3/test_list_legacy_venv_0_1_0/subdir/pipxhome/venvs\\napps are exposed on your $PATH at /tmp/pytest-of-root/pytest-3/test_list_legacy_venv_0_1_0/otherdir/pipxbindir\\n   package pycowsay 0.0.0.2, Python 3.10.19\\n    - pycowsay\\n', err='done! ✨ #x1F31F ✨\\n').out\n\ntests/test_list.py:60: AssertionError"}},"diff":null,"patch_sha256":null,"dropped_paths":[],"snapshot_sha":null}
{"receipt_id":"agent1-7","seq":7,"branch_id":"agent1","kind":"command","cmd":"/opt/receipts-cc9cd56bf2be4269bc5fa434a27f6a68/bin/busybox mkdir -p /opt/receipts/reports && python -I /opt/receipts-cc9cd56bf2be4269bc5fa434a27f6a68/receipts_pytest.py tests/test_list.py::test_list_json -v -o junit_family=xunit1 -p no:cacheprovider -rA --continue-on-collection-errors --junitxml=/opt/receipts/reports/agent1-7.xml","path":null,"exit_code":0,"stdout_tail":"site-packages\", \"/tmp/pytest-of-root/pytest-4/session_shareddir0/lib/python3.10/site-packages\"], \"python_version\": \"3.10.19\", \"environment\": {\"implementation_name\": \"cpython\", \"implementation_version\": \"3.10.19\", \"os_name\": \"posix\", \"platform_machine\": \"x86_64\", \"platform_release\": \"7.0.6\", \"platform_system\": \"Linux\", \"platform_version\": \"#1 SMP PREEMPT_DYNAMIC Mon Aug 24 09:29:13 UTC 2026\", \"python_full_version\": \"3.10.19\", \"platform_python_implementation\": \"CPython\", \"python_version\": \"3.10\", \"sys_platform\": \"linux\"}}\nDEBUG    pipx.util:util.py:151 returncode: 0\nINFO     pipx.venv:venv.py:303 get_venv_metadata_for_package: 26ms\nINFO     pipx.package_specifier:package_specifier.py:128 cleaned package spec: pycowsay==0.0.0.1\nDEBUG    pipx.main:main.py:776 pipx finished.\nDEBUG    pipx.main:main.py:715 2026-10-03 20:16:18\nDEBUG    pipx.main:main.py:716 pipx install pylint==2.3.1\nINFO     pipx.main:main.py:717 pipx version is 0.16.2.0.1.dev0\nINFO     pipx.main:main.py:718 Default python interpreter is '/usr/local/bin/python'\nINFO     pipx.commands.common:common.py:320 Determined package name: pylint\nINFO     pipx.commands.common:common.py:321 Package name determined in 0.0s\nINFO     pipx.util:util.py:135 running /usr/local/bin/python -m venv --without-pip /tmp/pytest-of-root/pytest-4/test_list_json0/subdir/pipxhome/venvs/pylint\nDEBUG    pipx.util:util.py:148 stdout:\nDEBUG    pipx.util:util.py:150 stderr:\nDEBUG    pipx.util:util.py:151 returncode: 0\nINFO     pipx.util:util.py:135 running /tmp/pytest-of-root/pytest-4/test_list_json0/subdir/pipxhome/venvs/pylint/bin/python -c import sysconfig; print(sysconfig.get_path('purelib'))\nDEBUG    pipx.util:util.py:148 stdout: /tmp/pytest-of-root/pytest-4/test_list_json0/subdir/pipxhome/venvs/pylint/lib/python3.10/site-packages\nDEBUG    pipx.util:util.py:151 returncode: 0\nINFO     pipx.util:util.py:135 running /tmp/pytest-of-root/pytest-4/test_list_json0/subdir/pipxhome/venvs/pylint/bin/python --version\nDEBUG    pipx.util:util.py:148 stdout: Python 3.10.19\nDEBUG    pipx.util:util.py:150 stderr:\nDEBUG    pipx.util:util.py:151 returncode: 0\nINFO     pipx.package_specifier:package_specifier.py:128 cleaned package spec: pylint==2.3.1\nINFO     pipx.util:util.py:135 running /tmp/pytest-of-root/pytest-4/test_list_json0/subdir/pipxhome/venvs/pylint/bin/python -m pip install pylint==2.3.1\nDEBUG    pipx.util:util.py:151 returncode: 0\nINFO     pipx.util:util.py:135 running <fetch_info_in_venv commands>\nDEBUG    pipx.util:util.py:148 stdout: {\"sys_path\": [\"/usr/local/lib/python310.zip\", \"/usr/local/lib/python3.10\", \"/usr/local/lib/python3.10/lib-dynload\", \"/tmp/pytest-of-root/pytest-4/test_list_json0/subdir/pipxhome/venvs/pylint/lib/python3.10/site-packages\", \"/tmp/pytest-of-root/pytest-4/session_shareddir0/lib/python3.10/site-packages\"], \"python_version\": \"3.10.19\", \"environment\": {\"implementation_name\": \"cpython\", \"implementation_version\": \"3.10.19\", \"os_name\": \"posix\", \"platform_machine\": \"x86_64\", \"platform_release\": \"7.0.6\", \"platform_system\": \"Linux\", \"platform_version\": \"#1 SMP PREEMPT_DYNAMIC Mon Aug 24 09:29:13 UTC 2026\", \"python_full_version\": \"3.10.19\", \"platform_python_implementation\": \"CPython\", \"python_version\": \"3.10\", \"sys_platform\": \"linux\"}}\nDEBUG    pipx.util:util.py:151 returncode: 0\nINFO     pipx.venv:venv.py:303 get_venv_metadata_for_package: 76ms\nINFO     pipx.package_specifier:package_specifier.py:128 cleaned package spec: pylint==2.3.1\nDEBUG    pipx.main:main.py:776 pipx finished.\nDEBUG    pipx.main:main.py:715 2026-10-03 20:16:20\nDEBUG    pipx.main:main.py:716 pipx inject pylint isort==5.6.4\nINFO     pipx.main:main.py:717 pipx version is 0.16.2.0.1.dev0\nINFO     pipx.main:main.py:718 Default python interpreter is '/usr/local/bin/python'\nINFO     pipx.main:main.py:168 Virtual Environment location is /tmp/pytest-of-root/pytest-4/test_list_json0/subdir/pipxhome/venvs/pylint\nINFO     pipx.commands.common:common.py:320 Determined package name: isort\nINFO     pipx.commands.common:common.py:321 Package name determined in 0.0s\nINFO     pipx.package_specifier:package_specifier.py:128 cleaned package spec: isort==5.6.4\nINFO     pipx.util:util.py:135 running /tmp/pytest-of-root/pytest-4/test_list_json0/subdir/pipxhome/venvs/pylint/bin/python -m pip install isort==5.6.4\nDEBUG    pipx.util:util.py:151 returncode: 0\nINFO     pipx.util:util.py:135 running <fetch_info_in_venv commands>\nDEBUG    pipx.util:util.py:148 stdout: {\"sys_path\": [\"/usr/local/lib/python310.zip\", \"/usr/local/lib/python3.10\", \"/usr/local/lib/python3.10/lib-dynload\", \"/tmp/pytest-of-root/pytest-4/test_list_json0/subdir/pipxhome/venvs/pylint/lib/python3.10/site-packages\", \"/tmp/pytest-of-root/pytest-4/session_shareddir0/lib/python3.10/site-packages\"], \"python_version\": \"3.10.19\", \"environment\": {\"implementation_name\": \"cpython\", \"implementation_version\": \"3.10.19\", \"os_name\": \"posix\", \"platform_machine\": \"x86_64\", \"platform_release\": \"7.0.6\", \"platform_system\": \"Linux\", \"platform_version\": \"#1 SMP PREEMPT_DYNAMIC Mon Aug 24 09:29:13 UTC 2026\", \"python_full_version\": \"3.10.19\", \"platform_python_implementation\": \"CPython\", \"python_version\": \"3.10\", \"sys_platform\": \"linux\"}}\nDEBUG    pipx.util:util.py:151 returncode: 0\nINFO     pipx.venv:venv.py:303 get_venv_metadata_for_package: 32ms\nINFO     pipx.package_specifier:package_specifier.py:128 cleaned package spec: isort==5.6.4\nDEBUG    pipx.main:main.py:776 pipx finished.\nDEBUG    pipx.main:main.py:715 2026-10-03 20:16:21\nDEBUG    pipx.main:main.py:716 pipx list --json\nINFO     pipx.main:main.py:717 pipx version is 0.16.2.0.1.dev0\nINFO     pipx.main:main.py:718 Default python interpreter is '/usr/local/bin/python'\nDEBUG    pipx.main:main.py:776 pipx finished.\n------------ generated xml file: /opt/receipts/reports/agent1-7.xml ------------\n=========================== short test summary info ============================\nPASSED tests/test_list.py::test_list_json\n============================== 1 passed in 8.79s ===============================\n","stderr_tail":"","stdout_sha256":"aed844c1da0a202cbb8f85b8b11ee1f23eaaaa7952dfcfe0de6d9fdbdaf1b513","log_path":"~/dev/nebius-hackathon/pilot/v2-P/pipxproject__pipx-680/runs/pilot-pipxproject__pipx-680-183a4a2cf5/logs/agent1/agent1-7.log","tree_digest":"fb2aaf837bc5bcbb5a33f9fee7e0b46c695adb853965eea467c7276f68c72fdf","tree_download_s":2.7055842499248683,"started_at":"2026-10-03T20:16:11.122089Z","duration_s":7.0953159999999995,"timed_out":false,"image_before":"c69c7058-e2b4-43ce-a0b8-d7fc1614dc6a","image_after":"5f565f67-03e3-4b42-b814-6d394e2fea00","junit":{"passed":["tests/test_list.py::test_list_json"],"failed":[],"errors":[],"skipped":[],"collection_errors":[],"failure_text":{}},"diff":null,"patch_sha256":null,"dropped_paths":[],"snapshot_sha":null}
{"receipt_id":"agent1-8","seq":8,"branch_id":"agent1","kind":"command","cmd":"/opt/receipts-1e8c6c418e42453daa2f185fb07a1e1e/bin/busybox mkdir -p /opt/receipts/reports && python -I /opt/receipts-1e8c6c418e42453daa2f185fb07a1e1e/receipts_pytest.py tests/test_list.py::test_cli -v -s -o junit_family=xunit1 -p no:cacheprovider -rA --continue-on-collection-errors --junitxml=/opt/receipts/reports/agent1-8.xml","path":null,"exit_code":1,"stdout_tail":"============================= test session starts ==============================\nplatform linux -- Python 3.10.19, pytest-9.0.2, pluggy-1.6.0 -- /usr/local/bin/python\nrootdir: /pipx\nconfigfile: pyproject.toml\nplugins: cov-7.0.0\ncollecting ... collected 1 item\n\ntests/test_list.py::test_cli FAILED\n\n=================================== FAILURES ===================================\n___________________________________ test_cli ___________________________________\n\npipx_temp_env = None\nmonkeypatch = <_pytest.monkeypatch.MonkeyPatch object at 0x7ffff696a440>\ncapsys = <_pytest.capture.CaptureFixture object at 0x7ffff696a2f0>\n\n    def test_cli(pipx_temp_env, monkeypatch, capsys):\n        assert not run_pipx_cli([\"list\"])\n        captured = capsys.readouterr()\n>       assert \"nothing has been installed with pipx\" in captured.err\nE       AssertionError: assert 'nothing has been installed with pipx' in ''\nE        +  where '' = CaptureResult(out='nothing has been installed with pipx 😴\\n', err='').err\n\ntests/test_list.py:22: AssertionError\n------------------------------ Captured log call -------------------------------\nDEBUG    pipx.main:main.py:715 2026-10-03 20:16:34\nDEBUG    pipx.main:main.py:716 pipx list\nINFO     pipx.main:main.py:717 pipx version is 0.16.2.0.1.dev0\nINFO     pipx.main:main.py:718 Default python interpreter is '/usr/local/bin/python'\nINFO     pipx.util:util.py:56 creating directory /tmp/pytest-of-root/pytest-5/test_cli0/subdir/pipxhome/venvs\nINFO     pipx.util:util.py:56 creating directory /tmp/pytest-of-root/pytest-5/test_cli0/otherdir/pipxbindir\nINFO     pipx.util:util.py:56 creating directory /tmp/pytest-of-root/pytest-5/test_cli0/subdir/pipxhome/.cache\nDEBUG    pipx.main:main.py:776 pipx finished.\n------------ generated xml file: /opt/receipts/reports/agent1-8.xml ------------\n=========================== short test summary info ============================\nFAILED tests/test_list.py::test_cli - AssertionError: assert 'nothing has bee...\n============================== 1 failed in 0.06s ===============================\n","stderr_tail":"","stdout_sha256":"9147cd80b75dede2a05c3b1fe729623612b40f1fce54276dc531d5a8e6ea849d","log_path":"~/dev/nebius-hackathon/pilot/v2-P/pipxproject__pipx-680/runs/pilot-pipxproject__pipx-680-183a4a2cf5/logs/agent1/agent1-8.log","tree_digest":"fb2aaf837bc5bcbb5a33f9fee7e0b46c695adb853965eea467c7276f68c72fdf","tree_download_s":2.7361343749798834,"started_at":"2026-10-03T20:16:33.184512Z","duration_s":0.770786,"timed_out":false,"image_before":"5f565f67-03e3-4b42-b814-6d394e2fea00","image_after":"fb36f852-3b75-4142-b0c6-0d0a441da876","junit":{"passed":[],"failed":["tests/test_list.py::test_cli"],"errors":[],"skipped":[],"collection_errors":[],"failure_text":{"tests/test_list.py::test_cli":"AssertionError: assert 'nothing has been installed with pipx' in ''\n +  where '' = CaptureResult(out='nothing has been installed with pipx #x1F634\\n', err='').err\npipx_temp_env = None\nmonkeypatch = <_pytest.monkeypatch.MonkeyPatch object at 0x7ffff696a440>\ncapsys = <_pytest.capture.CaptureFixture object at 0x7ffff696a2f0>\n\n    def test_cli(pipx_temp_env, monkeypatch, capsys):\n        assert not run_pipx_cli([\"list\"])\n        captured = capsys.readouterr()\n>       assert \"nothing has been installed with pipx\" in captured.err\nE       AssertionError: assert 'nothing has been installed with pipx' in ''\nE        +  where '' = CaptureResult(out='nothing has been installed with pipx #x1F634\\n', err='').err\n\ntests/test_list.py:22: AssertionError"}},"diff":null,"patch_sha256":null,"dropped_paths":[],"snapshot_sha":null}
{"receipt_id":"agent1-9","seq":9,"branch_id":"agent1","kind":"write","cmd":"/opt/receipts-043a56a1b60e4f11941e63f84a8c052e/bin/busybox sh -c 'mkdir -p /pipx/src/pipx/commands && cp /opt/receipts-043a56a1b60e4f11941e63f84a8c052e/incoming/0cdec5d2e5697725c99986189b94ab4f6a6a151922a58627108485f66fb8d752 /pipx/src/pipx/commands/list_packages.py'","path":"src/pipx/commands/list_packages.py","exit_code":0,"stdout_tail":"","stderr_tail":"","stdout_sha256":"0cdec5d2e5697725c99986189b94ab4f6a6a151922a58627108485f66fb8d752","log_path":"~/dev/nebius-hackathon/pilot/v2-P/pipxproject__pipx-680/runs/pilot-pipxproject__pipx-680-183a4a2cf5/logs/agent1/agent1-9.log","tree_digest":null,"tree_download_s":null,"started_at":"2026-10-03T20:16:49.318057Z","duration_s":0.004839,"timed_out":false,"image_before":"fb36f852-3b75-4142-b0c6-0d0a441da876","image_after":"24f5255a-1534-4b68-9409-57606d84f566","junit":null,"diff":null,"patch_sha256":null,"dropped_paths":[],"snapshot_sha":null}
{"receipt_id":"agent1-10","seq":10,"branch_id":"agent1","kind":"command","cmd":"/opt/receipts-f3ba15fa34dd4cfb93b327095d32cac3/bin/busybox mkdir -p /opt/receipts/reports && python -I /opt/receipts-f3ba15fa34dd4cfb93b327095d32cac3/receipts_pytest.py tests/test_list.py::test_cli -v -o junit_family=xunit1 -p no:cacheprovider -rA --continue-on-collection-errors --junitxml=/opt/receipts/reports/agent1-10.xml","path":null,"exit_code":0,"stdout_tail":"============================= test session starts ==============================\nplatform linux -- Python 3.10.19, pytest-9.0.2, pluggy-1.6.0 -- /usr/local/bin/python\nrootdir: /pipx\nconfigfile: pyproject.toml\nplugins: cov-7.0.0\ncollecting ... collected 1 item\n\ntests/test_list.py::test_cli PASSED                                      [100%]\n\n==================================== PASSES ====================================\n___________________________________ test_cli ___________________________________\n------------------------------ Captured log call -------------------------------\nDEBUG    pipx.main:main.py:715 2026-10-03 20:16:53\nDEBUG    pipx.main:main.py:716 pipx list\nINFO     pipx.main:main.py:717 pipx version is 0.16.2.0.1.dev0\nINFO     pipx.main:main.py:718 Default python interpreter is '/usr/local/bin/python'\nINFO     pipx.util:util.py:56 creating directory /tmp/pytest-of-root/pytest-6/test_cli0/subdir/pipxhome/venvs\nINFO     pipx.util:util.py:56 creating directory /tmp/pytest-of-root/pytest-6/test_cli0/otherdir/pipxbindir\nINFO     pipx.util:util.py:56 creating directory /tmp/pytest-of-root/pytest-6/test_cli0/subdir/pipxhome/.cache\nDEBUG    pipx.main:main.py:776 pipx finished.\n----------- generated xml file: /opt/receipts/reports/agent1-10.xml ------------\n=========================== short test summary info ============================\nPASSED tests/test_list.py::test_cli\n============================== 1 passed in 0.04s ===============================\n","stderr_tail":"","stdout_sha256":"c9c3ed89bb604daa4f29e67a02278f95e1cfb5194eba42c70f1fedb8bae019b7","log_path":"~/dev/nebius-hackathon/pilot/v2-P/pipxproject__pipx-680/runs/pilot-pipxproject__pipx-680-183a4a2cf5/logs/agent1/agent1-10.log","tree_digest":"688dd7c6d887c451b8cd2f666f6115c18388bf3d29025fdd0afa461edc720cc2","tree_download_s":2.7443331251852214,"started_at":"2026-10-03T20:16:51.694023Z","duration_s":0.778042,"timed_out":false,"image_before":"24f5255a-1534-4b68-9409-57606d84f566","image_after":"563392e5-20c0-43e8-9b44-4d19d4a30675","junit":{"passed":["tests/test_list.py::test_cli"],"failed":[],"errors":[],"skipped":[],"collection_errors":[],"failure_text":{}},"diff":null,"patch_sha256":null,"dropped_paths":[],"snapshot_sha":null}
{"receipt_id":"agent1-11","seq":11,"branch_id":"agent1","kind":"command","cmd":"/opt/receipts-086a3b88590e468f8838cfeadd49b8ee/bin/busybox mkdir -p /opt/receipts/reports && python -I /opt/receipts-086a3b88590e468f8838cfeadd49b8ee/receipts_pytest.py tests/test_list.py::test_list_json -v -o junit_family=xunit1 -p no:cacheprovider -rA --continue-on-collection-errors --junitxml=/opt/receipts/reports/agent1-11.xml","path":null,"exit_code":0,"stdout_tail":"site-packages\", \"/tmp/pytest-of-root/pytest-7/session_shareddir0/lib/python3.10/site-packages\"], \"python_version\": \"3.10.19\", \"environment\": {\"implementation_name\": \"cpython\", \"implementation_version\": \"3.10.19\", \"os_name\": \"posix\", \"platform_machine\": \"x86_64\", \"platform_release\": \"7.0.6\", \"platform_system\": \"Linux\", \"platform_version\": \"#1 SMP PREEMPT_DYNAMIC Mon Aug 24 09:29:13 UTC 2026\", \"python_full_version\": \"3.10.19\", \"platform_python_implementation\": \"CPython\", \"python_version\": \"3.10\", \"sys_platform\": \"linux\"}}\nDEBUG    pipx.util:util.py:151 returncode: 0\nINFO     pipx.venv:venv.py:303 get_venv_metadata_for_package: 27ms\nINFO     pipx.package_specifier:package_specifier.py:128 cleaned package spec: pycowsay==0.0.0.1\nDEBUG    pipx.main:main.py:776 pipx finished.\nDEBUG    pipx.main:main.py:715 2026-10-03 20:17:07\nDEBUG    pipx.main:main.py:716 pipx install pylint==2.3.1\nINFO     pipx.main:main.py:717 pipx version is 0.16.2.0.1.dev0\nINFO     pipx.main:main.py:718 Default python interpreter is '/usr/local/bin/python'\nINFO     pipx.commands.common:common.py:320 Determined package name: pylint\nINFO     pipx.commands.common:common.py:321 Package name determined in 0.0s\nINFO     pipx.util:util.py:135 running /usr/local/bin/python -m venv --without-pip /tmp/pytest-of-root/pytest-7/test_list_json0/subdir/pipxhome/venvs/pylint\nDEBUG    pipx.util:util.py:148 stdout:\nDEBUG    pipx.util:util.py:150 stderr:\nDEBUG    pipx.util:util.py:151 returncode: 0\nINFO     pipx.util:util.py:135 running /tmp/pytest-of-root/pytest-7/test_list_json0/subdir/pipxhome/venvs/pylint/bin/python -c import sysconfig; print(sysconfig.get_path('purelib'))\nDEBUG    pipx.util:util.py:148 stdout: /tmp/pytest-of-root/pytest-7/test_list_json0/subdir/pipxhome/venvs/pylint/lib/python3.10/site-packages\nDEBUG    pipx.util:util.py:151 returncode: 0\nINFO     pipx.util:util.py:135 running /tmp/pytest-of-root/pytest-7/test_list_json0/subdir/pipxhome/venvs/pylint/bin/python --version\nDEBUG    pipx.util:util.py:148 stdout: Python 3.10.19\nDEBUG    pipx.util:util.py:150 stderr:\nDEBUG    pipx.util:util.py:151 returncode: 0\nINFO     pipx.package_specifier:package_specifier.py:128 cleaned package spec: pylint==2.3.1\nINFO     pipx.util:util.py:135 running /tmp/pytest-of-root/pytest-7/test_list_json0/subdir/pipxhome/venvs/pylint/bin/python -m pip install pylint==2.3.1\nDEBUG    pipx.util:util.py:151 returncode: 0\nINFO     pipx.util:util.py:135 running <fetch_info_in_venv commands>\nDEBUG    pipx.util:util.py:148 stdout: {\"sys_path\": [\"/usr/local/lib/python310.zip\", \"/usr/local/lib/python3.10\", \"/usr/local/lib/python3.10/lib-dynload\", \"/tmp/pytest-of-root/pytest-7/test_list_json0/subdir/pipxhome/venvs/pylint/lib/python3.10/site-packages\", \"/tmp/pytest-of-root/pytest-7/session_shareddir0/lib/python3.10/site-packages\"], \"python_version\": \"3.10.19\", \"environment\": {\"implementation_name\": \"cpython\", \"implementation_version\": \"3.10.19\", \"os_name\": \"posix\", \"platform_machine\": \"x86_64\", \"platform_release\": \"7.0.6\", \"platform_system\": \"Linux\", \"platform_version\": \"#1 SMP PREEMPT_DYNAMIC Mon Aug 24 09:29:13 UTC 2026\", \"python_full_version\": \"3.10.19\", \"platform_python_implementation\": \"CPython\", \"python_version\": \"3.10\", \"sys_platform\": \"linux\"}}\nDEBUG    pipx.util:util.py:151 returncode: 0\nINFO     pipx.venv:venv.py:303 get_venv_metadata_for_package: 79ms\nINFO     pipx.package_specifier:package_specifier.py:128 cleaned package spec: pylint==2.3.1\nDEBUG    pipx.main:main.py:776 pipx finished.\nDEBUG    pipx.main:main.py:715 2026-10-03 20:17:09\nDEBUG    pipx.main:main.py:716 pipx inject pylint isort==5.6.4\nINFO     pipx.main:main.py:717 pipx version is 0.16.2.0.1.dev0\nINFO     pipx.main:main.py:718 Default python interpreter is '/usr/local/bin/python'\nINFO     pipx.main:main.py:168 Virtual Environment location is /tmp/pytest-of-root/pytest-7/test_list_json0/subdir/pipxhome/venvs/pylint\nINFO     pipx.commands.common:common.py:320 Determined package name: isort\nINFO     pipx.commands.common:common.py:321 Package name determined in 0.0s\nINFO     pipx.package_specifier:package_specifier.py:128 cleaned package spec: isort==5.6.4\nINFO     pipx.util:util.py:135 running /tmp/pytest-of-root/pytest-7/test_list_json0/subdir/pipxhome/venvs/pylint/bin/python -m pip install isort==5.6.4\nDEBUG    pipx.util:util.py:151 returncode: 0\nINFO     pipx.util:util.py:135 running <fetch_info_in_venv commands>\nDEBUG    pipx.util:util.py:148 stdout: {\"sys_path\": [\"/usr/local/lib/python310.zip\", \"/usr/local/lib/python3.10\", \"/usr/local/lib/python3.10/lib-dynload\", \"/tmp/pytest-of-root/pytest-7/test_list_json0/subdir/pipxhome/venvs/pylint/lib/python3.10/site-packages\", \"/tmp/pytest-of-root/pytest-7/session_shareddir0/lib/python3.10/site-packages\"], \"python_version\": \"3.10.19\", \"environment\": {\"implementation_name\": \"cpython\", \"implementation_version\": \"3.10.19\", \"os_name\": \"posix\", \"platform_machine\": \"x86_64\", \"platform_release\": \"7.0.6\", \"platform_system\": \"Linux\", \"platform_version\": \"#1 SMP PREEMPT_DYNAMIC Mon Aug 24 09:29:13 UTC 2026\", \"python_full_version\": \"3.10.19\", \"platform_python_implementation\": \"CPython\", \"python_version\": \"3.10\", \"sys_platform\": \"linux\"}}\nDEBUG    pipx.util:util.py:151 returncode: 0\nINFO     pipx.venv:venv.py:303 get_venv_metadata_for_package: 33ms\nINFO     pipx.package_specifier:package_specifier.py:128 cleaned package spec: isort==5.6.4\nDEBUG    pipx.main:main.py:776 pipx finished.\nDEBUG    pipx.main:main.py:715 2026-10-03 20:17:09\nDEBUG    pipx.main:main.py:716 pipx list --json\nINFO     pipx.main:main.py:717 pipx version is 0.16.2.0.1.dev0\nINFO     pipx.main:main.py:718 Default python interpreter is '/usr/local/bin/python'\nDEBUG    pipx.main:main.py:776 pipx finished.\n----------- generated xml file: /opt/receipts/reports/agent1-11.xml ------------\n=========================== short test summary info ============================\nPASSED tests/test_list.py::test_list_json\n============================== 1 passed in 9.12s ===============================\n","stderr_tail":"","stdout_sha256":"b5b649dfaca136cebdb83f234ff7bf29cad50251815657ec8fc05a0a89395be3","log_path":"~/dev/nebius-hackathon/pilot/v2-P/pipxproject__pipx-680/runs/pilot-pipxproject__pipx-680-183a4a2cf5/logs/agent1/agent1-11.log","tree_digest":"688dd7c6d887c451b8cd2f666f6115c18388bf3d29025fdd0afa461edc720cc2","tree_download_s":2.3733672499656677,"started_at":"2026-10-03T20:16:59.402193Z","duration_s":7.078646,"timed_out":false,"image_before":"563392e5-20c0-43e8-9b44-4d19d4a30675","image_after":"90c79a61-b503-4118-854b-9cc1ee809aa2","junit":{"passed":["tests/test_list.py::test_list_json"],"failed":[],"errors":[],"skipped":[],"collection_errors":[],"failure_text":{}},"diff":null,"patch_sha256":null,"dropped_paths":[],"snapshot_sha":null}
{"receipt_id":"agent1-12","seq":12,"branch_id":"agent1","kind":"command","cmd":"/opt/receipts-8afab40d78934a2fbb90a188e08a32ba/bin/busybox mkdir -p /opt/receipts/reports && python -I /opt/receipts-8afab40d78934a2fbb90a188e08a32ba/receipts_pytest.py tests/test_list.py::test_cli tests/test_list.py::test_missing_interpreter tests/test_list.py::test_list_legacy_venv -v -o junit_family=xunit1 -p no:cacheprovider -rA --continue-on-collection-errors --junitxml=/opt/receipts/reports/agent1-12.xml","path":null,"exit_code":1,"stdout_tail":"egacy_venv_0_1_0/otherdir/pipxbindir\\n   package pycowsay 0.0.0.2, Python 3.10.19\\n    - pycowsay\\n' = CaptureResult(out='creating virtual environment...\\ninstalling pycowsay...\\n  installed package pycowsay 0.0.0.2, Python 3.10.19\\n  These apps are now globally available\\n    - pycowsay\\nvenvs are in /tmp/pytest-of-root/pytest-8/test_list_legacy_venv_0_1_0/subdir/pipxhome/venvs\\napps are exposed on your $PATH at /tmp/pytest-of-root/pytest-8/test_list_legacy_venv_0_1_0/otherdir/pipxbindir\\n   package pycowsay 0.0.0.2, Python 3.10.19\\n    - pycowsay\\n', err='done! ✨ 🌟 ✨\\n').out\n\ntests/test_list.py:60: AssertionError\n------------------------------ Captured log call -------------------------------\nDEBUG    pipx.main:main.py:715 2026-10-03 20:17:27\nDEBUG    pipx.main:main.py:716 pipx install pycowsay\nINFO     pipx.main:main.py:717 pipx version is 0.16.2.0.1.dev0\nINFO     pipx.main:main.py:718 Default python interpreter is '/usr/local/bin/python'\nINFO     pipx.util:util.py:56 creating directory /tmp/pytest-of-root/pytest-8/test_list_legacy_venv_0_1_0/subdir/pipxhome/venvs\nINFO     pipx.util:util.py:56 creating directory /tmp/pytest-of-root/pytest-8/test_list_legacy_venv_0_1_0/otherdir/pipxbindir\nINFO     pipx.util:util.py:56 creating directory /tmp/pytest-of-root/pytest-8/test_list_legacy_venv_0_1_0/subdir/pipxhome/.cache\nINFO     pipx.commands.common:common.py:320 Determined package name: pycowsay\nINFO     pipx.commands.common:common.py:321 Package name determined in 0.0s\nINFO     pipx.util:util.py:135 running /usr/local/bin/python -m venv --without-pip /tmp/pytest-of-root/pytest-8/test_list_legacy_venv_0_1_0/subdir/pipxhome/venvs/pycowsay\nDEBUG    pipx.util:util.py:148 stdout:\nDEBUG    pipx.util:util.py:150 stderr:\nDEBUG    pipx.util:util.py:151 returncode: 0\nINFO     pipx.util:util.py:135 running /tmp/pytest-of-root/pytest-8/test_list_legacy_venv_0_1_0/subdir/pipxhome/venvs/pycowsay/bin/python -c import sysconfig; print(sysconfig.get_path('purelib'))\nDEBUG    pipx.util:util.py:148 stdout: /tmp/pytest-of-root/pytest-8/test_list_legacy_venv_0_1_0/subdir/pipxhome/venvs/pycowsay/lib/python3.10/site-packages\nDEBUG    pipx.util:util.py:151 returncode: 0\nINFO     pipx.util:util.py:135 running /tmp/pytest-of-root/pytest-8/session_shareddir0/bin/python -c import sysconfig; print(sysconfig.get_path('purelib'))\nDEBUG    pipx.util:util.py:148 stdout: /tmp/pytest-of-root/pytest-8/session_shareddir0/lib/python3.10/site-packages\nDEBUG    pipx.util:util.py:151 returncode: 0\nINFO     pipx.util:util.py:135 running /tmp/pytest-of-root/pytest-8/test_list_legacy_venv_0_1_0/subdir/pipxhome/venvs/pycowsay/bin/python --version\nDEBUG    pipx.util:util.py:148 stdout: Python 3.10.19\nDEBUG    pipx.util:util.py:150 stderr:\nDEBUG    pipx.util:util.py:151 returncode: 0\nINFO     pipx.package_specifier:package_specifier.py:128 cleaned package spec: pycowsay\nINFO     pipx.util:util.py:135 running /tmp/pytest-of-root/pytest-8/test_list_legacy_venv_0_1_0/subdir/pipxhome/venvs/pycowsay/bin/python -m pip install pycowsay\nDEBUG    pipx.util:util.py:151 returncode: 0\nINFO     pipx.util:util.py:135 running <fetch_info_in_venv commands>\nDEBUG    pipx.util:util.py:148 stdout: {\"sys_path\": [\"/usr/local/lib/python310.zip\", \"/usr/local/lib/python3.10\", \"/usr/local/lib/python3.10/lib-dynload\", \"/tmp/pytest-of-root/pytest-8/test_list_legacy_venv_0_1_0/subdir/pipxhome/venvs/pycowsay/lib/python3.10/site-packages\", \"/tmp/pytest-of-root/pytest-8/session_shareddir0/lib/python3.10/site-packages\"], \"python_version\": \"3.10.19\", \"environment\": {\"implementation_name\": \"cpython\", \"implementation_version\": \"3.10.19\", \"os_name\": \"posix\", \"platform_machine\": \"x86_64\", \"platform_release\": \"7.0.6\", \"platform_system\": \"Linux\", \"platform_version\": \"#1 SMP PREEMPT_DYNAMIC Mon Aug 24 09:29:13 UTC 2026\", \"python_full_version\": \"3.10.19\", \"platform_python_implementation\": \"CPython\", \"python_version\": \"3.10\", \"sys_platform\": \"linux\"}}\nDEBUG    pipx.util:util.py:151 returncode: 0\nINFO     pipx.venv:venv.py:303 get_venv_metadata_for_package: 26ms\nINFO     pipx.package_specifier:package_specifier.py:128 cleaned package spec: pycowsay\nINFO     pipx.shared_libs:shared_libs.py:69 Time since last upgrade of shared libs, in seconds: 1. Upgrade will be run by pipx if greater than 2592000.\nDEBUG    pipx.main:main.py:776 pipx finished.\nDEBUG    pipx.main:main.py:715 2026-10-03 20:17:28\nDEBUG    pipx.main:main.py:716 pipx list\nINFO     pipx.main:main.py:717 pipx version is 0.16.2.0.1.dev0\nINFO     pipx.main:main.py:718 Default python interpreter is '/usr/local/bin/python'\nDEBUG    pipx.main:main.py:776 pipx finished.\n==================================== PASSES ====================================\n___________________________________ test_cli ___________________________________\n------------------------------ Captured log call -------------------------------\nDEBUG    pipx.main:main.py:715 2026-10-03 20:17:20\nDEBUG    pipx.main:main.py:716 pipx list\nINFO     pipx.main:main.py:717 pipx version is 0.16.2.0.1.dev0\nINFO     pipx.main:main.py:718 Default python interpreter is '/usr/local/bin/python'\nINFO     pipx.util:util.py:56 creating directory /tmp/pytest-of-root/pytest-8/test_cli0/subdir/pipxhome/venvs\nINFO     pipx.util:util.py:56 creating directory /tmp/pytest-of-root/pytest-8/test_cli0/otherdir/pipxbindir\nINFO     pipx.util:util.py:56 creating directory /tmp/pytest-of-root/pytest-8/test_cli0/subdir/pipxhome/.cache\nDEBUG    pipx.main:main.py:776 pipx finished.\n----------- generated xml file: /opt/receipts/reports/agent1-12.xml ------------\n=========================== short test summary info ============================\nPASSED tests/test_list.py::test_cli\nFAILED tests/test_list.py::test_missing_interpreter - AssertionError: assert ...\nFAILED tests/test_list.py::test_list_legacy_venv[None] - AssertionError: asse...\nFAILED tests/test_list.py::test_list_legacy_venv[0.1] - AssertionError: asser...\n========================= 3 failed, 1 passed in 7.37s ==========================\n","stderr_tail":"","stdout_sha256":"cc5381a924e7bf00dbabadbf58fcca9eef1196f5c0dd3bb23486e01f14b5c18d","log_path":"~/dev/nebius-hackathon/pilot/v2-P/pipxproject__pipx-680/runs/pilot-pipxproject__pipx-680-183a4a2cf5/logs/agent1/agent1-12.log","tree_digest":"688dd7c6d887c451b8cd2f666f6115c18388bf3d29025fdd0afa461edc720cc2","tree_download_s":2.762060583103448,"started_at":"2026-10-03T20:17:18.896672Z","duration_s":6.012224,"timed_out":false,"image_before":"90c79a61-b503-4118-854b-9cc1ee809aa2","image_after":"d8e4433a-20e5-43bf-a8ab-0bd6bfe4f731","junit":{"passed":["tests/test_list.py::test_cli"],"failed":["tests/test_list.py::test_missing_interpreter","tests/test_list.py::test_list_legacy_venv[None]","tests/test_list.py::test_list_legacy_venv[0.1]"],"errors":[],"skipped":[],"collection_errors":[],"failure_text":{"tests/test_list.py::test_missing_interpreter":"[...]xecute: pipx reinstall-all\\n\\n' = CaptureResult(out='venvs are in /tmp/pytest-of-root/pytest-8/test_missing_interpreter0/subdir/pipxhome/venvs\\napps are exposed on your $PATH at /tmp/pytest-of-root/pytest-8/test_missing_interpreter0/otherdir/pipxbindir\\n   package pycowsay has invalid interpreter /tmp/pytest-of-root/pytest-8/test_missing_interpreter0/subdir/pipxhome/venvs/pycowsay/bin/python\\n', err='\\nOne or more packages have a missing python interpreter.\\n    To fix, execute: pipx reinstall-all\\n\\n').err\npipx_temp_env = None\nmonkeypatch = <_pytest.monkeypatch.MonkeyPatch object at 0x7ffff6c5af20>\ncapsys = <_pytest.capture.CaptureFixture object at 0x7ffff6a5bb50>\n\n    def test_missing_interpreter(pipx_temp_env, monkeypatch, capsys):\n        assert not run_pipx_cli([\"install\", \"pycowsay\"])\n    \n        assert not run_pipx_cli([\"list\"])\n        captured = capsys.readouterr()\n        assert \"package pycowsay has invalid interpreter\" not in captured.err\n    \n        remove_venv_interpreter(\"pycowsay\")\n    \n        assert run_pipx_cli([\"list\"])\n        captured = capsys.readouterr()\n>       assert \"package pycowsay has invalid interpreter\" in captured.err\nE       AssertionError: assert 'package pycowsay has invalid interpreter' in '\\nOne or more packages have a missing python interpreter.\\n    To fix, execute: pipx reinstall-all\\n\\n'\nE        +  where '\\nOne or more packages have a missing python interpreter.\\n    To fix, execute: pipx reinstall-all\\n\\n' = CaptureResult(out='venvs are in /tmp/pytest-of-root/pytest-8/test_missing_interpreter0/subdir/pipxhome/venvs\\napps are exposed on your $PATH at /tmp/pytest-of-root/pytest-8/test_missing_interpreter0/otherdir/pipxbindir\\n   package pycowsay has invalid interpreter /tmp/pytest-of-root/pytest-8/test_missing_interpreter0/subdir/pipxhome/venvs/pycowsay/bin/python\\n', err='\\nOne or more packages have a missing python interpreter.\\n    To fix, execute: pipx reinstall-all\\n\\n').err\n\ntests/test_list.py:36: AssertionError","tests/test_list.py::test_list_legacy_venv[None]":"[...]ninstall and install these package(s) to fix.\\n\\n').err\npipx_temp_env = None\nmonkeypatch = <_pytest.monkeypatch.MonkeyPatch object at 0x7ffff6dfd750>\ncapsys = <_pytest.capture.CaptureFixture object at 0x7ffff6dfee60>\nmetadata_version = None\n\n    @pytest.mark.parametrize(\"metadata_version\", [None, \"0.1\"])\n    def test_list_legacy_venv(pipx_temp_env, monkeypatch, capsys, metadata_version):\n        assert not run_pipx_cli([\"install\", \"pycowsay\"])\n        mock_legacy_venv(\"pycowsay\", metadata_version=metadata_version)\n    \n        if metadata_version is None:\n            assert run_pipx_cli([\"list\"])\n            captured = capsys.readouterr()\n>           assert \"package pycowsay has missing internal pipx metadata\" in captured.err\nE           AssertionError: assert 'package pycowsay has missing internal pipx metadata' in 'done! ✨ #x1F31F ✨\\n\\nOne or more packages have a missing internal pipx metadata.\\n   They were likely installed using a pipx version before 0.15.0.0.\\n   Please uninstall and install these package(s) to fix.\\n\\n'\nE            +  where 'done! ✨ #x1F31F ✨\\n\\nOne or more packages have a missing internal pipx metadata.\\n   They were likely installed using a pipx version before 0.15.0.0.\\n   Please uninstall and install these package(s) to fix.\\n\\n' = CaptureResult(out='creating virtual environment...\\ninstalling pycowsay...\\n  installed package pycowsay 0.0.0.2, Python 3.10.19\\n  These apps are now globally available\\n    - pycowsay\\nvenvs are in /tmp/pytest-of-root/pytest-8/test_list_legacy_venv_None_0/subdir/pipxhome/venvs\\napps are exposed on your $PATH at /tmp/pytest-of-root/pytest-8/test_list_legacy_venv_None_0/otherdir/pipxbindir\\n   package pycowsay has missing internal pipx metadata.\\n', err='done! ✨ #x1F31F ✨\\n\\nOne or more packages have a missing internal pipx metadata.\\n   They were likely installed using a pipx version before 0.15.0.0.\\n   Please uninstall and install these package(s) to fix.\\n\\n').err\n\ntests/test_list.py:56: AssertionError","tests/test_list.py::test_list_legacy_venv[0.1]":"[...]   assert not run_pipx_cli([\"install\", \"pycowsay\"])\n        mock_legacy_venv(\"pycowsay\", metadata_version=metadata_version)\n    \n        if metadata_version is None:\n            assert run_pipx_cli([\"list\"])\n            captured = capsys.readouterr()\n            assert \"package pycowsay has missing internal pipx metadata\" in captured.err\n        else:\n            assert not run_pipx_cli([\"list\"])\n            captured = capsys.readouterr()\n>           assert \"package pycowsay 0.0.0.1,\" in captured.out\nE           AssertionError: assert 'package pycowsay 0.0.0.1,' in 'creating virtual environment...\\ninstalling pycowsay...\\n  installed package pycowsay 0.0.0.2, Python 3.10.19\\n  These apps are now globally available\\n    - pycowsay\\nvenvs are in /tmp/pytest-of-root/pytest-8/test_list_legacy_venv_0_1_0/subdir/pipxhome/venvs\\napps are exposed on your $PATH at /tmp/pytest-of-root/pytest-8/test_list_legacy_venv_0_1_0/otherdir/pipxbindir\\n   package pycowsay 0.0.0.2, Python 3.10.19\\n    - pycowsay\\n'\nE            +  where 'creating virtual environment...\\ninstalling pycowsay...\\n  installed package pycowsay 0.0.0.2, Python 3.10.19\\n  These apps are now globally available\\n    - pycowsay\\nvenvs are in /tmp/pytest-of-root/pytest-8/test_list_legacy_venv_0_1_0/subdir/pipxhome/venvs\\napps are exposed on your $PATH at /tmp/pytest-of-root/pytest-8/test_list_legacy_venv_0_1_0/otherdir/pipxbindir\\n   package pycowsay 0.0.0.2, Python 3.10.19\\n    - pycowsay\\n' = CaptureResult(out='creating virtual environment...\\ninstalling pycowsay...\\n  installed package pycowsay 0.0.0.2, Python 3.10.19\\n  These apps are now globally available\\n    - pycowsay\\nvenvs are in /tmp/pytest-of-root/pytest-8/test_list_legacy_venv_0_1_0/subdir/pipxhome/venvs\\napps are exposed on your $PATH at /tmp/pytest-of-root/pytest-8/test_list_legacy_venv_0_1_0/otherdir/pipxbindir\\n   package pycowsay 0.0.0.2, Python 3.10.19\\n    - pycowsay\\n', err='done! ✨ #x1F31F ✨\\n').out\n\ntests/test_list.py:60: AssertionError"}},"diff":null,"patch_sha256":null,"dropped_paths":[],"snapshot_sha":null}
{"receipt_id":"agent1-13","seq":13,"branch_id":"agent1","kind":"command","cmd":"/opt/receipts-effc34e8b4104d1f9c115058feefbbc5/bin/busybox mkdir -p /opt/receipts/reports && python -I /opt/receipts-effc34e8b4104d1f9c115058feefbbc5/receipts_pytest.py tests/test_list.py::test_missing_interpreter -v -s -o junit_family=xunit1 -p no:cacheprovider -rA --continue-on-collection-errors --junitxml=/opt/receipts/reports/agent1-13.xml","path":null,"exit_code":1,"stdout_tail":"e pycowsay has invalid interpreter\" in captured.err\nE       AssertionError: assert 'package pycowsay has invalid interpreter' in '\\nOne or more packages have a missing python interpreter.\\n    To fix, execute: pipx reinstall-all\\n\\n'\nE        +  where '\\nOne or more packages have a missing python interpreter.\\n    To fix, execute: pipx reinstall-all\\n\\n' = CaptureResult(out='venvs are in /tmp/pytest-of-root/pytest-9/test_missing_interpreter0/subdir/pipxhome/venvs\\napps are exposed on your $PATH at /tmp/pytest-of-root/pytest-9/test_missing_interpreter0/otherdir/pipxbindir\\n   package pycowsay has invalid interpreter /tmp/pytest-of-root/pytest-9/test_missing_interpreter0/subdir/pipxhome/venvs/pycowsay/bin/python\\n', err='\\nOne or more packages have a missing python interpreter.\\n    To fix, execute: pipx reinstall-all\\n\\n').err\n\ntests/test_list.py:36: AssertionError\n------------------------------ Captured log call -------------------------------\nDEBUG    pipx.main:main.py:715 2026-10-03 20:17:40\nDEBUG    pipx.main:main.py:716 pipx install pycowsay\nINFO     pipx.main:main.py:717 pipx version is 0.16.2.0.1.dev0\nINFO     pipx.main:main.py:718 Default python interpreter is '/usr/local/bin/python'\nINFO     pipx.util:util.py:56 creating directory /tmp/pytest-of-root/pytest-9/test_missing_interpreter0/subdir/pipxhome/venvs\nINFO     pipx.util:util.py:56 creating directory /tmp/pytest-of-root/pytest-9/test_missing_interpreter0/otherdir/pipxbindir\nINFO     pipx.util:util.py:56 creating directory /tmp/pytest-of-root/pytest-9/test_missing_interpreter0/subdir/pipxhome/.cache\nINFO     pipx.commands.common:common.py:320 Determined package name: pycowsay\nINFO     pipx.commands.common:common.py:321 Package name determined in 0.0s\nINFO     pipx.util:util.py:135 running /usr/local/bin/python -m venv --without-pip /tmp/pytest-of-root/pytest-9/test_missing_interpreter0/subdir/pipxhome/venvs/pycowsay\nDEBUG    pipx.util:util.py:148 stdout:\nDEBUG    pipx.util:util.py:150 stderr:\nDEBUG    pipx.util:util.py:151 returncode: 0\nINFO     pipx.util:util.py:135 running /usr/local/bin/python -m venv --clear /tmp/pytest-of-root/pytest-9/session_shareddir0\nDEBUG    pipx.util:util.py:148 stdout:\nDEBUG    pipx.util:util.py:150 stderr:\nDEBUG    pipx.util:util.py:151 returncode: 0\nINFO     pipx.shared_libs:shared_libs.py:91 Upgrading shared libraries in /tmp/pytest-of-root/pytest-9/session_shareddir0\nINFO     pipx.util:util.py:135 running /tmp/pytest-of-root/pytest-9/session_shareddir0/bin/python -m pip --disable-pip-version-check install --force-reinstall -q --upgrade pip setuptools wheel\nDEBUG    pipx.util:util.py:148 stdout:\nDEBUG    pipx.util:util.py:150 stderr:\nDEBUG    pipx.util:util.py:151 returncode: 0\nINFO     pipx.util:util.py:135 running /tmp/pytest-of-root/pytest-9/test_missing_interpreter0/subdir/pipxhome/venvs/pycowsay/bin/python -c import sysconfig; print(sysconfig.get_path('purelib'))\nDEBUG    pipx.util:util.py:148 stdout: /tmp/pytest-of-root/pytest-9/test_missing_interpreter0/subdir/pipxhome/venvs/pycowsay/lib/python3.10/site-packages\nDEBUG    pipx.util:util.py:151 returncode: 0\nINFO     pipx.util:util.py:135 running /tmp/pytest-of-root/pytest-9/session_shareddir0/bin/python -c import sysconfig; print(sysconfig.get_path('purelib'))\nDEBUG    pipx.util:util.py:148 stdout: /tmp/pytest-of-root/pytest-9/session_shareddir0/lib/python3.10/site-packages\nDEBUG    pipx.util:util.py:151 returncode: 0\nINFO     pipx.util:util.py:135 running /tmp/pytest-of-root/pytest-9/test_missing_interpreter0/subdir/pipxhome/venvs/pycowsay/bin/python --version\nDEBUG    pipx.util:util.py:148 stdout: Python 3.10.19\nDEBUG    pipx.util:util.py:150 stderr:\nDEBUG    pipx.util:util.py:151 returncode: 0\nINFO     pipx.package_specifier:package_specifier.py:128 cleaned package spec: pycowsay\nINFO     pipx.util:util.py:135 running /tmp/pytest-of-root/pytest-9/test_missing_interpreter0/subdir/pipxhome/venvs/pycowsay/bin/python -m pip install pycowsay\nDEBUG    pipx.util:util.py:151 returncode: 0\nINFO     pipx.util:util.py:135 running <fetch_info_in_venv commands>\nDEBUG    pipx.util:util.py:148 stdout: {\"sys_path\": [\"/usr/local/lib/python310.zip\", \"/usr/local/lib/python3.10\", \"/usr/local/lib/python3.10/lib-dynload\", \"/tmp/pytest-of-root/pytest-9/test_missing_interpreter0/subdir/pipxhome/venvs/pycowsay/lib/python3.10/site-packages\", \"/tmp/pytest-of-root/pytest-9/session_shareddir0/lib/python3.10/site-packages\"], \"python_version\": \"3.10.19\", \"environment\": {\"implementation_name\": \"cpython\", \"implementation_version\": \"3.10.19\", \"os_name\": \"posix\", \"platform_machine\": \"x86_64\", \"platform_release\": \"7.0.6\", \"platform_system\": \"Linux\", \"platform_version\": \"#1 SMP PREEMPT_DYNAMIC Mon Aug 24 09:29:13 UTC 2026\", \"python_full_version\": \"3.10.19\", \"platform_python_implementation\": \"CPython\", \"python_version\": \"3.10\", \"sys_platform\": \"linux\"}}\nDEBUG    pipx.util:util.py:151 returncode: 0\nINFO     pipx.venv:venv.py:303 get_venv_metadata_for_package: 27ms\nINFO     pipx.package_specifier:package_specifier.py:128 cleaned package spec: pycowsay\nDEBUG    pipx.main:main.py:776 pipx finished.\nDEBUG    pipx.main:main.py:715 2026-10-03 20:17:46\nDEBUG    pipx.main:main.py:716 pipx list\nINFO     pipx.main:main.py:717 pipx version is 0.16.2.0.1.dev0\nINFO     pipx.main:main.py:718 Default python interpreter is '/usr/local/bin/python'\nDEBUG    pipx.main:main.py:776 pipx finished.\nDEBUG    pipx.main:main.py:715 2026-10-03 20:17:46\nDEBUG    pipx.main:main.py:716 pipx list\nINFO     pipx.main:main.py:717 pipx version is 0.16.2.0.1.dev0\nINFO     pipx.main:main.py:718 Default python interpreter is '/usr/local/bin/python'\nDEBUG    pipx.main:main.py:776 pipx finished.\n----------- generated xml file: /opt/receipts/reports/agent1-13.xml ------------\n=========================== short test summary info ============================\nFAILED tests/test_list.py::test_missing_interpreter - AssertionError: assert ...\n============================== 1 failed in 6.21s ===============================\n","stderr_tail":"","stdout_sha256":"8bd901aea55bac0443016f9b760cc9f0ea6abaa568bed1ab88fe8a229fd2e4b3","log_path":"~/dev/nebius-hackathon/pilot/v2-P/pipxproject__pipx-680/runs/pilot-pipxproject__pipx-680-183a4a2cf5/logs/agent1/agent1-13.log","tree_digest":"688dd7c6d887c451b8cd2f666f6115c18388bf3d29025fdd0afa461edc720cc2","tree_download_s":2.173974375007674,"started_at":"2026-10-03T20:17:38.991802Z","duration_s":5.253089999999999,"timed_out":false,"image_before":"d8e4433a-20e5-43bf-a8ab-0bd6bfe4f731","image_after":"1954be6f-c451-4c16-907a-866541ca0edf","junit":{"passed":[],"failed":["tests/test_list.py::test_missing_interpreter"],"errors":[],"skipped":[],"collection_errors":[],"failure_text":{"tests/test_list.py::test_missing_interpreter":"[...]xecute: pipx reinstall-all\\n\\n' = CaptureResult(out='venvs are in /tmp/pytest-of-root/pytest-9/test_missing_interpreter0/subdir/pipxhome/venvs\\napps are exposed on your $PATH at /tmp/pytest-of-root/pytest-9/test_missing_interpreter0/otherdir/pipxbindir\\n   package pycowsay has invalid interpreter /tmp/pytest-of-root/pytest-9/test_missing_interpreter0/subdir/pipxhome/venvs/pycowsay/bin/python\\n', err='\\nOne or more packages have a missing python interpreter.\\n    To fix, execute: pipx reinstall-all\\n\\n').err\npipx_temp_env = None\nmonkeypatch = <_pytest.monkeypatch.MonkeyPatch object at 0x7ffff6969ed0>\ncapsys = <_pytest.capture.CaptureFixture object at 0x7ffff6969ff0>\n\n    def test_missing_interpreter(pipx_temp_env, monkeypatch, capsys):\n        assert not run_pipx_cli([\"install\", \"pycowsay\"])\n    \n        assert not run_pipx_cli([\"list\"])\n        captured = capsys.readouterr()\n        assert \"package pycowsay has invalid interpreter\" not in captured.err\n    \n        remove_venv_interpreter(\"pycowsay\")\n    \n        assert run_pipx_cli([\"list\"])\n        captured = capsys.readouterr()\n>       assert \"package pycowsay has invalid interpreter\" in captured.err\nE       AssertionError: assert 'package pycowsay has invalid interpreter' in '\\nOne or more packages have a missing python interpreter.\\n    To fix, execute: pipx reinstall-all\\n\\n'\nE        +  where '\\nOne or more packages have a missing python interpreter.\\n    To fix, execute: pipx reinstall-all\\n\\n' = CaptureResult(out='venvs are in /tmp/pytest-of-root/pytest-9/test_missing_interpreter0/subdir/pipxhome/venvs\\napps are exposed on your $PATH at /tmp/pytest-of-root/pytest-9/test_missing_interpreter0/otherdir/pipxbindir\\n   package pycowsay has invalid interpreter /tmp/pytest-of-root/pytest-9/test_missing_interpreter0/subdir/pipxhome/venvs/pycowsay/bin/python\\n', err='\\nOne or more packages have a missing python interpreter.\\n    To fix, execute: pipx reinstall-all\\n\\n').err\n\ntests/test_list.py:36: AssertionError"}},"diff":null,"patch_sha256":null,"dropped_paths":[],"snapshot_sha":null}
{"receipt_id":"agent1-14","seq":14,"branch_id":"agent1","kind":"write","cmd":"/opt/receipts-e6a89302563d4ec2a95dc11c285c4291/bin/busybox sh -c 'mkdir -p /pipx/src/pipx/commands && cp /opt/receipts-e6a89302563d4ec2a95dc11c285c4291/incoming/25f5e993298aa00c582d151045c75f5f89d3f6039b7fb1673010dd62a8ef7b93 /pipx/src/pipx/commands/list_packages.py'","path":"src/pipx/commands/list_packages.py","exit_code":0,"stdout_tail":"","stderr_tail":"","stdout_sha256":"25f5e993298aa00c582d151045c75f5f89d3f6039b7fb1673010dd62a8ef7b93","log_path":"~/dev/nebius-hackathon/pilot/v2-P/pipxproject__pipx-680/runs/pilot-pipxproject__pipx-680-183a4a2cf5/logs/agent1/agent1-14.log","tree_digest":null,"tree_download_s":null,"started_at":"2026-10-03T20:18:08.575963Z","duration_s":0.005967999999999999,"timed_out":false,"image_before":"1954be6f-c451-4c16-907a-866541ca0edf","image_after":"a8fb0272-b947-4e96-bd05-648febe351f5","junit":null,"diff":null,"patch_sha256":null,"dropped_paths":[],"snapshot_sha":null}
{"receipt_id":"agent1-15","seq":15,"branch_id":"agent1","kind":"command","cmd":"/opt/receipts-58126fbb38674b408940e8e6fd5567d6/bin/busybox mkdir -p /opt/receipts/reports && python -I /opt/receipts-58126fbb38674b408940e8e6fd5567d6/receipts_pytest.py tests/test_list.py::test_missing_interpreter -v -o junit_family=xunit1 -p no:cacheprovider -rA --continue-on-collection-errors --junitxml=/opt/receipts/reports/agent1-15.xml","path":null,"exit_code":0,"stdout_tail":"============================= test session starts ==============================\nplatform linux -- Python 3.10.19, pytest-9.0.2, pluggy-1.6.0 -- /usr/local/bin/python\nrootdir: /pipx\nconfigfile: pyproject.toml\nplugins: cov-7.0.0\ncollecting ... collected 1 item\n\ntests/test_list.py::test_missing_interpreter PASSED                      [100%]\n\n==================================== PASSES ====================================\n___________________________ test_missing_interpreter ___________________________\n------------------------------ Captured log call -------------------------------\nDEBUG    pipx.main:main.py:715 2026-10-03 20:18:13\nDEBUG    pipx.main:main.py:716 pipx install pycowsay\nINFO     pipx.main:main.py:717 pipx version is 0.16.2.0.1.dev0\nINFO     pipx.main:main.py:718 Default python interpreter is '/usr/local/bin/python'\nINFO     pipx.util:util.py:56 creating directory /tmp/pytest-of-root/pytest-10/test_missing_interpreter0/subdir/pipxhome/venvs\nINFO     pipx.util:util.py:56 creating directory /tmp/pytest-of-root/pytest-10/test_missing_interpreter0/otherdir/pipxbindir\nINFO     pipx.util:util.py:56 creating directory /tmp/pytest-of-root/pytest-10/test_missing_interpreter0/subdir/pipxhome/.cache\nINFO     pipx.commands.common:common.py:320 Determined package name: pycowsay\nINFO     pipx.commands.common:common.py:321 Package name determined in 0.0s\nINFO     pipx.util:util.py:135 running /usr/local/bin/python -m venv --without-pip /tmp/pytest-of-root/pytest-10/test_missing_interpreter0/subdir/pipxhome/venvs/pycowsay\nDEBUG    pipx.util:util.py:148 stdout:\nDEBUG    pipx.util:util.py:150 stderr:\nDEBUG    pipx.util:util.py:151 returncode: 0\nINFO     pipx.util:util.py:135 running /usr/local/bin/python -m venv --clear /tmp/pytest-of-root/pytest-10/session_shareddir0\nDEBUG    pipx.util:util.py:148 stdout:\nDEBUG    pipx.util:util.py:150 stderr:\nDEBUG    pipx.util:util.py:151 returncode: 0\nINFO     pipx.shared_libs:shared_libs.py:91 Upgrading shared libraries in /tmp/pytest-of-root/pytest-10/session_shareddir0\nINFO     pipx.util:util.py:135 running /tmp/pytest-of-root/pytest-10/session_shareddir0/bin/python -m pip --disable-pip-version-check install --force-reinstall -q --upgrade pip setuptools wheel\nDEBUG    pipx.util:util.py:148 stdout:\nDEBUG    pipx.util:util.py:150 stderr:\nDEBUG    pipx.util:util.py:151 returncode: 0\nINFO     pipx.util:util.py:135 running /tmp/pytest-of-root/pytest-10/test_missing_interpreter0/subdir/pipxhome/venvs/pycowsay/bin/python -c import sysconfig; print(sysconfig.get_path('purelib'))\nDEBUG    pipx.util:util.py:148 stdout: /tmp/pytest-of-root/pytest-10/test_missing_interpreter0/subdir/pipxhome/venvs/pycowsay/lib/python3.10/site-packages\nDEBUG    pipx.util:util.py:151 returncode: 0\nINFO     pipx.util:util.py:135 running /tmp/pytest-of-root/pytest-10/session_shareddir0/bin/python -c import sysconfig; print(sysconfig.get_path('purelib'))\nDEBUG    pipx.util:util.py:148 stdout: /tmp/pytest-of-root/pytest-10/session_shareddir0/lib/python3.10/site-packages\nDEBUG    pipx.util:util.py:151 returncode: 0\nINFO     pipx.util:util.py:135 running /tmp/pytest-of-root/pytest-10/test_missing_interpreter0/subdir/pipxhome/venvs/pycowsay/bin/python --version\nDEBUG    pipx.util:util.py:148 stdout: Python 3.10.19\nDEBUG    pipx.util:util.py:150 stderr:\nDEBUG    pipx.util:util.py:151 returncode: 0\nINFO     pipx.package_specifier:package_specifier.py:128 cleaned package spec: pycowsay\nINFO     pipx.util:util.py:135 running /tmp/pytest-of-root/pytest-10/test_missing_interpreter0/subdir/pipxhome/venvs/pycowsay/bin/python -m pip install pycowsay\nDEBUG    pipx.util:util.py:151 returncode: 0\nINFO     pipx.util:util.py:135 running <fetch_info_in_venv commands>\nDEBUG    pipx.util:util.py:148 stdout: {\"sys_path\": [\"/usr/local/lib/python310.zip\", \"/usr/local/lib/python3.10\", \"/usr/local/lib/python3.10/lib-dynload\", \"/tmp/pytest-of-root/pytest-10/test_missing_interpreter0/subdir/pipxhome/venvs/pycowsay/lib/python3.10/site-packages\", \"/tmp/pytest-of-root/pytest-10/session_shareddir0/lib/python3.10/site-packages\"], \"python_version\": \"3.10.19\", \"environment\": {\"implementation_name\": \"cpython\", \"implementation_version\": \"3.10.19\", \"os_name\": \"posix\", \"platform_machine\": \"x86_64\", \"platform_release\": \"7.0.6\", \"platform_system\": \"Linux\", \"platform_version\": \"#1 SMP PREEMPT_DYNAMIC Mon Aug 24 09:29:13 UTC 2026\", \"python_full_version\": \"3.10.19\", \"platform_python_implementation\": \"CPython\", \"python_version\": \"3.10\", \"sys_platform\": \"linux\"}}\nDEBUG    pipx.util:util.py:151 returncode: 0\nINFO     pipx.venv:venv.py:303 get_venv_metadata_for_package: 27ms\nINFO     pipx.package_specifier:package_specifier.py:128 cleaned package spec: pycowsay\nDEBUG    pipx.main:main.py:776 pipx finished.\nDEBUG    pipx.main:main.py:715 2026-10-03 20:18:19\nDEBUG    pipx.main:main.py:716 pipx list\nINFO     pipx.main:main.py:717 pipx version is 0.16.2.0.1.dev0\nINFO     pipx.main:main.py:718 Default python interpreter is '/usr/local/bin/python'\nDEBUG    pipx.main:main.py:776 pipx finished.\nDEBUG    pipx.main:main.py:715 2026-10-03 20:18:19\nDEBUG    pipx.main:main.py:716 pipx list\nINFO     pipx.main:main.py:717 pipx version is 0.16.2.0.1.dev0\nINFO     pipx.main:main.py:718 Default python interpreter is '/usr/local/bin/python'\nDEBUG    pipx.main:main.py:776 pipx finished.\n----------- generated xml file: /opt/receipts/reports/agent1-15.xml ------------\n=========================== short test summary info ============================\nPASSED tests/test_list.py::test_missing_interpreter\n============================== 1 passed in 6.44s ===============================\n","stderr_tail":"","stdout_sha256":"bf56aa36e279ec2974da433fa44cdc3e8c58c5eca1cc53f3b473f438169a4365","log_path":"~/dev/nebius-hackathon/pilot/v2-P/pipxproject__pipx-680/runs/pilot-pipxproject__pipx-680-183a4a2cf5/logs/agent1/agent1-15.log","tree_digest":"00c0a5157a69aac56d66bc9281097691fd51f197e32284ddc181ad289c8e0777","tree_download_s":1.6386379580944777,"started_at":"2026-10-03T20:18:11.403455Z","duration_s":5.293639,"timed_out":false,"image_before":"a8fb0272-b947-4e96-bd05-648febe351f5","image_after":"430da7fb-8ee4-4c93-ae4e-943c349a1a9b","junit":{"passed":["tests/test_list.py::test_missing_interpreter"],"failed":[],"errors":[],"skipped":[],"collection_errors":[],"failure_text":{}},"diff":null,"patch_sha256":null,"dropped_paths":[],"snapshot_sha":null}
{"receipt_id":"agent1-16","seq":16,"branch_id":"agent1","kind":"command","cmd":"/opt/receipts-6b7331d81970411283203724997f9b08/bin/busybox mkdir -p /opt/receipts/reports && python -I /opt/receipts-6b7331d81970411283203724997f9b08/receipts_pytest.py tests/test_list.py::test_list_legacy_venv -v -o junit_family=xunit1 -p no:cacheprovider -rA --continue-on-collection-errors --junitxml=/opt/receipts/reports/agent1-16.xml","path":null,"exit_code":1,"stdout_tail":"em\": \"Linux\", \"platform_version\": \"#1 SMP PREEMPT_DYNAMIC Mon Aug 24 09:29:13 UTC 2026\", \"python_full_version\": \"3.10.19\", \"platform_python_implementation\": \"CPython\", \"python_version\": \"3.10\", \"sys_platform\": \"linux\"}}\nDEBUG    pipx.util:util.py:151 returncode: 0\nINFO     pipx.venv:venv.py:303 get_venv_metadata_for_package: 29ms\nINFO     pipx.package_specifier:package_specifier.py:128 cleaned package spec: pycowsay\nINFO     pipx.shared_libs:shared_libs.py:69 Time since last upgrade of shared libs, in seconds: 1. Upgrade will be run by pipx if greater than 2592000.\nDEBUG    pipx.main:main.py:776 pipx finished.\nDEBUG    pipx.main:main.py:715 2026-10-03 20:18:39\nDEBUG    pipx.main:main.py:716 pipx list\nINFO     pipx.main:main.py:717 pipx version is 0.16.2.0.1.dev0\nINFO     pipx.main:main.py:718 Default python interpreter is '/usr/local/bin/python'\nDEBUG    pipx.main:main.py:776 pipx finished.\n==================================== PASSES ====================================\n_________________________ test_list_legacy_venv[None] __________________________\n------------------------------ Captured log call -------------------------------\nDEBUG    pipx.main:main.py:715 2026-10-03 20:18:32\nDEBUG    pipx.main:main.py:716 pipx install pycowsay\nINFO     pipx.main:main.py:717 pipx version is 0.16.2.0.1.dev0\nINFO     pipx.main:main.py:718 Default python interpreter is '/usr/local/bin/python'\nINFO     pipx.util:util.py:56 creating directory /tmp/pytest-of-root/pytest-11/test_list_legacy_venv_None_0/subdir/pipxhome/venvs\nINFO     pipx.util:util.py:56 creating directory /tmp/pytest-of-root/pytest-11/test_list_legacy_venv_None_0/otherdir/pipxbindir\nINFO     pipx.util:util.py:56 creating directory /tmp/pytest-of-root/pytest-11/test_list_legacy_venv_None_0/subdir/pipxhome/.cache\nINFO     pipx.commands.common:common.py:320 Determined package name: pycowsay\nINFO     pipx.commands.common:common.py:321 Package name determined in 0.0s\nINFO     pipx.util:util.py:135 running /usr/local/bin/python -m venv --without-pip /tmp/pytest-of-root/pytest-11/test_list_legacy_venv_None_0/subdir/pipxhome/venvs/pycowsay\nDEBUG    pipx.util:util.py:148 stdout:\nDEBUG    pipx.util:util.py:150 stderr:\nDEBUG    pipx.util:util.py:151 returncode: 0\nINFO     pipx.util:util.py:135 running /usr/local/bin/python -m venv --clear /tmp/pytest-of-root/pytest-11/session_shareddir0\nDEBUG    pipx.util:util.py:148 stdout:\nDEBUG    pipx.util:util.py:150 stderr:\nDEBUG    pipx.util:util.py:151 returncode: 0\nINFO     pipx.shared_libs:shared_libs.py:91 Upgrading shared libraries in /tmp/pytest-of-root/pytest-11/session_shareddir0\nINFO     pipx.util:util.py:135 running /tmp/pytest-of-root/pytest-11/session_shareddir0/bin/python -m pip --disable-pip-version-check install --force-reinstall -q --upgrade pip setuptools wheel\nDEBUG    pipx.util:util.py:148 stdout:\nDEBUG    pipx.util:util.py:150 stderr:\nDEBUG    pipx.util:util.py:151 returncode: 0\nINFO     pipx.util:util.py:135 running /tmp/pytest-of-root/pytest-11/test_list_legacy_venv_None_0/subdir/pipxhome/venvs/pycowsay/bin/python -c import sysconfig; print(sysconfig.get_path('purelib'))\nDEBUG    pipx.util:util.py:148 stdout: /tmp/pytest-of-root/pytest-11/test_list_legacy_venv_None_0/subdir/pipxhome/venvs/pycowsay/lib/python3.10/site-packages\nDEBUG    pipx.util:util.py:151 returncode: 0\nINFO     pipx.util:util.py:135 running /tmp/pytest-of-root/pytest-11/session_shareddir0/bin/python -c import sysconfig; print(sysconfig.get_path('purelib'))\nDEBUG    pipx.util:util.py:148 stdout: /tmp/pytest-of-root/pytest-11/session_shareddir0/lib/python3.10/site-packages\nDEBUG    pipx.util:util.py:151 returncode: 0\nINFO     pipx.util:util.py:135 running /tmp/pytest-of-root/pytest-11/test_list_legacy_venv_None_0/subdir/pipxhome/venvs/pycowsay/bin/python --version\nDEBUG    pipx.util:util.py:148 stdout: Python 3.10.19\nDEBUG    pipx.util:util.py:150 stderr:\nDEBUG    pipx.util:util.py:151 returncode: 0\nINFO     pipx.package_specifier:package_specifier.py:128 cleaned package spec: pycowsay\nINFO     pipx.util:util.py:135 running /tmp/pytest-of-root/pytest-11/test_list_legacy_venv_None_0/subdir/pipxhome/venvs/pycowsay/bin/python -m pip install pycowsay\nDEBUG    pipx.util:util.py:151 returncode: 0\nINFO     pipx.util:util.py:135 running <fetch_info_in_venv commands>\nDEBUG    pipx.util:util.py:148 stdout: {\"sys_path\": [\"/usr/local/lib/python310.zip\", \"/usr/local/lib/python3.10\", \"/usr/local/lib/python3.10/lib-dynload\", \"/tmp/pytest-of-root/pytest-11/test_list_legacy_venv_None_0/subdir/pipxhome/venvs/pycowsay/lib/python3.10/site-packages\", \"/tmp/pytest-of-root/pytest-11/session_shareddir0/lib/python3.10/site-packages\"], \"python_version\": \"3.10.19\", \"environment\": {\"implementation_name\": \"cpython\", \"implementation_version\": \"3.10.19\", \"os_name\": \"posix\", \"platform_machine\": \"x86_64\", \"platform_release\": \"7.0.6\", \"platform_system\": \"Linux\", \"platform_version\": \"#1 SMP PREEMPT_DYNAMIC Mon Aug 24 09:29:13 UTC 2026\", \"python_full_version\": \"3.10.19\", \"platform_python_implementation\": \"CPython\", \"python_version\": \"3.10\", \"sys_platform\": \"linux\"}}\nDEBUG    pipx.util:util.py:151 returncode: 0\nINFO     pipx.venv:venv.py:303 get_venv_metadata_for_package: 28ms\nINFO     pipx.package_specifier:package_specifier.py:128 cleaned package spec: pycowsay\nDEBUG    pipx.main:main.py:776 pipx finished.\nDEBUG    pipx.main:main.py:715 2026-10-03 20:18:38\nDEBUG    pipx.main:main.py:716 pipx list\nINFO     pipx.main:main.py:717 pipx version is 0.16.2.0.1.dev0\nINFO     pipx.main:main.py:718 Default python interpreter is '/usr/local/bin/python'\nDEBUG    pipx.main:main.py:776 pipx finished.\n----------- generated xml file: /opt/receipts/reports/agent1-16.xml ------------\n=========================== short test summary info ============================\nPASSED tests/test_list.py::test_list_legacy_venv[None]\nFAILED tests/test_list.py::test_list_legacy_venv[0.1] - AssertionError: asser...\n========================= 1 failed, 1 passed in 6.80s ==========================\n","stderr_tail":"","stdout_sha256":"8db76f8ee1f1995c433dbd3874cece9f5abc05c2097d9eb1672513c60f56683e","log_path":"~/dev/nebius-hackathon/pilot/v2-P/pipxproject__pipx-680/runs/pilot-pipxproject__pipx-680-183a4a2cf5/logs/agent1/agent1-16.log","tree_digest":"00c0a5157a69aac56d66bc9281097691fd51f197e32284ddc181ad289c8e0777","tree_download_s":2.711538625182584,"started_at":"2026-10-03T20:18:30.727485Z","duration_s":5.6550899999999995,"timed_out":false,"image_before":"430da7fb-8ee4-4c93-ae4e-943c349a1a9b","image_after":"b75db190-8b62-4f8d-b8dd-479f03f3e983","junit":{"passed":["tests/test_list.py::test_list_legacy_venv[None]"],"failed":["tests/test_list.py::test_list_legacy_venv[0.1]"],"errors":[],"skipped":[],"collection_errors":[],"failure_text":{"tests/test_list.py::test_list_legacy_venv[0.1]":"[...]ert not run_pipx_cli([\"install\", \"pycowsay\"])\n        mock_legacy_venv(\"pycowsay\", metadata_version=metadata_version)\n    \n        if metadata_version is None:\n            assert run_pipx_cli([\"list\"])\n            captured = capsys.readouterr()\n            assert \"package pycowsay has missing internal pipx metadata\" in captured.err\n        else:\n            assert not run_pipx_cli([\"list\"])\n            captured = capsys.readouterr()\n>           assert \"package pycowsay 0.0.0.1,\" in captured.out\nE           AssertionError: assert 'package pycowsay 0.0.0.1,' in 'creating virtual environment...\\ninstalling pycowsay...\\n  installed package pycowsay 0.0.0.2, Python 3.10.19\\n  These apps are now globally available\\n    - pycowsay\\nvenvs are in /tmp/pytest-of-root/pytest-11/test_list_legacy_venv_0_1_0/subdir/pipxhome/venvs\\napps are exposed on your $PATH at /tmp/pytest-of-root/pytest-11/test_list_legacy_venv_0_1_0/otherdir/pipxbindir\\n   package pycowsay 0.0.0.2, Python 3.10.19\\n    - pycowsay\\n'\nE            +  where 'creating virtual environment...\\ninstalling pycowsay...\\n  installed package pycowsay 0.0.0.2, Python 3.10.19\\n  These apps are now globally available\\n    - pycowsay\\nvenvs are in /tmp/pytest-of-root/pytest-11/test_list_legacy_venv_0_1_0/subdir/pipxhome/venvs\\napps are exposed on your $PATH at /tmp/pytest-of-root/pytest-11/test_list_legacy_venv_0_1_0/otherdir/pipxbindir\\n   package pycowsay 0.0.0.2, Python 3.10.19\\n    - pycowsay\\n' = CaptureResult(out='creating virtual environment...\\ninstalling pycowsay...\\n  installed package pycowsay 0.0.0.2, Python 3.10.19\\n  These apps are now globally available\\n    - pycowsay\\nvenvs are in /tmp/pytest-of-root/pytest-11/test_list_legacy_venv_0_1_0/subdir/pipxhome/venvs\\napps are exposed on your $PATH at /tmp/pytest-of-root/pytest-11/test_list_legacy_venv_0_1_0/otherdir/pipxbindir\\n   package pycowsay 0.0.0.2, Python 3.10.19\\n    - pycowsay\\n', err='done! ✨ #x1F31F ✨\\n').out\n\ntests/test_list.py:60: AssertionError"}},"diff":null,"patch_sha256":null,"dropped_paths":[],"snapshot_sha":null}
{"receipt_id":"agent1-17","seq":17,"branch_id":"agent1","kind":"command","cmd":"/opt/receipts-eddaa55c010043198dd968275601f7f7/bin/busybox mkdir -p /opt/receipts/reports && python -I /opt/receipts-eddaa55c010043198dd968275601f7f7/receipts_pytest.py tests/test_list.py::test_list_legacy_venv -v -s -k 0.1 -o junit_family=xunit1 -p no:cacheprovider -rA --continue-on-collection-errors --junitxml=/opt/receipts/reports/agent1-17.xml","path":null,"exit_code":1,"stdout_tail":".19\\n    - pycowsay\\n'\nE            +  where 'creating virtual environment...\\ncreating shared libraries...\\nupgrading shared libraries...\\ninstalling pycowsay...\\n  installed package pycowsay 0.0.0.2, Python 3.10.19\\n  These apps are now globally available\\n    - pycowsay\\nvenvs are in /tmp/pytest-of-root/pytest-12/test_list_legacy_venv_0_1_0/subdir/pipxhome/venvs\\napps are exposed on your $PATH at /tmp/pytest-of-root/pytest-12/test_list_legacy_venv_0_1_0/otherdir/pipxbindir\\n   package pycowsay 0.0.0.2, Python 3.10.19\\n    - pycowsay\\n' = CaptureResult(out='creating virtual environment...\\ncreating shared libraries...\\nupgrading shared libraries...\\ninstalling pycowsay...\\n  installed package pycowsay 0.0.0.2, Python 3.10.19\\n  These apps are now globally available\\n    - pycowsay\\nvenvs are in /tmp/pytest-of-root/pytest-12/test_list_legacy_venv_0_1_0/subdir/pipxhome/venvs\\napps are exposed on your $PATH at /tmp/pytest-of-root/pytest-12/test_list_legacy_venv_0_1_0/otherdir/pipxbindir\\n   package pycowsay 0.0.0.2, Python 3.10.19\\n    - pycowsay\\n', err='done! ✨ 🌟 ✨\\n').out\n\ntests/test_list.py:60: AssertionError\n------------------------------ Captured log call -------------------------------\nDEBUG    pipx.main:main.py:715 2026-10-03 20:18:53\nDEBUG    pipx.main:main.py:716 pipx install pycowsay\nINFO     pipx.main:main.py:717 pipx version is 0.16.2.0.1.dev0\nINFO     pipx.main:main.py:718 Default python interpreter is '/usr/local/bin/python'\nINFO     pipx.util:util.py:56 creating directory /tmp/pytest-of-root/pytest-12/test_list_legacy_venv_0_1_0/subdir/pipxhome/venvs\nINFO     pipx.util:util.py:56 creating directory /tmp/pytest-of-root/pytest-12/test_list_legacy_venv_0_1_0/otherdir/pipxbindir\nINFO     pipx.util:util.py:56 creating directory /tmp/pytest-of-root/pytest-12/test_list_legacy_venv_0_1_0/subdir/pipxhome/.cache\nINFO     pipx.commands.common:common.py:320 Determined package name: pycowsay\nINFO     pipx.commands.common:common.py:321 Package name determined in 0.0s\nINFO     pipx.util:util.py:135 running /usr/local/bin/python -m venv --without-pip /tmp/pytest-of-root/pytest-12/test_list_legacy_venv_0_1_0/subdir/pipxhome/venvs/pycowsay\nDEBUG    pipx.util:util.py:148 stdout:\nDEBUG    pipx.util:util.py:150 stderr:\nDEBUG    pipx.util:util.py:151 returncode: 0\nINFO     pipx.util:util.py:135 running /usr/local/bin/python -m venv --clear /tmp/pytest-of-root/pytest-12/session_shareddir0\nDEBUG    pipx.util:util.py:148 stdout:\nDEBUG    pipx.util:util.py:150 stderr:\nDEBUG    pipx.util:util.py:151 returncode: 0\nINFO     pipx.shared_libs:shared_libs.py:91 Upgrading shared libraries in /tmp/pytest-of-root/pytest-12/session_shareddir0\nINFO     pipx.util:util.py:135 running /tmp/pytest-of-root/pytest-12/session_shareddir0/bin/python -m pip --disable-pip-version-check install --force-reinstall -q --upgrade pip setuptools wheel\nDEBUG    pipx.util:util.py:148 stdout:\nDEBUG    pipx.util:util.py:150 stderr:\nDEBUG    pipx.util:util.py:151 returncode: 0\nINFO     pipx.util:util.py:135 running /tmp/pytest-of-root/pytest-12/test_list_legacy_venv_0_1_0/subdir/pipxhome/venvs/pycowsay/bin/python -c import sysconfig; print(sysconfig.get_path('purelib'))\nDEBUG    pipx.util:util.py:148 stdout: /tmp/pytest-of-root/pytest-12/test_list_legacy_venv_0_1_0/subdir/pipxhome/venvs/pycowsay/lib/python3.10/site-packages\nDEBUG    pipx.util:util.py:151 returncode: 0\nINFO     pipx.util:util.py:135 running /tmp/pytest-of-root/pytest-12/session_shareddir0/bin/python -c import sysconfig; print(sysconfig.get_path('purelib'))\nDEBUG    pipx.util:util.py:148 stdout: /tmp/pytest-of-root/pytest-12/session_shareddir0/lib/python3.10/site-packages\nDEBUG    pipx.util:util.py:151 returncode: 0\nINFO     pipx.util:util.py:135 running /tmp/pytest-of-root/pytest-12/test_list_legacy_venv_0_1_0/subdir/pipxhome/venvs/pycowsay/bin/python --version\nDEBUG    pipx.util:util.py:148 stdout: Python 3.10.19\nDEBUG    pipx.util:util.py:150 stderr:\nDEBUG    pipx.util:util.py:151 returncode: 0\nINFO     pipx.package_specifier:package_specifier.py:128 cleaned package spec: pycowsay\nINFO     pipx.util:util.py:135 running /tmp/pytest-of-root/pytest-12/test_list_legacy_venv_0_1_0/subdir/pipxhome/venvs/pycowsay/bin/python -m pip install pycowsay\nDEBUG    pipx.util:util.py:151 returncode: 0\nINFO     pipx.util:util.py:135 running <fetch_info_in_venv commands>\nDEBUG    pipx.util:util.py:148 stdout: {\"sys_path\": [\"/usr/local/lib/python310.zip\", \"/usr/local/lib/python3.10\", \"/usr/local/lib/python3.10/lib-dynload\", \"/tmp/pytest-of-root/pytest-12/test_list_legacy_venv_0_1_0/subdir/pipxhome/venvs/pycowsay/lib/python3.10/site-packages\", \"/tmp/pytest-of-root/pytest-12/session_shareddir0/lib/python3.10/site-packages\"], \"python_version\": \"3.10.19\", \"environment\": {\"implementation_name\": \"cpython\", \"implementation_version\": \"3.10.19\", \"os_name\": \"posix\", \"platform_machine\": \"x86_64\", \"platform_release\": \"7.0.6\", \"platform_system\": \"Linux\", \"platform_version\": \"#1 SMP PREEMPT_DYNAMIC Mon Aug 24 09:29:13 UTC 2026\", \"python_full_version\": \"3.10.19\", \"platform_python_implementation\": \"CPython\", \"python_version\": \"3.10\", \"sys_platform\": \"linux\"}}\nDEBUG    pipx.util:util.py:151 returncode: 0\nINFO     pipx.venv:venv.py:303 get_venv_metadata_for_package: 27ms\nINFO     pipx.package_specifier:package_specifier.py:128 cleaned package spec: pycowsay\nDEBUG    pipx.main:main.py:776 pipx finished.\nDEBUG    pipx.main:main.py:715 2026-10-03 20:18:59\nDEBUG    pipx.main:main.py:716 pipx list\nINFO     pipx.main:main.py:717 pipx version is 0.16.2.0.1.dev0\nINFO     pipx.main:main.py:718 Default python interpreter is '/usr/local/bin/python'\nDEBUG    pipx.main:main.py:776 pipx finished.\n----------- generated xml file: /opt/receipts/reports/agent1-17.xml ------------\n=========================== short test summary info ============================\nFAILED tests/test_list.py::test_list_legacy_venv[0.1] - AssertionError: asser...\n======================= 1 failed, 1 deselected in 6.32s ========================\n","stderr_tail":"","stdout_sha256":"f1de5638b22adea06e02c32a35b3bd9238a5adf937a3fa4266f313f3855cc7ce","log_path":"~/dev/nebius-hackathon/pilot/v2-P/pipxproject__pipx-680/runs/pilot-pipxproject__pipx-680-183a4a2cf5/logs/agent1/agent1-17.log","tree_digest":"00c0a5157a69aac56d66bc9281097691fd51f197e32284ddc181ad289c8e0777","tree_download_s":2.7213535830378532,"started_at":"2026-10-03T20:18:51.445210Z","duration_s":5.303427,"timed_out":false,"image_before":"b75db190-8b62-4f8d-b8dd-479f03f3e983","image_after":"abd65984-93d0-4701-9ff6-9ed390f4bc4f","junit":{"passed":[],"failed":["tests/test_list.py::test_list_legacy_venv[0.1]"],"errors":[],"skipped":[],"collection_errors":[],"failure_text":{"tests/test_list.py::test_list_legacy_venv[0.1]":"[...]pipx_cli([\"list\"])\n            captured = capsys.readouterr()\n            assert \"package pycowsay has missing internal pipx metadata\" in captured.err\n        else:\n            assert not run_pipx_cli([\"list\"])\n            captured = capsys.readouterr()\n>           assert \"package pycowsay 0.0.0.1,\" in captured.out\nE           AssertionError: assert 'package pycowsay 0.0.0.1,' in 'creating virtual environment...\\ncreating shared libraries...\\nupgrading shared libraries...\\ninstalling pycowsay...\\n  installed package pycowsay 0.0.0.2, Python 3.10.19\\n  These apps are now globally available\\n    - pycowsay\\nvenvs are in /tmp/pytest-of-root/pytest-12/test_list_legacy_venv_0_1_0/subdir/pipxhome/venvs\\napps are exposed on your $PATH at /tmp/pytest-of-root/pytest-12/test_list_legacy_venv_0_1_0/otherdir/pipxbindir\\n   package pycowsay 0.0.0.2, Python 3.10.19\\n    - pycowsay\\n'\nE            +  where 'creating virtual environment...\\ncreating shared libraries...\\nupgrading shared libraries...\\ninstalling pycowsay...\\n  installed package pycowsay 0.0.0.2, Python 3.10.19\\n  These apps are now globally available\\n    - pycowsay\\nvenvs are in /tmp/pytest-of-root/pytest-12/test_list_legacy_venv_0_1_0/subdir/pipxhome/venvs\\napps are exposed on your $PATH at /tmp/pytest-of-root/pytest-12/test_list_legacy_venv_0_1_0/otherdir/pipxbindir\\n   package pycowsay 0.0.0.2, Python 3.10.19\\n    - pycowsay\\n' = CaptureResult(out='creating virtual environment...\\ncreating shared libraries...\\nupgrading shared libraries...\\ninstalling pycowsay...\\n  installed package pycowsay 0.0.0.2, Python 3.10.19\\n  These apps are now globally available\\n    - pycowsay\\nvenvs are in /tmp/pytest-of-root/pytest-12/test_list_legacy_venv_0_1_0/subdir/pipxhome/venvs\\napps are exposed on your $PATH at /tmp/pytest-of-root/pytest-12/test_list_legacy_venv_0_1_0/otherdir/pipxbindir\\n   package pycowsay 0.0.0.2, Python 3.10.19\\n    - pycowsay\\n', err='done! ✨ #x1F31F ✨\\n').out\n\ntests/test_list.py:60: AssertionError"}},"diff":null,"patch_sha256":null,"dropped_paths":[],"snapshot_sha":null}
{"receipt_id":"agent1-18","seq":18,"branch_id":"agent1","kind":"command","cmd":"/opt/receipts-4bf50fc1555a4896b074774055acddf3/bin/busybox mkdir -p /opt/receipts/reports && python -I /opt/receipts-4bf50fc1555a4896b074774055acddf3/receipts_pytest.py 'tests/test_list.py::test_list_legacy_venv[0.1]' -v -s -o junit_family=xunit1 -p no:cacheprovider -rA --continue-on-collection-errors --junitxml=/opt/receipts/reports/agent1-18.xml","path":null,"exit_code":1,"stdout_tail":".19\\n    - pycowsay\\n'\nE            +  where 'creating virtual environment...\\ncreating shared libraries...\\nupgrading shared libraries...\\ninstalling pycowsay...\\n  installed package pycowsay 0.0.0.2, Python 3.10.19\\n  These apps are now globally available\\n    - pycowsay\\nvenvs are in /tmp/pytest-of-root/pytest-13/test_list_legacy_venv_0_1_0/subdir/pipxhome/venvs\\napps are exposed on your $PATH at /tmp/pytest-of-root/pytest-13/test_list_legacy_venv_0_1_0/otherdir/pipxbindir\\n   package pycowsay 0.0.0.2, Python 3.10.19\\n    - pycowsay\\n' = CaptureResult(out='creating virtual environment...\\ncreating shared libraries...\\nupgrading shared libraries...\\ninstalling pycowsay...\\n  installed package pycowsay 0.0.0.2, Python 3.10.19\\n  These apps are now globally available\\n    - pycowsay\\nvenvs are in /tmp/pytest-of-root/pytest-13/test_list_legacy_venv_0_1_0/subdir/pipxhome/venvs\\napps are exposed on your $PATH at /tmp/pytest-of-root/pytest-13/test_list_legacy_venv_0_1_0/otherdir/pipxbindir\\n   package pycowsay 0.0.0.2, Python 3.10.19\\n    - pycowsay\\n', err='done! ✨ 🌟 ✨\\n').out\n\ntests/test_list.py:60: AssertionError\n------------------------------ Captured log call -------------------------------\nDEBUG    pipx.main:main.py:715 2026-10-03 20:19:13\nDEBUG    pipx.main:main.py:716 pipx install pycowsay\nINFO     pipx.main:main.py:717 pipx version is 0.16.2.0.1.dev0\nINFO     pipx.main:main.py:718 Default python interpreter is '/usr/local/bin/python'\nINFO     pipx.util:util.py:56 creating directory /tmp/pytest-of-root/pytest-13/test_list_legacy_venv_0_1_0/subdir/pipxhome/venvs\nINFO     pipx.util:util.py:56 creating directory /tmp/pytest-of-root/pytest-13/test_list_legacy_venv_0_1_0/otherdir/pipxbindir\nINFO     pipx.util:util.py:56 creating directory /tmp/pytest-of-root/pytest-13/test_list_legacy_venv_0_1_0/subdir/pipxhome/.cache\nINFO     pipx.commands.common:common.py:320 Determined package name: pycowsay\nINFO     pipx.commands.common:common.py:321 Package name determined in 0.0s\nINFO     pipx.util:util.py:135 running /usr/local/bin/python -m venv --without-pip /tmp/pytest-of-root/pytest-13/test_list_legacy_venv_0_1_0/subdir/pipxhome/venvs/pycowsay\nDEBUG    pipx.util:util.py:148 stdout:\nDEBUG    pipx.util:util.py:150 stderr:\nDEBUG    pipx.util:util.py:151 returncode: 0\nINFO     pipx.util:util.py:135 running /usr/local/bin/python -m venv --clear /tmp/pytest-of-root/pytest-13/session_shareddir0\nDEBUG    pipx.util:util.py:148 stdout:\nDEBUG    pipx.util:util.py:150 stderr:\nDEBUG    pipx.util:util.py:151 returncode: 0\nINFO     pipx.shared_libs:shared_libs.py:91 Upgrading shared libraries in /tmp/pytest-of-root/pytest-13/session_shareddir0\nINFO     pipx.util:util.py:135 running /tmp/pytest-of-root/pytest-13/session_shareddir0/bin/python -m pip --disable-pip-version-check install --force-reinstall -q --upgrade pip setuptools wheel\nDEBUG    pipx.util:util.py:148 stdout:\nDEBUG    pipx.util:util.py:150 stderr:\nDEBUG    pipx.util:util.py:151 returncode: 0\nINFO     pipx.util:util.py:135 running /tmp/pytest-of-root/pytest-13/test_list_legacy_venv_0_1_0/subdir/pipxhome/venvs/pycowsay/bin/python -c import sysconfig; print(sysconfig.get_path('purelib'))\nDEBUG    pipx.util:util.py:148 stdout: /tmp/pytest-of-root/pytest-13/test_list_legacy_venv_0_1_0/subdir/pipxhome/venvs/pycowsay/lib/python3.10/site-packages\nDEBUG    pipx.util:util.py:151 returncode: 0\nINFO     pipx.util:util.py:135 running /tmp/pytest-of-root/pytest-13/session_shareddir0/bin/python -c import sysconfig; print(sysconfig.get_path('purelib'))\nDEBUG    pipx.util:util.py:148 stdout: /tmp/pytest-of-root/pytest-13/session_shareddir0/lib/python3.10/site-packages\nDEBUG    pipx.util:util.py:151 returncode: 0\nINFO     pipx.util:util.py:135 running /tmp/pytest-of-root/pytest-13/test_list_legacy_venv_0_1_0/subdir/pipxhome/venvs/pycowsay/bin/python --version\nDEBUG    pipx.util:util.py:148 stdout: Python 3.10.19\nDEBUG    pipx.util:util.py:150 stderr:\nDEBUG    pipx.util:util.py:151 returncode: 0\nINFO     pipx.package_specifier:package_specifier.py:128 cleaned package spec: pycowsay\nINFO     pipx.util:util.py:135 running /tmp/pytest-of-root/pytest-13/test_list_legacy_venv_0_1_0/subdir/pipxhome/venvs/pycowsay/bin/python -m pip install pycowsay\nDEBUG    pipx.util:util.py:151 returncode: 0\nINFO     pipx.util:util.py:135 running <fetch_info_in_venv commands>\nDEBUG    pipx.util:util.py:148 stdout: {\"sys_path\": [\"/usr/local/lib/python310.zip\", \"/usr/local/lib/python3.10\", \"/usr/local/lib/python3.10/lib-dynload\", \"/tmp/pytest-of-root/pytest-13/test_list_legacy_venv_0_1_0/subdir/pipxhome/venvs/pycowsay/lib/python3.10/site-packages\", \"/tmp/pytest-of-root/pytest-13/session_shareddir0/lib/python3.10/site-packages\"], \"python_version\": \"3.10.19\", \"environment\": {\"implementation_name\": \"cpython\", \"implementation_version\": \"3.10.19\", \"os_name\": \"posix\", \"platform_machine\": \"x86_64\", \"platform_release\": \"7.0.6\", \"platform_system\": \"Linux\", \"platform_version\": \"#1 SMP PREEMPT_DYNAMIC Mon Aug 24 09:29:13 UTC 2026\", \"python_full_version\": \"3.10.19\", \"platform_python_implementation\": \"CPython\", \"python_version\": \"3.10\", \"sys_platform\": \"linux\"}}\nDEBUG    pipx.util:util.py:151 returncode: 0\nINFO     pipx.venv:venv.py:303 get_venv_metadata_for_package: 26ms\nINFO     pipx.package_specifier:package_specifier.py:128 cleaned package spec: pycowsay\nDEBUG    pipx.main:main.py:776 pipx finished.\nDEBUG    pipx.main:main.py:715 2026-10-03 20:19:19\nDEBUG    pipx.main:main.py:716 pipx list\nINFO     pipx.main:main.py:717 pipx version is 0.16.2.0.1.dev0\nINFO     pipx.main:main.py:718 Default python interpreter is '/usr/local/bin/python'\nDEBUG    pipx.main:main.py:776 pipx finished.\n----------- generated xml file: /opt/receipts/reports/agent1-18.xml ------------\n=========================== short test summary info ============================\nFAILED tests/test_list.py::test_list_legacy_venv[0.1] - AssertionError: asser...\n============================== 1 failed in 6.27s ===============================\n","stderr_tail":"","stdout_sha256":"0512fec6555d46444f1c253823aba44b1794345c64e8049c49fc426b5eda2287","log_path":"~/dev/nebius-hackathon/pilot/v2-P/pipxproject__pipx-680/runs/pilot-pipxproject__pipx-680-183a4a2cf5/logs/agent1/agent1-18.log","tree_digest":"00c0a5157a69aac56d66bc9281097691fd51f197e32284ddc181ad289c8e0777","tree_download_s":2.700955791864544,"started_at":"2026-10-03T20:19:11.927864Z","duration_s":5.2740540000000005,"timed_out":false,"image_before":"abd65984-93d0-4701-9ff6-9ed390f4bc4f","image_after":"75cf1217-c32f-4519-830f-c6c1d52d17e8","junit":{"passed":[],"failed":["tests/test_list.py::test_list_legacy_venv[0.1]"],"errors":[],"skipped":[],"collection_errors":[],"failure_text":{"tests/test_list.py::test_list_legacy_venv[0.1]":"[...]pipx_cli([\"list\"])\n            captured = capsys.readouterr()\n            assert \"package pycowsay has missing internal pipx metadata\" in captured.err\n        else:\n            assert not run_pipx_cli([\"list\"])\n            captured = capsys.readouterr()\n>           assert \"package pycowsay 0.0.0.1,\" in captured.out\nE           AssertionError: assert 'package pycowsay 0.0.0.1,' in 'creating virtual environment...\\ncreating shared libraries...\\nupgrading shared libraries...\\ninstalling pycowsay...\\n  installed package pycowsay 0.0.0.2, Python 3.10.19\\n  These apps are now globally available\\n    - pycowsay\\nvenvs are in /tmp/pytest-of-root/pytest-13/test_list_legacy_venv_0_1_0/subdir/pipxhome/venvs\\napps are exposed on your $PATH at /tmp/pytest-of-root/pytest-13/test_list_legacy_venv_0_1_0/otherdir/pipxbindir\\n   package pycowsay 0.0.0.2, Python 3.10.19\\n    - pycowsay\\n'\nE            +  where 'creating virtual environment...\\ncreating shared libraries...\\nupgrading shared libraries...\\ninstalling pycowsay...\\n  installed package pycowsay 0.0.0.2, Python 3.10.19\\n  These apps are now globally available\\n    - pycowsay\\nvenvs are in /tmp/pytest-of-root/pytest-13/test_list_legacy_venv_0_1_0/subdir/pipxhome/venvs\\napps are exposed on your $PATH at /tmp/pytest-of-root/pytest-13/test_list_legacy_venv_0_1_0/otherdir/pipxbindir\\n   package pycowsay 0.0.0.2, Python 3.10.19\\n    - pycowsay\\n' = CaptureResult(out='creating virtual environment...\\ncreating shared libraries...\\nupgrading shared libraries...\\ninstalling pycowsay...\\n  installed package pycowsay 0.0.0.2, Python 3.10.19\\n  These apps are now globally available\\n    - pycowsay\\nvenvs are in /tmp/pytest-of-root/pytest-13/test_list_legacy_venv_0_1_0/subdir/pipxhome/venvs\\napps are exposed on your $PATH at /tmp/pytest-of-root/pytest-13/test_list_legacy_venv_0_1_0/otherdir/pipxbindir\\n   package pycowsay 0.0.0.2, Python 3.10.19\\n    - pycowsay\\n', err='done! ✨ #x1F31F ✨\\n').out\n\ntests/test_list.py:60: AssertionError"}},"diff":null,"patch_sha256":null,"dropped_paths":[],"snapshot_sha":null}
{"receipt_id":"agent1-19","seq":19,"branch_id":"agent1","kind":"command","cmd":"pipx list --json","path":null,"exit_code":0,"stdout_tail":"","stderr_tail":"nothing has been installed with pipx 😴\n","stdout_sha256":"d62e40785fa7709f66f852752248fe5ed7952202c3f0ab4b20cbae64223451cc","log_path":"~/dev/nebius-hackathon/pilot/v2-P/pipxproject__pipx-680/runs/pilot-pipxproject__pipx-680-183a4a2cf5/logs/agent1/agent1-19.log","tree_digest":null,"tree_download_s":null,"started_at":"2026-10-03T20:19:36.040395Z","duration_s":0.119729,"timed_out":false,"image_before":"75cf1217-c32f-4519-830f-c6c1d52d17e8","image_after":"eabc7b1a-708e-4b13-ae73-6a30e2f16287","junit":null,"diff":null,"patch_sha256":null,"dropped_paths":[],"snapshot_sha":null}
{"receipt_id":"agent1-20","seq":20,"branch_id":"agent1","kind":"command","cmd":"pipx list","path":null,"exit_code":0,"stdout_tail":"","stderr_tail":"nothing has been installed with pipx 😴\n","stdout_sha256":"d62e40785fa7709f66f852752248fe5ed7952202c3f0ab4b20cbae64223451cc","log_path":"~/dev/nebius-hackathon/pilot/v2-P/pipxproject__pipx-680/runs/pilot-pipxproject__pipx-680-183a4a2cf5/logs/agent1/agent1-20.log","tree_digest":null,"tree_download_s":null,"started_at":"2026-10-03T20:19:40.262363Z","duration_s":0.102863,"timed_out":false,"image_before":"eabc7b1a-708e-4b13-ae73-6a30e2f16287","image_after":"c5641861-9069-40ca-9b9d-1ca13fe07cda","junit":null,"diff":null,"patch_sha256":null,"dropped_paths":[],"snapshot_sha":null}
{"receipt_id":"agent1-21","seq":21,"branch_id":"agent1","kind":"command","cmd":"python -c \"import sys; print(sys.path)\"","path":null,"exit_code":0,"stdout_tail":"['', '/usr/local/lib/python310.zip', '/usr/local/lib/python3.10', '/usr/local/lib/python3.10/lib-dynload', '/usr/local/lib/python3.10/site-packages', '/pipx/src']\n","stderr_tail":"","stdout_sha256":"efad0a35f1793dcac2a7fe2efe902ac481c79e73b2d6e520c2e9be562fa99e35","log_path":"~/dev/nebius-hackathon/pilot/v2-P/pipxproject__pipx-680/runs/pilot-pipxproject__pipx-680-183a4a2cf5/logs/agent1/agent1-21.log","tree_digest":null,"tree_download_s":null,"started_at":"2026-10-03T20:19:48.763503Z","duration_s":0.014043,"timed_out":false,"image_before":"c5641861-9069-40ca-9b9d-1ca13fe07cda","image_after":"55ff1575-54b3-4932-9a38-1d8e84771f4a","junit":null,"diff":null,"patch_sha256":null,"dropped_paths":[],"snapshot_sha":null}
{"receipt_id":"agent1-22","seq":22,"branch_id":"agent1","kind":"command","cmd":"pip install -e .","path":null,"exit_code":0,"stdout_tail":"Obtaining file:///pipx\n  Installing build dependencies: started\n  Installing build dependencies: finished with status 'done'\n  Checking if build backend supports build_editable: started\n  Checking if build backend supports build_editable: finished with status 'done'\n  Getting requirements to build editable: started\n  Getting requirements to build editable: finished with status 'done'\n  Preparing editable metadata (pyproject.toml): started\n  Preparing editable metadata (pyproject.toml): finished with status 'done'\nRequirement already satisfied: colorama>=0.4.4 in /usr/local/lib/python3.10/site-packages (from pipx==0.16.2.0.1.dev0) (0.4.6)\nRequirement already satisfied: userpath>=1.4.1 in /usr/local/lib/python3.10/site-packages (from pipx==0.16.2.0.1.dev0) (1.9.2)\nRequirement already satisfied: argcomplete<2.0,>=1.9.4 in /usr/local/lib/python3.10/site-packages (from pipx==0.16.2.0.1.dev0) (1.12.3)\nRequirement already satisfied: packaging>=20.0 in /usr/local/lib/python3.10/site-packages (from pipx==0.16.2.0.1.dev0) (25.0)\nRequirement already satisfied: click in /usr/local/lib/python3.10/site-packages (from userpath>=1.4.1->pipx==0.16.2.0.1.dev0) (8.3.1)\nBuilding wheels for collected packages: pipx\n  Building editable for pipx (pyproject.toml): started\n  Building editable for pipx (pyproject.toml): finished with status 'done'\n  Created wheel for pipx: filename=pipx-0.16.2.0.1.dev0-0.editable-py3-none-any.whl size=7093 sha256=3072e1c02348bb3b125578199de8d37a8161cae804371fbf58034ee096b18aa2\n  Stored in directory: /tmp/pip-ephem-wheel-cache-763n_3oj/wheels/7d/18/dd/919fa5e6eb1c71bb6f320359691d3cc83275046aeee94e3f55\nSuccessfully built pipx\nInstalling collected packages: pipx\n  Attempting uninstall: pipx\n    Found existing installation: pipx 0.16.2.0.1.dev0\n    Uninstalling pipx-0.16.2.0.1.dev0:\n      Successfully uninstalled pipx-0.16.2.0.1.dev0\nSuccessfully installed pipx-0.16.2.0.1.dev0\n","stderr_tail":"WARNING: Running pip as the 'root' user can result in broken permissions and conflicting behaviour with the system package manager, possibly rendering your system unusable. It is recommended to use a virtual environment instead: https://pip.pypa.io/warnings/venv. Use the --root-user-action option if you know what you are doing and want to suppress this warning.\n\n[notice] A new release of pip is available: 25.3 -> 26.2.1\n[notice] To update, run: pip install --upgrade pip\n","stdout_sha256":"ecb8b58c409ef82f455adbbdf3388c1242cf8ee0bf8ff9e790d10618238726f3","log_path":"~/dev/nebius-hackathon/pilot/v2-P/pipxproject__pipx-680/runs/pilot-pipxproject__pipx-680-183a4a2cf5/logs/agent1/agent1-22.log","tree_digest":null,"tree_download_s":null,"started_at":"2026-10-03T20:19:56.159544Z","duration_s":1.5017019999999999,"timed_out":false,"image_before":"55ff1575-54b3-4932-9a38-1d8e84771f4a","image_after":"0a6941fb-f5c9-4e2b-94f1-d7fad859ece5","junit":null,"diff":null,"patch_sha256":null,"dropped_paths":[],"snapshot_sha":null}
{"receipt_id":"agent1-23","seq":23,"branch_id":"agent1","kind":"command","cmd":"pipx list","path":null,"exit_code":0,"stdout_tail":"","stderr_tail":"nothing has been installed with pipx 😴\n","stdout_sha256":"d62e40785fa7709f66f852752248fe5ed7952202c3f0ab4b20cbae64223451cc","log_path":"~/dev/nebius-hackathon/pilot/v2-P/pipxproject__pipx-680/runs/pilot-pipxproject__pipx-680-183a4a2cf5/logs/agent1/agent1-23.log","tree_digest":null,"tree_download_s":null,"started_at":"2026-10-03T20:20:02.609383Z","duration_s":0.10306,"timed_out":false,"image_before":"0a6941fb-f5c9-4e2b-94f1-d7fad859ece5","image_after":"9f315d77-0118-484a-b6c5-6528ca804a7d","junit":null,"diff":null,"patch_sha256":null,"dropped_paths":[],"snapshot_sha":null}
{"receipt_id":"agent1-24","seq":24,"branch_id":"agent1","kind":"command","cmd":"python -c \"\nimport sys\nsys.path.insert(0, '/pipx/src')\nfrom pipx.commands.list_packages import list_packages\nfrom pipx.venv import VenvContainer\nimport tempfile\nimport os\nfrom pathlib import Path\n\n# Create empty container\ntemp_dir = tempfile.mkdtemp()\nos.environ['PIPX_HOME'] = str(Path(temp_dir) / '.local' / 'share' / 'pipx')\nos.environ['PIPX_BIN_DIR'] = str(Path(temp_dir) / '.local' / 'bin')\n\ncontainer = VenvContainer(Path(os.environ['PIPX_HOME']) / 'venvs')\nprint('Testing empty list...')\nresult = list_packages(container, False, False)\nprint(f'Result: {result}')\n\"","path":null,"exit_code":0,"stdout_tail":"Testing empty list...\nResult: 0\n","stderr_tail":"nothing has been installed with pipx 😴\n","stdout_sha256":"89b285f1f2d5b32c2cf361a1ed7e16ae251d230d074cf5a956849049d4c5bc02","log_path":"~/dev/nebius-hackathon/pilot/v2-P/pipxproject__pipx-680/runs/pilot-pipxproject__pipx-680-183a4a2cf5/logs/agent1/agent1-24.log","tree_digest":null,"tree_download_s":null,"started_at":"2026-10-03T20:20:07.061439Z","duration_s":0.09075,"timed_out":false,"image_before":"9f315d77-0118-484a-b6c5-6528ca804a7d","image_after":"d132a0f4-8252-463c-b589-820cc0f825dc","junit":null,"diff":null,"patch_sha256":null,"dropped_paths":[],"snapshot_sha":null}
{"receipt_id":"agent1-25","seq":25,"branch_id":"agent1","kind":"write","cmd":"/opt/receipts-b2dfba792e4047bdaae1fe9d6bb8ca36/bin/busybox sh -c 'mkdir -p /pipx/src/pipx/commands && cp /opt/receipts-b2dfba792e4047bdaae1fe9d6bb8ca36/incoming/8670fd1799ac71aedd7415e06ade38bf681a52cb0858dd3b1aa2af5119e8ff12 /pipx/src/pipx/commands/list_packages.py'","path":"src/pipx/commands/list_packages.py","exit_code":0,"stdout_tail":"","stderr_tail":"","stdout_sha256":"8670fd1799ac71aedd7415e06ade38bf681a52cb0858dd3b1aa2af5119e8ff12","log_path":"~/dev/nebius-hackathon/pilot/v2-P/pipxproject__pipx-680/runs/pilot-pipxproject__pipx-680-183a4a2cf5/logs/agent1/agent1-25.log","tree_digest":null,"tree_download_s":null,"started_at":"2026-10-03T20:20:12.234110Z","duration_s":0.005213000000000001,"timed_out":false,"image_before":"d132a0f4-8252-463c-b589-820cc0f825dc","image_after":"d4817d41-6d84-44e2-9a4d-50fd7689b57f","junit":null,"diff":null,"patch_sha256":null,"dropped_paths":[],"snapshot_sha":null}
{"receipt_id":"agent1-26","seq":26,"branch_id":"agent1","kind":"command","cmd":"pipx list","path":null,"exit_code":0,"stdout_tail":"","stderr_tail":"DEBUG: nothing has been installed with pipx 😴\nnothing has been installed with pipx 😴\n","stdout_sha256":"165d573bafeaec8f1d48882caef3dce8fa5ee6255c6c2caf7a8035f1c5572833","log_path":"~/dev/nebius-hackathon/pilot/v2-P/pipxproject__pipx-680/runs/pilot-pipxproject__pipx-680-183a4a2cf5/logs/agent1/agent1-26.log","tree_digest":null,"tree_download_s":null,"started_at":"2026-10-03T20:20:15.718455Z","duration_s":0.108435,"timed_out":false,"image_before":"d4817d41-6d84-44e2-9a4d-50fd7689b57f","image_after":"945b8053-a4a2-41d2-b485-550d3565deeb","junit":null,"diff":null,"patch_sha256":null,"dropped_paths":[],"snapshot_sha":null}
{"receipt_id":"agent1-27","seq":27,"branch_id":"agent1","kind":"command","cmd":"grep -r \"nothing has been installed with pipx\" /pipx/src/","path":null,"exit_code":0,"stdout_tail":"/pipx/src/pipx/commands/list_packages.py:        print(f\"DEBUG: nothing has been installed with pipx {sleep}\", file=sys.stderr)\n/pipx/src/pipx/commands/list_packages.py:        print(f\"nothing has been installed with pipx {sleep}\", file=sys.stderr)\n","stderr_tail":"","stdout_sha256":"8c8cf5d3879d1e641efe4ebe378e4fa784efdadbbc734e68a615dc9cf380b2cd","log_path":"~/dev/nebius-hackathon/pilot/v2-P/pipxproject__pipx-680/runs/pilot-pipxproject__pipx-680-183a4a2cf5/logs/agent1/agent1-27.log","tree_digest":null,"tree_download_s":null,"started_at":"2026-10-03T20:20:20.185253Z","duration_s":0.00431,"timed_out":false,"image_before":"945b8053-a4a2-41d2-b485-550d3565deeb","image_after":"9829ec27-682c-4cf0-82d5-ebc297c6a270","junit":null,"diff":null,"patch_sha256":null,"dropped_paths":[],"snapshot_sha":null}
{"receipt_id":"agent1-28","seq":28,"branch_id":"agent1","kind":"command","cmd":"find /pipx -name \"*.py\" -exec grep -l \"nothing has been installed with pipx\" {} \\;","path":null,"exit_code":0,"stdout_tail":"/pipx/src/pipx/commands/list_packages.py\n/pipx/tests/test_list.py\n","stderr_tail":"","stdout_sha256":"a172410b4b696958ad0a9db696da157d5c23446576182a8a63eb5a2e01083dfc","log_path":"~/dev/nebius-hackathon/pilot/v2-P/pipxproject__pipx-680/runs/pilot-pipxproject__pipx-680-183a4a2cf5/logs/agent1/agent1-28.log","tree_digest":null,"tree_download_s":null,"started_at":"2026-10-03T20:20:24.173191Z","duration_s":0.079899,"timed_out":false,"image_before":"9829ec27-682c-4cf0-82d5-ebc297c6a270","image_after":"e2db6e46-e2ec-4900-a337-4ac8abc44b5e","junit":null,"diff":null,"patch_sha256":null,"dropped_paths":[],"snapshot_sha":null}
{"receipt_id":"agent1-29","seq":29,"branch_id":"agent1","kind":"command","cmd":"grep -n \"nothing has been installed with pipx\" /pipx/tests/test_list.py","path":null,"exit_code":0,"stdout_tail":"22:    assert \"nothing has been installed with pipx\" in captured.err\n","stderr_tail":"","stdout_sha256":"358dc9f18df3801169149401271b7848ed999aa7fee121d3886583d53a996145","log_path":"~/dev/nebius-hackathon/pilot/v2-P/pipxproject__pipx-680/runs/pilot-pipxproject__pipx-680-183a4a2cf5/logs/agent1/agent1-29.log","tree_digest":null,"tree_download_s":null,"started_at":"2026-10-03T20:20:27.895626Z","duration_s":0.0031669999999999997,"timed_out":false,"image_before":"e2db6e46-e2ec-4900-a337-4ac8abc44b5e","image_after":"b0229e94-8e70-43b2-8e1f-62e36484de1e","junit":null,"diff":null,"patch_sha256":null,"dropped_paths":[],"snapshot_sha":null}
{"receipt_id":"agent1-30","seq":30,"branch_id":"agent1","kind":"write","cmd":"/opt/receipts-9997c8ba048447adbb0abd2c0aef793f/bin/busybox sh -c 'mkdir -p /pipx/src/pipx/commands && cp /opt/receipts-9997c8ba048447adbb0abd2c0aef793f/incoming/172528fdcc9b9b7f35b40bca68d6f3bf7e006b5d2b2355adf7e0ba1b9d1bec8e /pipx/src/pipx/commands/list_packages.py'","path":"src/pipx/commands/list_packages.py","exit_code":0,"stdout_tail":"","stderr_tail":"","stdout_sha256":"172528fdcc9b9b7f35b40bca68d6f3bf7e006b5d2b2355adf7e0ba1b9d1bec8e","log_path":"~/dev/nebius-hackathon/pilot/v2-P/pipxproject__pipx-680/runs/pilot-pipxproject__pipx-680-183a4a2cf5/logs/agent1/agent1-30.log","tree_digest":null,"tree_download_s":null,"started_at":"2026-10-03T20:20:33.431977Z","duration_s":0.004902,"timed_out":false,"image_before":"b0229e94-8e70-43b2-8e1f-62e36484de1e","image_after":"787676bb-d32c-40a7-90a0-1d997102c0c2","junit":null,"diff":null,"patch_sha256":null,"dropped_paths":[],"snapshot_sha":null}
{"receipt_id":"agent1-31","seq":31,"branch_id":"agent1","kind":"command","cmd":"pipx list","path":null,"exit_code":0,"stdout_tail":"","stderr_tail":"=== CUSTOM LIST_PACKAGES FUNCTION CALLED ===\nDEBUG: nothing has been installed with pipx 😴\nnothing has been installed with pipx 😴\n=== END CUSTOM LIST_PACKAGES FUNCTION ===\n","stdout_sha256":"37f4e97a456169489049777bc5ac6da9315fa105e7b3ae018c6e38a30f7ae747","log_path":"~/dev/nebius-hackathon/pilot/v2-P/pipxproject__pipx-680/runs/pilot-pipxproject__pipx-680-183a4a2cf5/logs/agent1/agent1-31.log","tree_digest":null,"tree_download_s":null,"started_at":"2026-10-03T20:20:37.222024Z","duration_s":0.104466,"timed_out":false,"image_before":"787676bb-d32c-40a7-90a0-1d997102c0c2","image_after":"778fa788-62a3-4eab-9039-6fb08c23ec06","junit":null,"diff":null,"patch_sha256":null,"dropped_paths":[],"snapshot_sha":null}
{"receipt_id":"agent1-32","seq":32,"branch_id":"agent1","kind":"command","cmd":"grep -n \"list\" /pipx/src/pipx/main.py","path":null,"exit_code":0,"stdout_tail":"170:        skip_list = [canonicalize_name(x) for x in args.skip]\n230:            skip=skip_list,\n233:    elif args.command == \"list\":\n234:        return commands.list_packages(venv_container, args.include_injected, args.json)\n252:            skip=skip_list,\n480:def _add_list(subparsers: argparse._SubParsersAction) -> None:\n482:        \"list\",\n620:    _add_list(subparsers)\n634:def delete_oldest_logs(file_list: List[Path], keep_number: int) -> None:\n635:    file_list = sorted(file_list)\n636:    if len(file_list) > keep_number:\n637:        for existing_file in file_list[:-keep_number]:\n649:    delete_oldest_logs(list(constants.PIPX_LOG_DIR.glob(\"cmd_*[0-9].log\")), max_logs)\n651:        list(constants.PIPX_LOG_DIR.glob(\"cmd_*_pip_errors.log\")), max_logs\n","stderr_tail":"","stdout_sha256":"cbe2d98dd8346e5d19e230a122ad5577d32660aab51f73deb0d3b05c6641f24d","log_path":"~/dev/nebius-hackathon/pilot/v2-P/pipxproject__pipx-680/runs/pilot-pipxproject__pipx-680-183a4a2cf5/logs/agent1/agent1-32.log","tree_digest":null,"tree_download_s":null,"started_at":"2026-10-03T20:20:44.183371Z","duration_s":0.002941,"timed_out":false,"image_before":"778fa788-62a3-4eab-9039-6fb08c23ec06","image_after":"38935383-1055-4720-8dde-78d509f7e79c","junit":null,"diff":null,"patch_sha256":null,"dropped_paths":[],"snapshot_sha":null}
{"receipt_id":"agent1-33","seq":33,"branch_id":"agent1","kind":"write","cmd":"/opt/receipts-df729b26d6fc4d00b113c1aa55989483/bin/busybox sh -c 'mkdir -p /pipx/src/pipx/commands && cp /opt/receipts-df729b26d6fc4d00b113c1aa55989483/incoming/25f5e993298aa00c582d151045c75f5f89d3f6039b7fb1673010dd62a8ef7b93 /pipx/src/pipx/commands/list_packages.py'","path":"src/pipx/commands/list_packages.py","exit_code":0,"stdout_tail":"","stderr_tail":"","stdout_sha256":"25f5e993298aa00c582d151045c75f5f89d3f6039b7fb1673010dd62a8ef7b93","log_path":"~/dev/nebius-hackathon/pilot/v2-P/pipxproject__pipx-680/runs/pilot-pipxproject__pipx-680-183a4a2cf5/logs/agent1/agent1-33.log","tree_digest":null,"tree_download_s":null,"started_at":"2026-10-03T20:20:50.085405Z","duration_s":0.00504,"timed_out":false,"image_before":"38935383-1055-4720-8dde-78d509f7e79c","image_after":"69d330c7-5c28-4682-965e-ed2679cec2ca","junit":null,"diff":null,"patch_sha256":null,"dropped_paths":[],"snapshot_sha":null}
{"receipt_id":"agent1-34","seq":34,"branch_id":"agent1","kind":"command","cmd":"pipx list","path":null,"exit_code":0,"stdout_tail":"","stderr_tail":"nothing has been installed with pipx 😴\n","stdout_sha256":"d62e40785fa7709f66f852752248fe5ed7952202c3f0ab4b20cbae64223451cc","log_path":"~/dev/nebius-hackathon/pilot/v2-P/pipxproject__pipx-680/runs/pilot-pipxproject__pipx-680-183a4a2cf5/logs/agent1/agent1-34.log","tree_digest":null,"tree_download_s":null,"started_at":"2026-10-03T20:20:53.966822Z","duration_s":0.102766,"timed_out":false,"image_before":"69d330c7-5c28-4682-965e-ed2679cec2ca","image_after":"bf094b60-eca3-47be-82a4-09dac805ac20","junit":null,"diff":null,"patch_sha256":null,"dropped_paths":[],"snapshot_sha":null}
{"receipt_id":"agent1-35","seq":35,"branch_id":"agent1","kind":"write","cmd":"/opt/receipts-4f192e746f884e6d875f8cce6e301ca9/bin/busybox sh -c 'mkdir -p /pipx/src/pipx/commands && cp /opt/receipts-4f192e746f884e6d875f8cce6e301ca9/incoming/2ec8026c7eee4270adeaef58da3ff443a8ff8cf54a8261e41c4169c0d5ba261a /pipx/src/pipx/commands/list_packages.py'","path":"src/pipx/commands/list_packages.py","exit_code":0,"stdout_tail":"","stderr_tail":"","stdout_sha256":"2ec8026c7eee4270adeaef58da3ff443a8ff8cf54a8261e41c4169c0d5ba261a","log_path":"~/dev/nebius-hackathon/pilot/v2-P/pipxproject__pipx-680/runs/pilot-pipxproject__pipx-680-183a4a2cf5/logs/agent1/agent1-35.log","tree_digest":null,"tree_download_s":null,"started_at":"2026-10-03T20:20:59.832602Z","duration_s":0.004694,"timed_out":false,"image_before":"bf094b60-eca3-47be-82a4-09dac805ac20","image_after":"4a04a6f7-958b-4c36-a311-1b11beea7311","junit":null,"diff":null,"patch_sha256":null,"dropped_paths":[],"snapshot_sha":null}
{"receipt_id":"agent1-36","seq":36,"branch_id":"agent1","kind":"command","cmd":"pipx list","path":null,"exit_code":0,"stdout_tail":"","stderr_tail":"DEBUG: venv_dirs length = 0\nDEBUG: About to print to stderr\nnothing has been installed with pipx 😴\nDEBUG: Finished printing to stderr\n","stdout_sha256":"e3c7ccef8d062b1b22485b7710084ec8623c3d8032d4775d63691031587b844c","log_path":"~/dev/nebius-hackathon/pilot/v2-P/pipxproject__pipx-680/runs/pilot-pipxproject__pipx-680-183a4a2cf5/logs/agent1/agent1-36.log","tree_digest":null,"tree_download_s":null,"started_at":"2026-10-03T20:21:03.526928Z","duration_s":0.104465,"timed_out":false,"image_before":"4a04a6f7-958b-4c36-a311-1b11beea7311","image_after":"11ef499d-deee-42e9-ba8a-516ef9623bec","junit":null,"diff":null,"patch_sha256":null,"dropped_paths":[],"snapshot_sha":null}
{"receipt_id":"agent1-37","seq":37,"branch_id":"agent1","kind":"write","cmd":"/opt/receipts-ebe7d4732d3a411989144ec94c134077/bin/busybox sh -c 'mkdir -p /pipx/src/pipx/commands && cp /opt/receipts-ebe7d4732d3a411989144ec94c134077/incoming/bfdd063dbb6ae44db4dc802fee10dbda29bc707dcf786d4c460681ca42578323 /pipx/src/pipx/commands/list_packages.py'","path":"src/pipx/commands/list_packages.py","exit_code":0,"stdout_tail":"","stderr_tail":"","stdout_sha256":"bfdd063dbb6ae44db4dc802fee10dbda29bc707dcf786d4c460681ca42578323","log_path":"~/dev/nebius-hackathon/pilot/v2-P/pipxproject__pipx-680/runs/pilot-pipxproject__pipx-680-183a4a2cf5/logs/agent1/agent1-37.log","tree_digest":null,"tree_download_s":null,"started_at":"2026-10-03T20:21:09.965636Z","duration_s":0.004675,"timed_out":false,"image_before":"11ef499d-deee-42e9-ba8a-516ef9623bec","image_after":"b8cbfc1d-3f68-4a82-9a07-68a65508948d","junit":null,"diff":null,"patch_sha256":null,"dropped_paths":[],"snapshot_sha":null}
{"receipt_id":"agent1-38","seq":38,"branch_id":"agent1","kind":"command","cmd":"pipx list","path":null,"exit_code":0,"stdout_tail":"","stderr_tail":"DEBUG: venv_dirs length = 0\nDEBUG: About to print to stderr\nnothing has been installed with pipx 😴\nDEBUG: Finished printing to stderr\n","stdout_sha256":"e3c7ccef8d062b1b22485b7710084ec8623c3d8032d4775d63691031587b844c","log_path":"~/dev/nebius-hackathon/pilot/v2-P/pipxproject__pipx-680/runs/pilot-pipxproject__pipx-680-183a4a2cf5/logs/agent1/agent1-38.log","tree_digest":null,"tree_download_s":null,"started_at":"2026-10-03T20:21:13.662061Z","duration_s":0.112017,"timed_out":false,"image_before":"b8cbfc1d-3f68-4a82-9a07-68a65508948d","image_after":"ee66171e-e2cd-485e-9a22-77256a7d851a","junit":null,"diff":null,"patch_sha256":null,"dropped_paths":[],"snapshot_sha":null}
{"receipt_id":"agent1-39","seq":39,"branch_id":"agent1","kind":"write","cmd":"/opt/receipts-d3c2348ea1cf440692dc408d717a9bef/bin/busybox sh -c 'mkdir -p /pipx/src/pipx/commands && cp /opt/receipts-d3c2348ea1cf440692dc408d717a9bef/incoming/7d316d9cec553e729f465b07fa506d65dfd69737a717750ebafcd90e1dfcca45 /pipx/src/pipx/commands/list_packages.py'","path":"src/pipx/commands/list_packages.py","exit_code":0,"stdout_tail":"","stderr_tail":"","stdout_sha256":"7d316d9cec553e729f465b07fa506d65dfd69737a717750ebafcd90e1dfcca45","log_path":"~/dev/nebius-hackathon/pilot/v2-P/pipxproject__pipx-680/runs/pilot-pipxproject__pipx-680-183a4a2cf5/logs/agent1/agent1-39.log","tree_digest":null,"tree_download_s":null,"started_at":"2026-10-03T20:21:19.792786Z","duration_s":0.006072,"timed_out":false,"image_before":"ee66171e-e2cd-485e-9a22-77256a7d851a","image_after":"a91f7570-f0cc-40be-84cd-d48132e2aa6b","junit":null,"diff":null,"patch_sha256":null,"dropped_paths":[],"snapshot_sha":null}
{"receipt_id":"agent1-40","seq":40,"branch_id":"agent1","kind":"write","cmd":"/opt/receipts-c6fb97e06b154ae091e77d6f89b2cc87/bin/busybox sh -c 'mkdir -p /pipx/src/pipx/commands && cp /opt/receipts-c6fb97e06b154ae091e77d6f89b2cc87/incoming/3d288662282ca18bb680cd55f4f87d787bde132f86c8e0f0f21f976aa0826c0f /pipx/src/pipx/commands/list_packages.py'","path":"src/pipx/commands/list_packages.py","exit_code":0,"stdout_tail":"","stderr_tail":"","stdout_sha256":"3d288662282ca18bb680cd55f4f87d787bde132f86c8e0f0f21f976aa0826c0f","log_path":"~/dev/nebius-hackathon/pilot/v2-P/pipxproject__pipx-680/runs/pilot-pipxproject__pipx-680-183a4a2cf5/logs/agent1/agent1-40.log","tree_digest":null,"tree_download_s":null,"started_at":"2026-10-03T20:21:25.041939Z","duration_s":0.004791,"timed_out":false,"image_before":"a91f7570-f0cc-40be-84cd-d48132e2aa6b","image_after":"27338dee-cc5d-4cdc-a83d-052d2e9fc7cc","junit":null,"diff":null,"patch_sha256":null,"dropped_paths":[],"snapshot_sha":null}
{"receipt_id":"agent1-41","seq":41,"branch_id":"agent1","kind":"command","cmd":"pipx list","path":null,"exit_code":0,"stdout_tail":"","stderr_tail":"DEBUG: venv_dirs length = 0\nDEBUG: About to print to stderr\nnothing has been installed with pipx 😴\nDEBUG: Finished printing to stderr\n","stdout_sha256":"e3c7ccef8d062b1b22485b7710084ec8623c3d8032d4775d63691031587b844c","log_path":"~/dev/nebius-hackathon/pilot/v2-P/pipxproject__pipx-680/runs/pilot-pipxproject__pipx-680-183a4a2cf5/logs/agent1/agent1-41.log","tree_digest":null,"tree_download_s":null,"started_at":"2026-10-03T20:21:28.914623Z","duration_s":0.10791600000000001,"timed_out":false,"image_before":"27338dee-cc5d-4cdc-a83d-052d2e9fc7cc","image_after":"3523f115-8af2-43aa-984c-81aaae57529d","junit":null,"diff":null,"patch_sha256":null,"dropped_paths":[],"snapshot_sha":null}
{"receipt_id":"agent1-42","seq":42,"branch_id":"agent1","kind":"write","cmd":"/opt/receipts-8996b89f706d4ef2af4a0416b3312a12/bin/busybox sh -c 'mkdir -p /pipx/src/pipx/commands && cp /opt/receipts-8996b89f706d4ef2af4a0416b3312a12/incoming/7d316d9cec553e729f465b07fa506d65dfd69737a717750ebafcd90e1dfcca45 /pipx/src/pipx/commands/list_packages.py'","path":"src/pipx/commands/list_packages.py","exit_code":0,"stdout_tail":"","stderr_tail":"","stdout_sha256":"7d316d9cec553e729f465b07fa506d65dfd69737a717750ebafcd90e1dfcca45","log_path":"~/dev/nebius-hackathon/pilot/v2-P/pipxproject__pipx-680/runs/pilot-pipxproject__pipx-680-183a4a2cf5/logs/agent1/agent1-42.log","tree_digest":null,"tree_download_s":null,"started_at":"2026-10-03T20:21:35.195174Z","duration_s":0.004709,"timed_out":false,"image_before":"3523f115-8af2-43aa-984c-81aaae57529d","image_after":"65fd2305-02d8-4707-aa27-e5ed7220a677","junit":null,"diff":null,"patch_sha256":null,"dropped_paths":[],"snapshot_sha":null}
{"receipt_id":"agent1-43","seq":43,"branch_id":"agent1","kind":"write","cmd":"/opt/receipts-83f0744195564f1cb87b8d52223c932a/bin/busybox sh -c 'mkdir -p /pipx/src/pipx/commands && cp /opt/receipts-83f0744195564f1cb87b8d52223c932a/incoming/25f5e993298aa00c582d151045c75f5f89d3f6039b7fb1673010dd62a8ef7b93 /pipx/src/pipx/commands/list_packages.py'","path":"src/pipx/commands/list_packages.py","exit_code":0,"stdout_tail":"","stderr_tail":"","stdout_sha256":"25f5e993298aa00c582d151045c75f5f89d3f6039b7fb1673010dd62a8ef7b93","log_path":"~/dev/nebius-hackathon/pilot/v2-P/pipxproject__pipx-680/runs/pilot-pipxproject__pipx-680-183a4a2cf5/logs/agent1/agent1-43.log","tree_digest":null,"tree_download_s":null,"started_at":"2026-10-03T20:21:41.441291Z","duration_s":0.0052060000000000006,"timed_out":false,"image_before":"65fd2305-02d8-4707-aa27-e5ed7220a677","image_after":"5f677bfa-5896-4ad4-8a91-8cfe3a8c42fd","junit":null,"diff":null,"patch_sha256":null,"dropped_paths":[],"snapshot_sha":null}
{"receipt_id":"agent1-44","seq":44,"branch_id":"agent1","kind":"command","cmd":"/opt/receipts-f3b0bf5a783f4b5983ca71dc232ac110/bin/busybox mkdir -p /opt/receipts/reports && python -I /opt/receipts-f3b0bf5a783f4b5983ca71dc232ac110/receipts_pytest.py tests/test_list.py::test_cli tests/test_list.py::test_missing_interpreter tests/test_list.py::test_list_legacy_venv -v -o junit_family=xunit1 -p no:cacheprovider -rA --continue-on-collection-errors --junitxml=/opt/receipts/reports/agent1-44.xml","path":null,"exit_code":1,"stdout_tail":"f-root/pytest-14/test_missing_interpreter0/subdir/pipxhome/venvs/pycowsay/lib/python3.10/site-packages\", \"/tmp/pytest-of-root/pytest-14/session_shareddir0/lib/python3.10/site-packages\"], \"python_version\": \"3.10.19\", \"environment\": {\"implementation_name\": \"cpython\", \"implementation_version\": \"3.10.19\", \"os_name\": \"posix\", \"platform_machine\": \"x86_64\", \"platform_release\": \"7.0.6\", \"platform_system\": \"Linux\", \"platform_version\": \"#1 SMP PREEMPT_DYNAMIC Mon Aug 24 09:29:13 UTC 2026\", \"python_full_version\": \"3.10.19\", \"platform_python_implementation\": \"CPython\", \"python_version\": \"3.10\", \"sys_platform\": \"linux\"}}\nDEBUG    pipx.util:util.py:151 returncode: 0\nINFO     pipx.venv:venv.py:303 get_venv_metadata_for_package: 30ms\nINFO     pipx.package_specifier:package_specifier.py:128 cleaned package spec: pycowsay\nDEBUG    pipx.main:main.py:776 pipx finished.\nDEBUG    pipx.main:main.py:715 2026-10-03 20:21:53\nDEBUG    pipx.main:main.py:716 pipx list\nINFO     pipx.main:main.py:717 pipx version is 0.16.2.0.1.dev0\nINFO     pipx.main:main.py:718 Default python interpreter is '/usr/local/bin/python'\nDEBUG    pipx.main:main.py:776 pipx finished.\nDEBUG    pipx.main:main.py:715 2026-10-03 20:21:54\nDEBUG    pipx.main:main.py:716 pipx list\nINFO     pipx.main:main.py:717 pipx version is 0.16.2.0.1.dev0\nINFO     pipx.main:main.py:718 Default python interpreter is '/usr/local/bin/python'\nDEBUG    pipx.main:main.py:776 pipx finished.\n_________________________ test_list_legacy_venv[None] __________________________\n------------------------------ Captured log call -------------------------------\nDEBUG    pipx.main:main.py:715 2026-10-03 20:21:54\nDEBUG    pipx.main:main.py:716 pipx install pycowsay\nINFO     pipx.main:main.py:717 pipx version is 0.16.2.0.1.dev0\nINFO     pipx.main:main.py:718 Default python interpreter is '/usr/local/bin/python'\nINFO     pipx.util:util.py:56 creating directory /tmp/pytest-of-root/pytest-14/test_list_legacy_venv_None_0/subdir/pipxhome/venvs\nINFO     pipx.util:util.py:56 creating directory /tmp/pytest-of-root/pytest-14/test_list_legacy_venv_None_0/otherdir/pipxbindir\nINFO     pipx.util:util.py:56 creating directory /tmp/pytest-of-root/pytest-14/test_list_legacy_venv_None_0/subdir/pipxhome/.cache\nINFO     pipx.commands.common:common.py:320 Determined package name: pycowsay\nINFO     pipx.commands.common:common.py:321 Package name determined in 0.0s\nINFO     pipx.util:util.py:135 running /usr/local/bin/python -m venv --without-pip /tmp/pytest-of-root/pytest-14/test_list_legacy_venv_None_0/subdir/pipxhome/venvs/pycowsay\nDEBUG    pipx.util:util.py:148 stdout:\nDEBUG    pipx.util:util.py:150 stderr:\nDEBUG    pipx.util:util.py:151 returncode: 0\nINFO     pipx.util:util.py:135 running /tmp/pytest-of-root/pytest-14/test_list_legacy_venv_None_0/subdir/pipxhome/venvs/pycowsay/bin/python -c import sysconfig; print(sysconfig.get_path('purelib'))\nDEBUG    pipx.util:util.py:148 stdout: /tmp/pytest-of-root/pytest-14/test_list_legacy_venv_None_0/subdir/pipxhome/venvs/pycowsay/lib/python3.10/site-packages\nDEBUG    pipx.util:util.py:151 returncode: 0\nINFO     pipx.util:util.py:135 running /tmp/pytest-of-root/pytest-14/session_shareddir0/bin/python -c import sysconfig; print(sysconfig.get_path('purelib'))\nDEBUG    pipx.util:util.py:148 stdout: /tmp/pytest-of-root/pytest-14/session_shareddir0/lib/python3.10/site-packages\nDEBUG    pipx.util:util.py:151 returncode: 0\nINFO     pipx.util:util.py:135 running /tmp/pytest-of-root/pytest-14/test_list_legacy_venv_None_0/subdir/pipxhome/venvs/pycowsay/bin/python --version\nDEBUG    pipx.util:util.py:148 stdout: Python 3.10.19\nDEBUG    pipx.util:util.py:150 stderr:\nDEBUG    pipx.util:util.py:151 returncode: 0\nINFO     pipx.package_specifier:package_specifier.py:128 cleaned package spec: pycowsay\nINFO     pipx.util:util.py:135 running /tmp/pytest-of-root/pytest-14/test_list_legacy_venv_None_0/subdir/pipxhome/venvs/pycowsay/bin/python -m pip install pycowsay\nDEBUG    pipx.util:util.py:151 returncode: 0\nINFO     pipx.util:util.py:135 running <fetch_info_in_venv commands>\nDEBUG    pipx.util:util.py:148 stdout: {\"sys_path\": [\"/usr/local/lib/python310.zip\", \"/usr/local/lib/python3.10\", \"/usr/local/lib/python3.10/lib-dynload\", \"/tmp/pytest-of-root/pytest-14/test_list_legacy_venv_None_0/subdir/pipxhome/venvs/pycowsay/lib/python3.10/site-packages\", \"/tmp/pytest-of-root/pytest-14/session_shareddir0/lib/python3.10/site-packages\"], \"python_version\": \"3.10.19\", \"environment\": {\"implementation_name\": \"cpython\", \"implementation_version\": \"3.10.19\", \"os_name\": \"posix\", \"platform_machine\": \"x86_64\", \"platform_release\": \"7.0.6\", \"platform_system\": \"Linux\", \"platform_version\": \"#1 SMP PREEMPT_DYNAMIC Mon Aug 24 09:29:13 UTC 2026\", \"python_full_version\": \"3.10.19\", \"platform_python_implementation\": \"CPython\", \"python_version\": \"3.10\", \"sys_platform\": \"linux\"}}\nDEBUG    pipx.util:util.py:151 returncode: 0\nINFO     pipx.venv:venv.py:303 get_venv_metadata_for_package: 29ms\nINFO     pipx.package_specifier:package_specifier.py:128 cleaned package spec: pycowsay\nINFO     pipx.shared_libs:shared_libs.py:69 Time since last upgrade of shared libs, in seconds: 1. Upgrade will be run by pipx if greater than 2592000.\nDEBUG    pipx.main:main.py:776 pipx finished.\nDEBUG    pipx.main:main.py:715 2026-10-03 20:21:54\nDEBUG    pipx.main:main.py:716 pipx list\nINFO     pipx.main:main.py:717 pipx version is 0.16.2.0.1.dev0\nINFO     pipx.main:main.py:718 Default python interpreter is '/usr/local/bin/python'\nDEBUG    pipx.main:main.py:776 pipx finished.\n----------- generated xml file: /opt/receipts/reports/agent1-44.xml ------------\n=========================== short test summary info ============================\nPASSED tests/test_list.py::test_cli\nPASSED tests/test_list.py::test_missing_interpreter\nPASSED tests/test_list.py::test_list_legacy_venv[None]\nFAILED tests/test_list.py::test_list_legacy_venv[0.1] - AssertionError: asser...\n========================= 1 failed, 3 passed in 7.77s ==========================\n","stderr_tail":"","stdout_sha256":"90e183dd797fc259e6ffc2220e945491e959aac0d5385608012c2a204782558a","log_path":"~/dev/nebius-hackathon/pilot/v2-P/pipxproject__pipx-680/runs/pilot-pipxproject__pipx-680-183a4a2cf5/logs/agent1/agent1-44.log","tree_digest":"00c0a5157a69aac56d66bc9281097691fd51f197e32284ddc181ad289c8e0777","tree_download_s":2.739482957869768,"started_at":"2026-10-03T20:21:45.373790Z","duration_s":6.206803000000001,"timed_out":false,"image_before":"5f677bfa-5896-4ad4-8a91-8cfe3a8c42fd","image_after":"a6bf9325-cdb9-4174-a5d1-bd6730c63894","junit":{"passed":["tests/test_list.py::test_cli","tests/test_list.py::test_missing_interpreter","tests/test_list.py::test_list_legacy_venv[None]"],"failed":["tests/test_list.py::test_list_legacy_venv[0.1]"],"errors":[],"skipped":[],"collection_errors":[],"failure_text":{"tests/test_list.py::test_list_legacy_venv[0.1]":"[...]ert not run_pipx_cli([\"install\", \"pycowsay\"])\n        mock_legacy_venv(\"pycowsay\", metadata_version=metadata_version)\n    \n        if metadata_version is None:\n            assert run_pipx_cli([\"list\"])\n            captured = capsys.readouterr()\n            assert \"package pycowsay has missing internal pipx metadata\" in captured.err\n        else:\n            assert not run_pipx_cli([\"list\"])\n            captured = capsys.readouterr()\n>           assert \"package pycowsay 0.0.0.1,\" in captured.out\nE           AssertionError: assert 'package pycowsay 0.0.0.1,' in 'creating virtual environment...\\ninstalling pycowsay...\\n  installed package pycowsay 0.0.0.2, Python 3.10.19\\n  These apps are now globally available\\n    - pycowsay\\nvenvs are in /tmp/pytest-of-root/pytest-14/test_list_legacy_venv_0_1_0/subdir/pipxhome/venvs\\napps are exposed on your $PATH at /tmp/pytest-of-root/pytest-14/test_list_legacy_venv_0_1_0/otherdir/pipxbindir\\n   package pycowsay 0.0.0.2, Python 3.10.19\\n    - pycowsay\\n'\nE            +  where 'creating virtual environment...\\ninstalling pycowsay...\\n  installed package pycowsay 0.0.0.2, Python 3.10.19\\n  These apps are now globally available\\n    - pycowsay\\nvenvs are in /tmp/pytest-of-root/pytest-14/test_list_legacy_venv_0_1_0/subdir/pipxhome/venvs\\napps are exposed on your $PATH at /tmp/pytest-of-root/pytest-14/test_list_legacy_venv_0_1_0/otherdir/pipxbindir\\n   package pycowsay 0.0.0.2, Python 3.10.19\\n    - pycowsay\\n' = CaptureResult(out='creating virtual environment...\\ninstalling pycowsay...\\n  installed package pycowsay 0.0.0.2, Python 3.10.19\\n  These apps are now globally available\\n    - pycowsay\\nvenvs are in /tmp/pytest-of-root/pytest-14/test_list_legacy_venv_0_1_0/subdir/pipxhome/venvs\\napps are exposed on your $PATH at /tmp/pytest-of-root/pytest-14/test_list_legacy_venv_0_1_0/otherdir/pipxbindir\\n   package pycowsay 0.0.0.2, Python 3.10.19\\n    - pycowsay\\n', err='done! ✨ #x1F31F ✨\\n').out\n\ntests/test_list.py:60: AssertionError"}},"diff":null,"patch_sha256":null,"dropped_paths":[],"snapshot_sha":null}
{"receipt_id":"agent1-45","seq":45,"branch_id":"agent1","kind":"command","cmd":"/opt/receipts-9d881f75d93c46a086dda9c335ca0fec/bin/busybox mkdir -p /opt/receipts/reports && python -I /opt/receipts-9d881f75d93c46a086dda9c335ca0fec/receipts_pytest.py tests/test_list.py::test_list_json -v -o junit_family=xunit1 -p no:cacheprovider -rA --continue-on-collection-errors --junitxml=/opt/receipts/reports/agent1-45.xml","path":null,"exit_code":0,"stdout_tail":"s\", \"/tmp/pytest-of-root/pytest-15/session_shareddir0/lib/python3.10/site-packages\"], \"python_version\": \"3.10.19\", \"environment\": {\"implementation_name\": \"cpython\", \"implementation_version\": \"3.10.19\", \"os_name\": \"posix\", \"platform_machine\": \"x86_64\", \"platform_release\": \"7.0.6\", \"platform_system\": \"Linux\", \"platform_version\": \"#1 SMP PREEMPT_DYNAMIC Mon Aug 24 09:29:13 UTC 2026\", \"python_full_version\": \"3.10.19\", \"platform_python_implementation\": \"CPython\", \"python_version\": \"3.10\", \"sys_platform\": \"linux\"}}\nDEBUG    pipx.util:util.py:151 returncode: 0\nINFO     pipx.venv:venv.py:303 get_venv_metadata_for_package: 27ms\nINFO     pipx.package_specifier:package_specifier.py:128 cleaned package spec: pycowsay==0.0.0.1\nDEBUG    pipx.main:main.py:776 pipx finished.\nDEBUG    pipx.main:main.py:715 2026-10-03 20:22:14\nDEBUG    pipx.main:main.py:716 pipx install pylint==2.3.1\nINFO     pipx.main:main.py:717 pipx version is 0.16.2.0.1.dev0\nINFO     pipx.main:main.py:718 Default python interpreter is '/usr/local/bin/python'\nINFO     pipx.commands.common:common.py:320 Determined package name: pylint\nINFO     pipx.commands.common:common.py:321 Package name determined in 0.0s\nINFO     pipx.util:util.py:135 running /usr/local/bin/python -m venv --without-pip /tmp/pytest-of-root/pytest-15/test_list_json0/subdir/pipxhome/venvs/pylint\nDEBUG    pipx.util:util.py:148 stdout:\nDEBUG    pipx.util:util.py:150 stderr:\nDEBUG    pipx.util:util.py:151 returncode: 0\nINFO     pipx.util:util.py:135 running /tmp/pytest-of-root/pytest-15/test_list_json0/subdir/pipxhome/venvs/pylint/bin/python -c import sysconfig; print(sysconfig.get_path('purelib'))\nDEBUG    pipx.util:util.py:148 stdout: /tmp/pytest-of-root/pytest-15/test_list_json0/subdir/pipxhome/venvs/pylint/lib/python3.10/site-packages\nDEBUG    pipx.util:util.py:151 returncode: 0\nINFO     pipx.util:util.py:135 running /tmp/pytest-of-root/pytest-15/test_list_json0/subdir/pipxhome/venvs/pylint/bin/python --version\nDEBUG    pipx.util:util.py:148 stdout: Python 3.10.19\nDEBUG    pipx.util:util.py:150 stderr:\nDEBUG    pipx.util:util.py:151 returncode: 0\nINFO     pipx.package_specifier:package_specifier.py:128 cleaned package spec: pylint==2.3.1\nINFO     pipx.util:util.py:135 running /tmp/pytest-of-root/pytest-15/test_list_json0/subdir/pipxhome/venvs/pylint/bin/python -m pip install pylint==2.3.1\nDEBUG    pipx.util:util.py:151 returncode: 0\nINFO     pipx.util:util.py:135 running <fetch_info_in_venv commands>\nDEBUG    pipx.util:util.py:148 stdout: {\"sys_path\": [\"/usr/local/lib/python310.zip\", \"/usr/local/lib/python3.10\", \"/usr/local/lib/python3.10/lib-dynload\", \"/tmp/pytest-of-root/pytest-15/test_list_json0/subdir/pipxhome/venvs/pylint/lib/python3.10/site-packages\", \"/tmp/pytest-of-root/pytest-15/session_shareddir0/lib/python3.10/site-packages\"], \"python_version\": \"3.10.19\", \"environment\": {\"implementation_name\": \"cpython\", \"implementation_version\": \"3.10.19\", \"os_name\": \"posix\", \"platform_machine\": \"x86_64\", \"platform_release\": \"7.0.6\", \"platform_system\": \"Linux\", \"platform_version\": \"#1 SMP PREEMPT_DYNAMIC Mon Aug 24 09:29:13 UTC 2026\", \"python_full_version\": \"3.10.19\", \"platform_python_implementation\": \"CPython\", \"python_version\": \"3.10\", \"sys_platform\": \"linux\"}}\nDEBUG    pipx.util:util.py:151 returncode: 0\nINFO     pipx.venv:venv.py:303 get_venv_metadata_for_package: 83ms\nINFO     pipx.package_specifier:package_specifier.py:128 cleaned package spec: pylint==2.3.1\nDEBUG    pipx.main:main.py:776 pipx finished.\nDEBUG    pipx.main:main.py:715 2026-10-03 20:22:16\nDEBUG    pipx.main:main.py:716 pipx inject pylint isort==5.6.4\nINFO     pipx.main:main.py:717 pipx version is 0.16.2.0.1.dev0\nINFO     pipx.main:main.py:718 Default python interpreter is '/usr/local/bin/python'\nINFO     pipx.main:main.py:168 Virtual Environment location is /tmp/pytest-of-root/pytest-15/test_list_json0/subdir/pipxhome/venvs/pylint\nINFO     pipx.commands.common:common.py:320 Determined package name: isort\nINFO     pipx.commands.common:common.py:321 Package name determined in 0.0s\nINFO     pipx.package_specifier:package_specifier.py:128 cleaned package spec: isort==5.6.4\nINFO     pipx.util:util.py:135 running /tmp/pytest-of-root/pytest-15/test_list_json0/subdir/pipxhome/venvs/pylint/bin/python -m pip install isort==5.6.4\nDEBUG    pipx.util:util.py:151 returncode: 0\nINFO     pipx.util:util.py:135 running <fetch_info_in_venv commands>\nDEBUG    pipx.util:util.py:148 stdout: {\"sys_path\": [\"/usr/local/lib/python310.zip\", \"/usr/local/lib/python3.10\", \"/usr/local/lib/python3.10/lib-dynload\", \"/tmp/pytest-of-root/pytest-15/test_list_json0/subdir/pipxhome/venvs/pylint/lib/python3.10/site-packages\", \"/tmp/pytest-of-root/pytest-15/session_shareddir0/lib/python3.10/site-packages\"], \"python_version\": \"3.10.19\", \"environment\": {\"implementation_name\": \"cpython\", \"implementation_version\": \"3.10.19\", \"os_name\": \"posix\", \"platform_machine\": \"x86_64\", \"platform_release\": \"7.0.6\", \"platform_system\": \"Linux\", \"platform_version\": \"#1 SMP PREEMPT_DYNAMIC Mon Aug 24 09:29:13 UTC 2026\", \"python_full_version\": \"3.10.19\", \"platform_python_implementation\": \"CPython\", \"python_version\": \"3.10\", \"sys_platform\": \"linux\"}}\nDEBUG    pipx.util:util.py:151 returncode: 0\nINFO     pipx.venv:venv.py:303 get_venv_metadata_for_package: 33ms\nINFO     pipx.package_specifier:package_specifier.py:128 cleaned package spec: isort==5.6.4\nDEBUG    pipx.main:main.py:776 pipx finished.\nDEBUG    pipx.main:main.py:715 2026-10-03 20:22:16\nDEBUG    pipx.main:main.py:716 pipx list --json\nINFO     pipx.main:main.py:717 pipx version is 0.16.2.0.1.dev0\nINFO     pipx.main:main.py:718 Default python interpreter is '/usr/local/bin/python'\nDEBUG    pipx.main:main.py:776 pipx finished.\n----------- generated xml file: /opt/receipts/reports/agent1-45.xml ------------\n=========================== short test summary info ============================\nPASSED tests/test_list.py::test_list_json\n============================== 1 passed in 9.08s ===============================\n","stderr_tail":"","stdout_sha256":"f40e4ea186c7ab4b597118218a77682f5dfefeefa6159c2b2805c77c70959f65","log_path":"~/dev/nebius-hackathon/pilot/v2-P/pipxproject__pipx-680/runs/pilot-pipxproject__pipx-680-183a4a2cf5/logs/agent1/agent1-45.log","tree_digest":"00c0a5157a69aac56d66bc9281097691fd51f197e32284ddc181ad289c8e0777","tree_download_s":2.808310959022492,"started_at":"2026-10-03T20:22:06.332857Z","duration_s":7.072292,"timed_out":false,"image_before":"a6bf9325-cdb9-4174-a5d1-bd6730c63894","image_after":"014aac7e-6e76-432f-a5e0-80ed34366b66","junit":{"passed":["tests/test_list.py::test_list_json"],"failed":[],"errors":[],"skipped":[],"collection_errors":[],"failure_text":{}},"diff":null,"patch_sha256":null,"dropped_paths":[],"snapshot_sha":null}
{"receipt_id":"agent1-46","seq":46,"branch_id":"agent1","kind":"command","cmd":"/opt/receipts-bdf37ef3d58d4c25bbb2a5904b24a891/bin/busybox mkdir -p /opt/receipts/reports && python -I /opt/receipts-bdf37ef3d58d4c25bbb2a5904b24a891/receipts_pytest.py 'tests/test_list.py::test_list_legacy_venv[0.1]' -v -s -o junit_family=xunit1 -p no:cacheprovider -rA --continue-on-collection-errors --junitxml=/opt/receipts/reports/agent1-46.xml","path":null,"exit_code":1,"stdout_tail":".19\\n    - pycowsay\\n'\nE            +  where 'creating virtual environment...\\ncreating shared libraries...\\nupgrading shared libraries...\\ninstalling pycowsay...\\n  installed package pycowsay 0.0.0.2, Python 3.10.19\\n  These apps are now globally available\\n    - pycowsay\\nvenvs are in /tmp/pytest-of-root/pytest-16/test_list_legacy_venv_0_1_0/subdir/pipxhome/venvs\\napps are exposed on your $PATH at /tmp/pytest-of-root/pytest-16/test_list_legacy_venv_0_1_0/otherdir/pipxbindir\\n   package pycowsay 0.0.0.2, Python 3.10.19\\n    - pycowsay\\n' = CaptureResult(out='creating virtual environment...\\ncreating shared libraries...\\nupgrading shared libraries...\\ninstalling pycowsay...\\n  installed package pycowsay 0.0.0.2, Python 3.10.19\\n  These apps are now globally available\\n    - pycowsay\\nvenvs are in /tmp/pytest-of-root/pytest-16/test_list_legacy_venv_0_1_0/subdir/pipxhome/venvs\\napps are exposed on your $PATH at /tmp/pytest-of-root/pytest-16/test_list_legacy_venv_0_1_0/otherdir/pipxbindir\\n   package pycowsay 0.0.0.2, Python 3.10.19\\n    - pycowsay\\n', err='done! ✨ 🌟 ✨\\n').out\n\ntests/test_list.py:60: AssertionError\n------------------------------ Captured log call -------------------------------\nDEBUG    pipx.main:main.py:715 2026-10-03 20:22:29\nDEBUG    pipx.main:main.py:716 pipx install pycowsay\nINFO     pipx.main:main.py:717 pipx version is 0.16.2.0.1.dev0\nINFO     pipx.main:main.py:718 Default python interpreter is '/usr/local/bin/python'\nINFO     pipx.util:util.py:56 creating directory /tmp/pytest-of-root/pytest-16/test_list_legacy_venv_0_1_0/subdir/pipxhome/venvs\nINFO     pipx.util:util.py:56 creating directory /tmp/pytest-of-root/pytest-16/test_list_legacy_venv_0_1_0/otherdir/pipxbindir\nINFO     pipx.util:util.py:56 creating directory /tmp/pytest-of-root/pytest-16/test_list_legacy_venv_0_1_0/subdir/pipxhome/.cache\nINFO     pipx.commands.common:common.py:320 Determined package name: pycowsay\nINFO     pipx.commands.common:common.py:321 Package name determined in 0.0s\nINFO     pipx.util:util.py:135 running /usr/local/bin/python -m venv --without-pip /tmp/pytest-of-root/pytest-16/test_list_legacy_venv_0_1_0/subdir/pipxhome/venvs/pycowsay\nDEBUG    pipx.util:util.py:148 stdout:\nDEBUG    pipx.util:util.py:150 stderr:\nDEBUG    pipx.util:util.py:151 returncode: 0\nINFO     pipx.util:util.py:135 running /usr/local/bin/python -m venv --clear /tmp/pytest-of-root/pytest-16/session_shareddir0\nDEBUG    pipx.util:util.py:148 stdout:\nDEBUG    pipx.util:util.py:150 stderr:\nDEBUG    pipx.util:util.py:151 returncode: 0\nINFO     pipx.shared_libs:shared_libs.py:91 Upgrading shared libraries in /tmp/pytest-of-root/pytest-16/session_shareddir0\nINFO     pipx.util:util.py:135 running /tmp/pytest-of-root/pytest-16/session_shareddir0/bin/python -m pip --disable-pip-version-check install --force-reinstall -q --upgrade pip setuptools wheel\nDEBUG    pipx.util:util.py:148 stdout:\nDEBUG    pipx.util:util.py:150 stderr:\nDEBUG    pipx.util:util.py:151 returncode: 0\nINFO     pipx.util:util.py:135 running /tmp/pytest-of-root/pytest-16/test_list_legacy_venv_0_1_0/subdir/pipxhome/venvs/pycowsay/bin/python -c import sysconfig; print(sysconfig.get_path('purelib'))\nDEBUG    pipx.util:util.py:148 stdout: /tmp/pytest-of-root/pytest-16/test_list_legacy_venv_0_1_0/subdir/pipxhome/venvs/pycowsay/lib/python3.10/site-packages\nDEBUG    pipx.util:util.py:151 returncode: 0\nINFO     pipx.util:util.py:135 running /tmp/pytest-of-root/pytest-16/session_shareddir0/bin/python -c import sysconfig; print(sysconfig.get_path('purelib'))\nDEBUG    pipx.util:util.py:148 stdout: /tmp/pytest-of-root/pytest-16/session_shareddir0/lib/python3.10/site-packages\nDEBUG    pipx.util:util.py:151 returncode: 0\nINFO     pipx.util:util.py:135 running /tmp/pytest-of-root/pytest-16/test_list_legacy_venv_0_1_0/subdir/pipxhome/venvs/pycowsay/bin/python --version\nDEBUG    pipx.util:util.py:148 stdout: Python 3.10.19\nDEBUG    pipx.util:util.py:150 stderr:\nDEBUG    pipx.util:util.py:151 returncode: 0\nINFO     pipx.package_specifier:package_specifier.py:128 cleaned package spec: pycowsay\nINFO     pipx.util:util.py:135 running /tmp/pytest-of-root/pytest-16/test_list_legacy_venv_0_1_0/subdir/pipxhome/venvs/pycowsay/bin/python -m pip install pycowsay\nDEBUG    pipx.util:util.py:151 returncode: 0\nINFO     pipx.util:util.py:135 running <fetch_info_in_venv commands>\nDEBUG    pipx.util:util.py:148 stdout: {\"sys_path\": [\"/usr/local/lib/python310.zip\", \"/usr/local/lib/python3.10\", \"/usr/local/lib/python3.10/lib-dynload\", \"/tmp/pytest-of-root/pytest-16/test_list_legacy_venv_0_1_0/subdir/pipxhome/venvs/pycowsay/lib/python3.10/site-packages\", \"/tmp/pytest-of-root/pytest-16/session_shareddir0/lib/python3.10/site-packages\"], \"python_version\": \"3.10.19\", \"environment\": {\"implementation_name\": \"cpython\", \"implementation_version\": \"3.10.19\", \"os_name\": \"posix\", \"platform_machine\": \"x86_64\", \"platform_release\": \"7.0.6\", \"platform_system\": \"Linux\", \"platform_version\": \"#1 SMP PREEMPT_DYNAMIC Mon Aug 24 09:29:13 UTC 2026\", \"python_full_version\": \"3.10.19\", \"platform_python_implementation\": \"CPython\", \"python_version\": \"3.10\", \"sys_platform\": \"linux\"}}\nDEBUG    pipx.util:util.py:151 returncode: 0\nINFO     pipx.venv:venv.py:303 get_venv_metadata_for_package: 26ms\nINFO     pipx.package_specifier:package_specifier.py:128 cleaned package spec: pycowsay\nDEBUG    pipx.main:main.py:776 pipx finished.\nDEBUG    pipx.main:main.py:715 2026-10-03 20:22:36\nDEBUG    pipx.main:main.py:716 pipx list\nINFO     pipx.main:main.py:717 pipx version is 0.16.2.0.1.dev0\nINFO     pipx.main:main.py:718 Default python interpreter is '/usr/local/bin/python'\nDEBUG    pipx.main:main.py:776 pipx finished.\n----------- generated xml file: /opt/receipts/reports/agent1-46.xml ------------\n=========================== short test summary info ============================\nFAILED tests/test_list.py::test_list_legacy_venv[0.1] - AssertionError: asser...\n============================== 1 failed in 6.30s ===============================\n","stderr_tail":"","stdout_sha256":"5c592910636e42baf8475d2030693b3e4f92da4caec69b5aed78c6ed1e2cbbcc","log_path":"~/dev/nebius-hackathon/pilot/v2-P/pipxproject__pipx-680/runs/pilot-pipxproject__pipx-680-183a4a2cf5/logs/agent1/agent1-46.log","tree_digest":"00c0a5157a69aac56d66bc9281097691fd51f197e32284ddc181ad289c8e0777","tree_download_s":2.769438457908109,"started_at":"2026-10-03T20:22:28.487125Z","duration_s":5.293672,"timed_out":false,"image_before":"014aac7e-6e76-432f-a5e0-80ed34366b66","image_after":"7c9e35db-1970-4ac0-8af6-8eb8b7634de6","junit":{"passed":[],"failed":["tests/test_list.py::test_list_legacy_venv[0.1]"],"errors":[],"skipped":[],"collection_errors":[],"failure_text":{"tests/test_list.py::test_list_legacy_venv[0.1]":"[...]pipx_cli([\"list\"])\n            captured = capsys.readouterr()\n            assert \"package pycowsay has missing internal pipx metadata\" in captured.err\n        else:\n            assert not run_pipx_cli([\"list\"])\n            captured = capsys.readouterr()\n>           assert \"package pycowsay 0.0.0.1,\" in captured.out\nE           AssertionError: assert 'package pycowsay 0.0.0.1,' in 'creating virtual environment...\\ncreating shared libraries...\\nupgrading shared libraries...\\ninstalling pycowsay...\\n  installed package pycowsay 0.0.0.2, Python 3.10.19\\n  These apps are now globally available\\n    - pycowsay\\nvenvs are in /tmp/pytest-of-root/pytest-16/test_list_legacy_venv_0_1_0/subdir/pipxhome/venvs\\napps are exposed on your $PATH at /tmp/pytest-of-root/pytest-16/test_list_legacy_venv_0_1_0/otherdir/pipxbindir\\n   package pycowsay 0.0.0.2, Python 3.10.19\\n    - pycowsay\\n'\nE            +  where 'creating virtual environment...\\ncreating shared libraries...\\nupgrading shared libraries...\\ninstalling pycowsay...\\n  installed package pycowsay 0.0.0.2, Python 3.10.19\\n  These apps are now globally available\\n    - pycowsay\\nvenvs are in /tmp/pytest-of-root/pytest-16/test_list_legacy_venv_0_1_0/subdir/pipxhome/venvs\\napps are exposed on your $PATH at /tmp/pytest-of-root/pytest-16/test_list_legacy_venv_0_1_0/otherdir/pipxbindir\\n   package pycowsay 0.0.0.2, Python 3.10.19\\n    - pycowsay\\n' = CaptureResult(out='creating virtual environment...\\ncreating shared libraries...\\nupgrading shared libraries...\\ninstalling pycowsay...\\n  installed package pycowsay 0.0.0.2, Python 3.10.19\\n  These apps are now globally available\\n    - pycowsay\\nvenvs are in /tmp/pytest-of-root/pytest-16/test_list_legacy_venv_0_1_0/subdir/pipxhome/venvs\\napps are exposed on your $PATH at /tmp/pytest-of-root/pytest-16/test_list_legacy_venv_0_1_0/otherdir/pipxbindir\\n   package pycowsay 0.0.0.2, Python 3.10.19\\n    - pycowsay\\n', err='done! ✨ #x1F31F ✨\\n').out\n\ntests/test_list.py:60: AssertionError"}},"diff":null,"patch_sha256":null,"dropped_paths":[],"snapshot_sha":null}
{"receipt_id":"agent1-47","seq":47,"branch_id":"agent1","kind":"command","cmd":"find /pipx -name \"*package*\" -type f","path":null,"exit_code":0,"stdout_tail":"/pipx/.github/workflows/test_all_packages_slow.yml\n/pipx/src/pipx/commands/list_packages.py\n/pipx/src/pipx/package_specifier.py\n/pipx/tests/package_info.py\n/pipx/tests/test_install_all_packages.py\n/pipx/tests/test_package_specifier.py\n","stderr_tail":"","stdout_sha256":"6cc290ef2905f863dd23b9583d2f5109088f3b00fd5fd7706fb10ce5d9a075e5","log_path":"~/dev/nebius-hackathon/pilot/v2-P/pipxproject__pipx-680/runs/pilot-pipxproject__pipx-680-183a4a2cf5/logs/agent1/agent1-47.log","tree_digest":null,"tree_download_s":null,"started_at":"2026-10-03T20:23:00.546357Z","duration_s":0.004471,"timed_out":false,"image_before":"7c9e35db-1970-4ac0-8af6-8eb8b7634de6","image_after":"646aaf30-115b-4164-9b44-8736bdcc1662","junit":null,"diff":null,"patch_sha256":null,"dropped_paths":[],"snapshot_sha":null}
{"receipt_id":"agent1-48","seq":48,"branch_id":"agent1","kind":"diff","cmd":"compute patch in executor staging agent1-5f4d6ada95fd4038ae8340e329cc4fc6: /opt/homebrew/Cellar/git/2.53.0/bin/git -c core.hooksPath=/dev/null -c core.attributesFile=/dev/null -c diff.external= -c core.quotePath=false add -A && /opt/homebrew/Cellar/git/2.53.0/bin/git -c core.hooksPath=/dev/null -c core.attributesFile=/dev/null -c diff.external= -c core.quotePath=false diff --cached --binary --no-ext-diff --no-textconv --no-renames 867a66128ae8231fba442db754303c7add219b94","path":null,"exit_code":0,"stdout_tail":"diff --git a/src/pipx/commands/list_packages.py b/src/pipx/commands/list_packages.py\nindex 1b72631..d7bc211 100644\n--- a/src/pipx/commands/list_packages.py\n+++ b/src/pipx/commands/list_packages.py\n@@ -30,14 +30,21 @@ def list_text(\n     print(f\"venvs are in {bold(venv_root_dir)}\")\n     print(f\"apps are exposed on your $PATH at {bold(str(constants.LOCAL_BIN_DIR))}\")\n \n+    warning_messages = []\n     all_venv_problems = VenvProblems()\n     for venv_dir in venv_dirs:\n         package_summary, venv_problems = get_venv_summary(\n             venv_dir, include_injected=include_injected\n         )\n-        print(package_summary)\n+        if venv_problems.any_():\n+            warning_messages.append(package_summary)\n+        else:\n+            print(package_summary)\n         all_venv_problems.or_(venv_problems)\n \n+    for warning_message in warning_messages:\n+        print(warning_message, file=sys.stderr)\n+\n     return all_venv_problems\n \n \n@@ -75,7 +82,7 @@ def list_packages(\n     \"\"\"Returns pipx exit code.\"\"\"\n     venv_dirs: Collection[Path] = sorted(venv_container.iter_venv_dirs())\n     if not venv_dirs:\n-        print(f\"nothing has been installed with pipx {sleep}\")\n+        print(f\"nothing has been installed with pipx {sleep}\", file=sys.stderr)\n         return EXIT_CODE_OK\n \n     venv_container.verify_shared_libs()\n@@ -89,27 +96,31 @@ def list_packages(\n         print(\n             \"\\nOne or more packages contain out-of-date internal data installed from a\\n\"\n             \"previous pipx version and need to be updated.\\n\"\n-            \"    To fix, execute: pipx reinstall-all\"\n+            \"    To fix, execute: pipx reinstall-all\",\n+            file=sys.stderr,\n         )\n     if all_venv_problems.invalid_interpreter:\n         print(\n             \"\\nOne or more packages have a missing python interpreter.\\n\"\n-            \"    To fix, execute: pipx reinstall-all\"\n+            \"    To fix, execute: pipx reinstall-all\",\n+            file=sys.stderr,\n         )\n     if all_venv_problems.missing_metadata:\n         print(\n             \"\\nOne or more packages have a missing internal pipx metadata.\\n\"\n             \"   They were likely installed using a pipx version before 0.15.0.0.\\n\"\n-            \"   Please uninstall and install these package(s) to fix.\"\n+            \"   Please uninstall and install these package(s) to fix.\",\n+            file=sys.stderr,\n         )\n     if all_venv_problems.not_installed:\n         print(\n             \"\\nOne or more packages are not installed properly.\\n\"\n-            \"   Please uninstall and install these package(s) to fix.\"\n+            \"   Please uninstall and install these package(s) to fix.\",\n+            file=sys.stderr,\n         )\n \n     if all_venv_problems.any_():\n-        print()\n+        print(file=sys.stderr)\n         return EXIT_CODE_LIST_PROBLEM\n \n     return EXIT_CODE_OK\n","stderr_tail":"","stdout_sha256":"a0caef09e3ebb24eef2f502b2c80c4d8402449c5dd2e46084f121e0e02cfb7c0","log_path":null,"tree_digest":"00c0a5157a69aac56d66bc9281097691fd51f197e32284ddc181ad289c8e0777","tree_download_s":2.238149540964514,"started_at":"2026-10-03T20:23:12.746672Z","duration_s":0.05297620897181332,"timed_out":false,"image_before":"646aaf30-115b-4164-9b44-8736bdcc1662","image_after":"646aaf30-115b-4164-9b44-8736bdcc1662","junit":null,"diff":{"files":[{"path":"src/pipx/commands/list_packages.py","added":18,"deleted":7,"category":"source","status":"modified"}],"patch_sha256":"a0caef09e3ebb24eef2f502b2c80c4d8402449c5dd2e46084f121e0e02cfb7c0","patch_path":"~/dev/nebius-hackathon/pilot/v2-P/pipxproject__pipx-680/runs/pilot-pipxproject__pipx-680-183a4a2cf5/artifacts/agent1/agent1-48.patch"},"patch_sha256":"a0caef09e3ebb24eef2f502b2c80c4d8402449c5dd2e46084f121e0e02cfb7c0","dropped_paths":[],"snapshot_sha":"867a66128ae8231fba442db754303c7add219b94"}
