{"receipt_id":"agent1-1","seq":1,"branch_id":"agent1","kind":"command","cmd":"git ls-files -z","path":null,"exit_code":0,"stdout_tail":"log_likelihoods.py\u0000pints/_log_pdfs.py\u0000pints/_log_priors.py\u0000pints/_logger.py\u0000pints/_mcmc/__init__.py\u0000pints/_mcmc/_adaptive_covariance.py\u0000pints/_mcmc/_differential_evolution.py\u0000pints/_mcmc/_dram_ac.py\u0000pints/_mcmc/_dream.py\u0000pints/_mcmc/_dual_averaging.py\u0000pints/_mcmc/_emcee_hammer.py\u0000pints/_mcmc/_haario_ac.py\u0000pints/_mcmc/_haario_bardenet_ac.py\u0000pints/_mcmc/_hamiltonian.py\u0000pints/_mcmc/_mala.py\u0000pints/_mcmc/_metropolis.py\u0000pints/_mcmc/_monomial_gamma_hamiltonian.py\u0000pints/_mcmc/_nuts.py\u0000pints/_mcmc/_population.py\u0000pints/_mcmc/_rao_blackwell_ac.py\u0000pints/_mcmc/_relativistic.py\u0000pints/_mcmc/_slice_doubling.py\u0000pints/_mcmc/_slice_rank_shrinking.py\u0000pints/_mcmc/_slice_stepout.py\u0000pints/_mcmc/_summary.py\u0000pints/_nested/__init__.py\u0000pints/_nested/_ellipsoid.py\u0000pints/_nested/_rejection.py\u0000pints/_optimisers/__init__.py\u0000pints/_optimisers/_cmaes.py\u0000pints/_optimisers/_cmaes_bare.py\u0000pints/_optimisers/_gradient_descent.py\u0000pints/_optimisers/_nelder_mead.py\u0000pints/_optimisers/_pso.py\u0000pints/_optimisers/_snes.py\u0000pints/_optimisers/_xnes.py\u0000pints/_sample_initial_points.py\u0000pints/_transformation.py\u0000pints/_util.py\u0000pints/interfaces/__init__.py\u0000pints/interfaces/stan/__init__.py\u0000pints/interfaces/stan/_stan.py\u0000pints/io.py\u0000pints/noise.py\u0000pints/plot/__init__.py\u0000pints/plot/_autocorrelation.py\u0000pints/plot/_function.py\u0000pints/plot/_function_between_points.py\u0000pints/plot/_histogram.py\u0000pints/plot/_pairwise.py\u0000pints/plot/_series.py\u0000pints/plot/_surface.py\u0000pints/plot/_trace.py\u0000pints/residuals_diagnostics.py\u0000pints/tests/shared.py\u0000pints/tests/test_abc_controller.py\u0000pints/tests/test_abc_rejection.py\u0000pints/tests/test_boundaries.py\u0000pints/tests/test_diagnostics.py\u0000pints/tests/test_dual_averaging.py\u0000pints/tests/test_error_measures.py\u0000pints/tests/test_evaluators.py\u0000pints/tests/test_interfaces_stan.py\u0000pints/tests/test_io.py\u0000pints/tests/test_log_likelihoods.py\u0000pints/tests/test_log_pdfs.py\u0000pints/tests/test_log_priors.py\u0000pints/tests/test_logger.py\u0000pints/tests/test_matrix2d.py\u0000pints/tests/test_mcmc_adaptive.py\u0000pints/tests/test_mcmc_controller.py\u0000pints/tests/test_mcmc_differential_evolution.py\u0000pints/tests/test_mcmc_dram_ac.py\u0000pints/tests/test_mcmc_dream.py\u0000pints/tests/test_mcmc_emcee_hammer.py\u0000pints/tests/test_mcmc_haario_ac.py\u0000pints/tests/test_mcmc_haario_bardenet_ac.py\u0000pints/tests/test_mcmc_hamiltonian.py\u0000pints/tests/test_mcmc_mala.py\u0000pints/tests/test_mcmc_metropolis.py\u0000pints/tests/test_mcmc_monomial_gamma_hmc.py\u0000pints/tests/test_mcmc_nuts.py\u0000pints/tests/test_mcmc_population.py\u0000pints/tests/test_mcmc_rao_blackwell_ac.py\u0000pints/tests/test_mcmc_relativistic.py\u0000pints/tests/test_mcmc_slice_doubling.py\u0000pints/tests/test_mcmc_slice_rank_shrinking.py\u0000pints/tests/test_mcmc_slice_stepout.py\u0000pints/tests/test_mcmc_summary.py\u0000pints/tests/test_multi_output_problem.py\u0000pints/tests/test_nested_controller.py\u0000pints/tests/test_nested_ellipsoid_sampler.py\u0000pints/tests/test_nested_rejection_sampler.py\u0000pints/tests/test_noise.py\u0000pints/tests/test_opt_cmaes.py\u0000pints/tests/test_opt_cmaes_bare.py\u0000pints/tests/test_opt_easy_optimisation.py\u0000pints/tests/test_opt_gradient_descent.py\u0000pints/tests/test_opt_nelder_mead.py\u0000pints/tests/test_opt_optimisation_controller.py\u0000pints/tests/test_opt_pso.py\u0000pints/tests/test_opt_snes.py\u0000pints/tests/test_opt_xnes.py\u0000pints/tests/test_plot.py\u0000pints/tests/test_residuals_diagnostics.py\u0000pints/tests/test_sample_initial_points.py\u0000pints/tests/test_single_output_problem.py\u0000pints/tests/test_test_shared.py\u0000pints/tests/test_timer.py\u0000pints/tests/test_toy_annulus_logpdf.py\u0000pints/tests/test_toy_br_ap_model.py\u0000pints/tests/test_toy_classes.py\u0000pints/tests/test_toy_cone_logpdf.py\u0000pints/tests/test_toy_constant_model.py\u0000pints/tests/test_toy_eight_schools_logpdf.py\u0000pints/tests/test_toy_fitzhugh_nagumo_model.py\u0000pints/tests/test_toy_gaussian_logpdf.py\u0000pints/tests/test_toy_german_credit_hierarchical_logpdf.py\u0000pints/tests/test_toy_german_credit_logpdf.py\u0000pints/tests/test_toy_goodwin_oscillator_model.py\u0000pints/tests/test_toy_hes1_michaelis_menten_model.py\u0000pints/tests/test_toy_hh_ik_model.py\u0000pints/tests/test_toy_high_dimensional_gaussian_logpdf.py\u0000pints/tests/test_toy_logistic_model.py\u0000pints/tests/test_toy_lotka_volterra_model.py\u0000pints/tests/test_toy_markov_jump_model.py\u0000pints/tests/test_toy_multimodal_gaussian_logpdf.py\u0000pints/tests/test_toy_neals_funnel_logpdf.py\u0000pints/tests/test_toy_parabolic_error.py\u0000pints/tests/test_toy_repressilator.py\u0000pints/tests/test_toy_rosenbrock.py\u0000pints/tests/test_toy_sho_model.py\u0000pints/tests/test_toy_simple_egg_box_logpdf.py\u0000pints/tests/test_toy_sir_model.py\u0000pints/tests/test_toy_stochastic_degradation_model.py\u0000pints/tests/test_toy_stochastic_logistic_model.py\u0000pints/tests/test_toy_stochastic_michaelis_menten_model.py\u0000pints/tests/test_toy_stochastic_production_degradation_model.py\u0000pints/tests/test_toy_stochastic_schlogl_model.py\u0000pints/tests/test_toy_twisted_gaussian_logpdf.py\u0000pints/tests/test_transformation.py\u0000pints/tests/test_vector.py\u0000pints/tests/test_version.py\u0000pints/toy/__init__.py\u0000pints/toy/_annulus.py\u0000pints/toy/_beeler_reuter_model.py\u0000pints/toy/_cone.py\u0000pints/toy/_constant_model.py\u0000pints/toy/_eight_schools.py\u0000pints/toy/_fitzhugh_nagumo_model.py\u0000pints/toy/_gaussian.py\u0000pints/toy/_german_credit.py\u0000pints/toy/_german_credit_hierarchical.py\u0000pints/toy/_goodwin_oscillator_model.py\u0000pints/toy/_hes1_michaelis_menten.py\u0000pints/toy/_hh_ik_model.py\u0000pints/toy/_high_dimensional_gaussian.py\u0000pints/toy/_logistic_model.py\u0000pints/toy/_lotka_volterra_model.py\u0000pints/toy/_multimodal_gaussian.py\u0000pints/toy/_neals_funnel.py\u0000pints/toy/_parabola.py\u0000pints/toy/_repressilator_model.py\u0000pints/toy/_rosenbrock.py\u0000pints/toy/_sho_model.py\u0000pints/toy/_simple_egg_box.py\u0000pints/toy/_sir_model.py\u0000pints/toy/_toy_classes.py\u0000pints/toy/_twisted_gaussian_banana.py\u0000pints/toy/stochastic/__init__.py\u0000pints/toy/stochastic/_degradation_model.py\u0000pints/toy/stochastic/_logistic_model.py\u0000pints/toy/stochastic/_markov_jump_model.py\u0000pints/toy/stochastic/_michaelis_menten_model.py\u0000pints/toy/stochastic/_production_degradation_model.py\u0000pints/toy/stochastic/_schlogl_model.py\u0000pints/version\u0000postBuild\u0000run-tests.py\u0000setup.py\u0000","stderr_tail":"","stdout_sha256":"83548e44a0c404a4328548dd4f0874d561ce69448ae0ade0083851338807cae9","log_path":"~/dev/nebius-hackathon/pilot/v2-P/pints-team__pints-1444/runs/pilot-pints-team__pints-1444-190773ed22/logs/agent1/agent1-1.log","tree_digest":null,"tree_download_s":null,"started_at":"2026-10-03T20:27:21.119453Z","duration_s":0.003906,"timed_out":false,"image_before":"7823942d-0c65-4d0e-8654-68e4f9ca6899","image_after":"1f92c23c-a7ce-4972-bb4d-4f4ca4108189","junit":null,"diff":null,"patch_sha256":null,"dropped_paths":[],"snapshot_sha":null}
{"receipt_id":"agent1-2","seq":2,"branch_id":"agent1","kind":"command","cmd":"grep -n \"class MultiSequentialEvaluator\" pints/_evaluation.py","path":null,"exit_code":1,"stdout_tail":"","stderr_tail":"","stdout_sha256":"e3b0c44298fc1c149afbf4c8996fb92427ae41e4649b934ca495991b7852b855","log_path":"~/dev/nebius-hackathon/pilot/v2-P/pints-team__pints-1444/runs/pilot-pints-team__pints-1444-190773ed22/logs/agent1/agent1-2.log","tree_digest":null,"tree_download_s":null,"started_at":"2026-10-03T20:27:28.259575Z","duration_s":0.003365,"timed_out":false,"image_before":"1f92c23c-a7ce-4972-bb4d-4f4ca4108189","image_after":"e80345a3-dd59-40a7-b090-ef410bd3e7b6","junit":null,"diff":null,"patch_sha256":null,"dropped_paths":[],"snapshot_sha":null}
{"receipt_id":"agent1-3","seq":3,"branch_id":"agent1","kind":"command","cmd":"grep -n \"class.*Evaluator\" pints/_evaluation.py","path":null,"exit_code":0,"stdout_tail":"63:class Evaluator(object):\n126:class ParallelEvaluator(Evaluator):\n131:    Shares an interface with the :class:`SequentialEvaluator`, allowing\n160:    Extends :class:`Evaluator`.\n416:class SequentialEvaluator(Evaluator):\n422:    :class:`ParallelEvaluator`, allowing parallelism to be switched on/off.\n424:    Extends :class:`Evaluator`.\n450:    Worker class for use with :class:`ParallelEvaluator`.\n","stderr_tail":"","stdout_sha256":"8d7c12c62b2eec4b51dce95b982d41c9290d106c3164ed6335940ddcd88c43cb","log_path":"~/dev/nebius-hackathon/pilot/v2-P/pints-team__pints-1444/runs/pilot-pints-team__pints-1444-190773ed22/logs/agent1/agent1-3.log","tree_digest":null,"tree_download_s":null,"started_at":"2026-10-03T20:27:31.353076Z","duration_s":0.0031139999999999996,"timed_out":false,"image_before":"e80345a3-dd59-40a7-b090-ef410bd3e7b6","image_after":"7f95eb33-37cb-4369-8a6d-fef1a9c80622","junit":null,"diff":null,"patch_sha256":null,"dropped_paths":[],"snapshot_sha":null}
{"receipt_id":"agent1-4","seq":4,"branch_id":"agent1","kind":"command","cmd":"find . -name \"*.py\" -exec grep -l \"MultiSequentialEvaluator\" {} \\;","path":null,"exit_code":0,"stdout_tail":"./pints/tests/test_evaluators.py\n","stderr_tail":"","stdout_sha256":"a917271d5941788d3b4862146e948605e7620d733c0150913aa2631aa112daba","log_path":"~/dev/nebius-hackathon/pilot/v2-P/pints-team__pints-1444/runs/pilot-pints-team__pints-1444-190773ed22/logs/agent1/agent1-4.log","tree_digest":null,"tree_download_s":null,"started_at":"2026-10-03T20:27:37.420075Z","duration_s":0.241088,"timed_out":false,"image_before":"7f95eb33-37cb-4369-8a6d-fef1a9c80622","image_after":"9d1be3b5-cc39-4751-8a21-9d920600dc46","junit":null,"diff":null,"patch_sha256":null,"dropped_paths":[],"snapshot_sha":null}
{"receipt_id":"agent1-5","seq":5,"branch_id":"agent1","kind":"write","cmd":"/opt/receipts-a0079180446e469f8f391bd77b96f012/bin/busybox sh -c 'mkdir -p /pints/pints && cp /opt/receipts-a0079180446e469f8f391bd77b96f012/incoming/85ce254366f1283d01e7fe93abfcd04c5bf89b8871613c749fc4f23a76a083f5 /pints/pints/_evaluation.py'","path":"pints/_evaluation.py","exit_code":0,"stdout_tail":"","stderr_tail":"","stdout_sha256":"85ce254366f1283d01e7fe93abfcd04c5bf89b8871613c749fc4f23a76a083f5","log_path":"~/dev/nebius-hackathon/pilot/v2-P/pints-team__pints-1444/runs/pilot-pints-team__pints-1444-190773ed22/logs/agent1/agent1-5.log","tree_digest":null,"tree_download_s":null,"started_at":"2026-10-03T20:27:55.571258Z","duration_s":0.005096,"timed_out":false,"image_before":"9d1be3b5-cc39-4751-8a21-9d920600dc46","image_after":"067833bb-2906-4082-81cc-fc8320ad2be4","junit":null,"diff":null,"patch_sha256":null,"dropped_paths":[],"snapshot_sha":null}
{"receipt_id":"agent1-6","seq":6,"branch_id":"agent1","kind":"write","cmd":"/opt/receipts-34163ebd4d514ca794f383e819a71241/bin/busybox sh -c 'mkdir -p /pints/pints && cp /opt/receipts-34163ebd4d514ca794f383e819a71241/incoming/963d89639ae05833720bbd226bb163cd7f4b3cb7164d91ca7b2f8f72b1c4152d /pints/pints/__init__.py'","path":"pints/__init__.py","exit_code":0,"stdout_tail":"","stderr_tail":"","stdout_sha256":"963d89639ae05833720bbd226bb163cd7f4b3cb7164d91ca7b2f8f72b1c4152d","log_path":"~/dev/nebius-hackathon/pilot/v2-P/pints-team__pints-1444/runs/pilot-pints-team__pints-1444-190773ed22/logs/agent1/agent1-6.log","tree_digest":null,"tree_download_s":null,"started_at":"2026-10-03T20:28:01.680378Z","duration_s":0.004651,"timed_out":false,"image_before":"067833bb-2906-4082-81cc-fc8320ad2be4","image_after":"d7e0a115-fb3b-4003-99ae-5f22e8bf7593","junit":null,"diff":null,"patch_sha256":null,"dropped_paths":[],"snapshot_sha":null}
{"receipt_id":"agent1-7","seq":7,"branch_id":"agent1","kind":"command","cmd":"/opt/receipts-a8820f1f52f94e1f8812d9a0fc58cb10/bin/busybox mkdir -p /opt/receipts/reports && python -I /opt/receipts-a8820f1f52f94e1f8812d9a0fc58cb10/receipts_pytest.py pints/tests/test_evaluators.py::TestEvaluators::test_multi_sequential -v -o junit_family=xunit1 -p no:cacheprovider -rA --continue-on-collection-errors --junitxml=/opt/receipts/reports/agent1-7.xml","path":null,"exit_code":1,"stdout_tail":"============================= test session starts ==============================\nplatform linux -- Python 3.10.19, pytest-9.0.2, pluggy-1.6.0 -- /usr/local/bin/python\nrootdir: /pints\nplugins: anyio-4.12.1\ncollecting ... collected 1 item\n\npints/tests/test_evaluators.py::TestEvaluators::test_multi_sequential FAILED [100%]\n\n=================================== FAILURES ===================================\n_____________________ TestEvaluators.test_multi_sequential _____________________\n\nself = <pints._evaluation.MultiSequentialEvaluator object at 0x7fffdc0d4520>\nfunctions = [<function f_args at 0x7fffd9d57a30>, <function f_args_plus1 at 0x7fffd9d57ac0>]\nargs = [10, 20]\n\n    def __init__(self, functions, args=None):\n        # Convert to list to allow indexing etc\n        functions = list(functions)\n    \n        # Check functions\n        if not all(callable(f) for f in functions):\n            raise ValueError('All elements in functions must be callable.')\n        self._functions = functions\n    \n        # Check args\n        if args is None:\n            self._args = [()] * len(functions)\n        else:\n            try:\n                len(args)\n            except TypeError:\n                raise ValueError(\n                    'The argument `args` must be either None or a sequence.')\n            if len(args) != len(functions):\n                raise ValueError(\n                    'The argument `args` must have the same length as '\n                    '`functions`.')\n            for arg in args:\n                try:\n>                   len(arg)\nE                   TypeError: object of type 'int' has no len()\n\npints/_evaluation.py:489: TypeError\n\nDuring handling of the above exception, another exception occurred:\n\nself = <test_evaluators.TestEvaluators testMethod=test_multi_sequential>\n\n    def test_multi_sequential(self):\n    \n        # Create test data\n        xs = np.random.normal(0, 10, 100)\n        ys = [f(x) for x in xs]\n    \n        # Test sequential evaluator with multiple functions\n        e = pints.MultiSequentialEvaluator([f for _ in range(100)])\n        self.assertTrue(np.all(ys == e.evaluate(xs)))\n    \n        # check errors\n    \n        # not iterable\n        with self.assertRaises(TypeError):\n            e = pints.MultiSequentialEvaluator(3)\n    \n        # not callable\n        with self.assertRaises(ValueError):\n            e = pints.MultiSequentialEvaluator([f, 4])\n    \n        e = pints.MultiSequentialEvaluator([f for _ in range(100)])\n        # Argument must be sequence\n        with self.assertRaises(ValueError):\n            e.evaluate(1)\n    \n        # wrong number of arguments\n        with self.assertRaises(ValueError):\n            e.evaluate([1 for _ in range(99)])\n    \n        # Test args\n>       e = pints.MultiSequentialEvaluator([f_args, f_args_plus1], [10, 20])\n\npints/tests/test_evaluators.py:86: \n_ _ _ _ _ _ _ _ _ _ _ _ _ _ _ _ _ _ _ _ _ _ _ _ _ _ _ _ _ _ _ _ _ _ _ _ _ _ _ _ \n\nself = <pints._evaluation.MultiSequentialEvaluator object at 0x7fffdc0d4520>\nfunctions = [<function f_args at 0x7fffd9d57a30>, <function f_args_plus1 at 0x7fffd9d57ac0>]\nargs = [10, 20]\n\n    def __init__(self, functions, args=None):\n        # Convert to list to allow indexing etc\n        functions = list(functions)\n    \n        # Check functions\n        if not all(callable(f) for f in functions):\n            raise ValueError('All elements in functions must be callable.')\n        self._functions = functions\n    \n        # Check args\n        if args is None:\n            self._args = [()] * len(functions)\n        else:\n            try:\n                len(args)\n            except TypeError:\n                raise ValueError(\n                    'The argument `args` must be either None or a sequence.')\n            if len(args) != len(functions):\n                raise ValueError(\n                    'The argument `args` must have the same length as '\n                    '`functions`.')\n            for arg in args:\n                try:\n                    len(arg)\n                except TypeError:\n>                   raise ValueError(\n                        'Each element in `args` must be a sequence.')\nE                   ValueError: Each element in `args` must be a sequence.\n\npints/_evaluation.py:491: ValueError\n=============================== warnings summary ===============================\npints/_mcmc/_nuts.py:211\n  /pints/pints/_mcmc/_nuts.py:211: DeprecationWarning: \"@coroutine\" decorator is deprecated since Python 3.8, use \"async def\" instead\n    def leapfrog(theta, L, grad_L, r, epsilon, inv_mass_matrix):\n\npints/_mcmc/_nuts.py:231\n  /pints/pints/_mcmc/_nuts.py:231: DeprecationWarning: \"@coroutine\" decorator is deprecated since Python 3.8, use \"async def\" instead\n    def build_tree(state, v, j, adaptor, hamiltonian0, hamiltonian_threshold):\n\npints/_mcmc/_nuts.py:287\n  /pints/pints/_mcmc/_nuts.py:287: DeprecationWarning: \"@coroutine\" decorator is deprecated since Python 3.8, use \"async def\" instead\n    def initialise_adaptor(\n\npints/_mcmc/_nuts.py:320\n  /pints/pints/_mcmc/_nuts.py:320: DeprecationWarning: \"@coroutine\" decorator is deprecated since Python 3.8, use \"async def\" instead\n    def find_reasonable_epsilon(theta, L, grad_L, inv_mass_matrix):\n\npints/_mcmc/_nuts.py:370\n  /pints/pints/_mcmc/_nuts.py:370: DeprecationWarning: \"@coroutine\" decorator is deprecated since Python 3.8, use \"async def\" instead\n    def nuts_sampler(\n\n-- Docs: https://docs.pytest.org/en/stable/how-to/capture-warnings.html\n------------ generated xml file: /opt/receipts/reports/agent1-7.xml ------------\n=========================== short test summary info ============================\nFAILED pints/tests/test_evaluators.py::TestEvaluators::test_multi_sequential\n======================== 1 failed, 5 warnings in 1.63s =========================\n","stderr_tail":"","stdout_sha256":"f00ee5379b056982e9874054d869c78b420fc475d62da30937fe25770293689a","log_path":"~/dev/nebius-hackathon/pilot/v2-P/pints-team__pints-1444/runs/pilot-pints-team__pints-1444-190773ed22/logs/agent1/agent1-7.log","tree_digest":"1d0e38addc635e7f98ae486982246b1d4b3f3942504694e5aa8e73d88ffa4751","tree_download_s":11.331105875084177,"started_at":"2026-10-03T20:28:04.985057Z","duration_s":2.59966,"timed_out":false,"image_before":"d7e0a115-fb3b-4003-99ae-5f22e8bf7593","image_after":"48f857a5-6c22-4e2c-8d7b-412d3cf162c2","junit":{"passed":[],"failed":["pints/tests/test_evaluators.py::TestEvaluators::test_multi_sequential"],"errors":[],"skipped":[],"collection_errors":[],"failure_text":{"pints/tests/test_evaluators.py::TestEvaluators::test_multi_sequential":"[...]ator(3)\n    \n        # not callable\n        with self.assertRaises(ValueError):\n            e = pints.MultiSequentialEvaluator([f, 4])\n    \n        e = pints.MultiSequentialEvaluator([f for _ in range(100)])\n        # Argument must be sequence\n        with self.assertRaises(ValueError):\n            e.evaluate(1)\n    \n        # wrong number of arguments\n        with self.assertRaises(ValueError):\n            e.evaluate([1 for _ in range(99)])\n    \n        # Test args\n>       e = pints.MultiSequentialEvaluator([f_args, f_args_plus1], [10, 20])\n\npints/tests/test_evaluators.py:86: \n_ _ _ _ _ _ _ _ _ _ _ _ _ _ _ _ _ _ _ _ _ _ _ _ _ _ _ _ _ _ _ _ _ _ _ _ _ _ _ _ \n\nself = <pints._evaluation.MultiSequentialEvaluator object at 0x7fffdc0d4520>\nfunctions = [<function f_args at 0x7fffd9d57a30>, <function f_args_plus1 at 0x7fffd9d57ac0>]\nargs = [10, 20]\n\n    def __init__(self, functions, args=None):\n        # Convert to list to allow indexing etc\n        functions = list(functions)\n    \n        # Check functions\n        if not all(callable(f) for f in functions):\n            raise ValueError('All elements in functions must be callable.')\n        self._functions = functions\n    \n        # Check args\n        if args is None:\n            self._args = [()] * len(functions)\n        else:\n            try:\n                len(args)\n            except TypeError:\n                raise ValueError(\n                    'The argument `args` must be either None or a sequence.')\n            if len(args) != len(functions):\n                raise ValueError(\n                    'The argument `args` must have the same length as '\n                    '`functions`.')\n            for arg in args:\n                try:\n                    len(arg)\n                except TypeError:\n>                   raise ValueError(\n                        'Each element in `args` must be a sequence.')\nE                   ValueError: Each element in `args` must be a sequence.\n\npints/_evaluation.py:491: ValueError"}},"diff":null,"patch_sha256":null,"dropped_paths":[],"snapshot_sha":null}
{"receipt_id":"agent1-8","seq":8,"branch_id":"agent1","kind":"write","cmd":"/opt/receipts-c120cbb92a644aa7949d60fa163f7c94/bin/busybox sh -c 'mkdir -p /pints/pints && cp /opt/receipts-c120cbb92a644aa7949d60fa163f7c94/incoming/953930bba9cd0a67abbbdaa64ce406f807ae20fdd0d40e8f122169692f498c1b /pints/pints/_evaluation.py'","path":"pints/_evaluation.py","exit_code":0,"stdout_tail":"","stderr_tail":"","stdout_sha256":"953930bba9cd0a67abbbdaa64ce406f807ae20fdd0d40e8f122169692f498c1b","log_path":"~/dev/nebius-hackathon/pilot/v2-P/pints-team__pints-1444/runs/pilot-pints-team__pints-1444-190773ed22/logs/agent1/agent1-8.log","tree_digest":null,"tree_download_s":null,"started_at":"2026-10-03T20:28:26.926008Z","duration_s":0.004784,"timed_out":false,"image_before":"48f857a5-6c22-4e2c-8d7b-412d3cf162c2","image_after":"57540782-1bc1-4d83-8327-a17a4a0b04d0","junit":null,"diff":null,"patch_sha256":null,"dropped_paths":[],"snapshot_sha":null}
{"receipt_id":"agent1-9","seq":9,"branch_id":"agent1","kind":"command","cmd":"/opt/receipts-f5a8a76a2c5f45b2b220d9a58efe7b9a/bin/busybox mkdir -p /opt/receipts/reports && python -I /opt/receipts-f5a8a76a2c5f45b2b220d9a58efe7b9a/receipts_pytest.py pints/tests/test_evaluators.py::TestEvaluators::test_multi_sequential -v -o junit_family=xunit1 -p no:cacheprovider -rA --continue-on-collection-errors --junitxml=/opt/receipts/reports/agent1-9.xml","path":null,"exit_code":1,"stdout_tail":"============================= test session starts ==============================\nplatform linux -- Python 3.10.19, pytest-9.0.2, pluggy-1.6.0 -- /usr/local/bin/python\nrootdir: /pints\nplugins: anyio-4.12.1\ncollecting ... collected 1 item\n\npints/tests/test_evaluators.py::TestEvaluators::test_multi_sequential FAILED [100%]\n\n=================================== FAILURES ===================================\n_____________________ TestEvaluators.test_multi_sequential _____________________\n\nself = <test_evaluators.TestEvaluators testMethod=test_multi_sequential>\n\n    def test_multi_sequential(self):\n    \n        # Create test data\n        xs = np.random.normal(0, 10, 100)\n        ys = [f(x) for x in xs]\n    \n        # Test sequential evaluator with multiple functions\n        e = pints.MultiSequentialEvaluator([f for _ in range(100)])\n        self.assertTrue(np.all(ys == e.evaluate(xs)))\n    \n        # check errors\n    \n        # not iterable\n        with self.assertRaises(TypeError):\n            e = pints.MultiSequentialEvaluator(3)\n    \n        # not callable\n        with self.assertRaises(ValueError):\n            e = pints.MultiSequentialEvaluator([f, 4])\n    \n        e = pints.MultiSequentialEvaluator([f for _ in range(100)])\n        # Argument must be sequence\n        with self.assertRaises(ValueError):\n            e.evaluate(1)\n    \n        # wrong number of arguments\n        with self.assertRaises(ValueError):\n            e.evaluate([1 for _ in range(99)])\n    \n        # Test args\n        e = pints.MultiSequentialEvaluator([f_args, f_args_plus1], [10, 20])\n>       self.assertEqual(e.evaluate([1, 1]), [31, 32])\n\npints/tests/test_evaluators.py:87: \n_ _ _ _ _ _ _ _ _ _ _ _ _ _ _ _ _ _ _ _ _ _ _ _ _ _ _ _ _ _ _ _ _ _ _ _ _ _ _ _ \npints/_evaluation.py:119: in evaluate\n    return self._evaluate(positions)\n_ _ _ _ _ _ _ _ _ _ _ _ _ _ _ _ _ _ _ _ _ _ _ _ _ _ _ _ _ _ _ _ _ _ _ _ _ _ _ _ \n\nself = <pints._evaluation.MultiSequentialEvaluator object at 0x7fffdddc16f0>\npositions = [1, 1]\n\n    def _evaluate(self, positions):\n        \"\"\"\n        See :meth:`evaluate()`.\n        \"\"\"\n        try:\n            len(positions)\n        except TypeError:\n            raise ValueError(\n                'The argument `positions` must be a sequence of input values'\n                ' to the evaluator\\'s functions.')\n        if len(self._functions) != len(positions):\n            raise ValueError(\n                'The length of `positions` must match the length of '\n                '`functions`.')\n    \n        scores = [0] * len(positions)\n        for k, (f, x, arg) in enumerate(zip(self._functions, positions, self._args)):\n>           scores[k] = f(x, *arg)\nE           TypeError: f_args() missing 1 required positional argument: 'z'\n\npints/_evaluation.py:515: TypeError\n=============================== warnings summary ===============================\npints/_mcmc/_nuts.py:211\n  /pints/pints/_mcmc/_nuts.py:211: DeprecationWarning: \"@coroutine\" decorator is deprecated since Python 3.8, use \"async def\" instead\n    def leapfrog(theta, L, grad_L, r, epsilon, inv_mass_matrix):\n\npints/_mcmc/_nuts.py:231\n  /pints/pints/_mcmc/_nuts.py:231: DeprecationWarning: \"@coroutine\" decorator is deprecated since Python 3.8, use \"async def\" instead\n    def build_tree(state, v, j, adaptor, hamiltonian0, hamiltonian_threshold):\n\npints/_mcmc/_nuts.py:287\n  /pints/pints/_mcmc/_nuts.py:287: DeprecationWarning: \"@coroutine\" decorator is deprecated since Python 3.8, use \"async def\" instead\n    def initialise_adaptor(\n\npints/_mcmc/_nuts.py:320\n  /pints/pints/_mcmc/_nuts.py:320: DeprecationWarning: \"@coroutine\" decorator is deprecated since Python 3.8, use \"async def\" instead\n    def find_reasonable_epsilon(theta, L, grad_L, inv_mass_matrix):\n\npints/_mcmc/_nuts.py:370\n  /pints/pints/_mcmc/_nuts.py:370: DeprecationWarning: \"@coroutine\" decorator is deprecated since Python 3.8, use \"async def\" instead\n    def nuts_sampler(\n\n-- Docs: https://docs.pytest.org/en/stable/how-to/capture-warnings.html\n------------ generated xml file: /opt/receipts/reports/agent1-9.xml ------------\n=========================== short test summary info ============================\nFAILED pints/tests/test_evaluators.py::TestEvaluators::test_multi_sequential\n======================== 1 failed, 5 warnings in 1.61s =========================\n","stderr_tail":"","stdout_sha256":"b199a66ecc0801b086b16133e63bbd142d9d549817ee1b113cf811e637f761cc","log_path":"~/dev/nebius-hackathon/pilot/v2-P/pints-team__pints-1444/runs/pilot-pints-team__pints-1444-190773ed22/logs/agent1/agent1-9.log","tree_digest":"83da791078572e54ab552a93658b7ae3a932cb68972b0a201eac978b51464d18","tree_download_s":10.381621415959671,"started_at":"2026-10-03T20:28:31.038286Z","duration_s":2.5902249999999998,"timed_out":false,"image_before":"57540782-1bc1-4d83-8327-a17a4a0b04d0","image_after":"0b87adad-27b5-4c09-853a-dbe2a78347ce","junit":{"passed":[],"failed":["pints/tests/test_evaluators.py::TestEvaluators::test_multi_sequential"],"errors":[],"skipped":[],"collection_errors":[],"failure_text":{"pints/tests/test_evaluators.py::TestEvaluators::test_multi_sequential":"[...]ultiSequentialEvaluator([f for _ in range(100)])\n        self.assertTrue(np.all(ys == e.evaluate(xs)))\n    \n        # check errors\n    \n        # not iterable\n        with self.assertRaises(TypeError):\n            e = pints.MultiSequentialEvaluator(3)\n    \n        # not callable\n        with self.assertRaises(ValueError):\n            e = pints.MultiSequentialEvaluator([f, 4])\n    \n        e = pints.MultiSequentialEvaluator([f for _ in range(100)])\n        # Argument must be sequence\n        with self.assertRaises(ValueError):\n            e.evaluate(1)\n    \n        # wrong number of arguments\n        with self.assertRaises(ValueError):\n            e.evaluate([1 for _ in range(99)])\n    \n        # Test args\n        e = pints.MultiSequentialEvaluator([f_args, f_args_plus1], [10, 20])\n>       self.assertEqual(e.evaluate([1, 1]), [31, 32])\n\npints/tests/test_evaluators.py:87: \n_ _ _ _ _ _ _ _ _ _ _ _ _ _ _ _ _ _ _ _ _ _ _ _ _ _ _ _ _ _ _ _ _ _ _ _ _ _ _ _ \npints/_evaluation.py:119: in evaluate\n    return self._evaluate(positions)\n_ _ _ _ _ _ _ _ _ _ _ _ _ _ _ _ _ _ _ _ _ _ _ _ _ _ _ _ _ _ _ _ _ _ _ _ _ _ _ _ \n\nself = <pints._evaluation.MultiSequentialEvaluator object at 0x7fffdddc16f0>\npositions = [1, 1]\n\n    def _evaluate(self, positions):\n        \"\"\"\n        See :meth:`evaluate()`.\n        \"\"\"\n        try:\n            len(positions)\n        except TypeError:\n            raise ValueError(\n                'The argument `positions` must be a sequence of input values'\n                ' to the evaluator\\'s functions.')\n        if len(self._functions) != len(positions):\n            raise ValueError(\n                'The length of `positions` must match the length of '\n                '`functions`.')\n    \n        scores = [0] * len(positions)\n        for k, (f, x, arg) in enumerate(zip(self._functions, positions, self._args)):\n>           scores[k] = f(x, *arg)\nE           TypeError: f_args() missing 1 required positional argument: 'z'\n\npints/_evaluation.py:515: TypeError"}},"diff":null,"patch_sha256":null,"dropped_paths":[],"snapshot_sha":null}
{"receipt_id":"agent1-10","seq":10,"branch_id":"agent1","kind":"write","cmd":"/opt/receipts-ce688667a6c64b389197ed3441373ad7/bin/busybox sh -c 'mkdir -p /tmp && cp /opt/receipts-ce688667a6c64b389197ed3441373ad7/incoming/41b545087ae84d3fb6d62024962d9b306e20b8cc90d27c465422082fcd533ff8 /tmp/debug_test.py'","path":"/tmp/debug_test.py","exit_code":0,"stdout_tail":"","stderr_tail":"","stdout_sha256":"41b545087ae84d3fb6d62024962d9b306e20b8cc90d27c465422082fcd533ff8","log_path":"~/dev/nebius-hackathon/pilot/v2-P/pints-team__pints-1444/runs/pilot-pints-team__pints-1444-190773ed22/logs/agent1/agent1-10.log","tree_digest":null,"tree_download_s":null,"started_at":"2026-10-03T20:28:58.951756Z","duration_s":0.0044139999999999995,"timed_out":false,"image_before":"0b87adad-27b5-4c09-853a-dbe2a78347ce","image_after":"9f277683-611d-403d-9b35-ef436ce6a674","junit":null,"diff":null,"patch_sha256":null,"dropped_paths":[],"snapshot_sha":null}
{"receipt_id":"agent1-11","seq":11,"branch_id":"agent1","kind":"command","cmd":"python /tmp/debug_test.py","path":null,"exit_code":0,"stdout_tail":"Testing MultiSequentialEvaluator...\nCreated evaluator successfully\n_functions: ['f_args', 'f_args_plus1']\n_args: [(10,), (20,)]\nError: f_args() missing 1 required positional argument: 'z'\n","stderr_tail":"Traceback (most recent call last):\n  File \"/tmp/debug_test.py\", line 18, in <module>\n    result = e.evaluate([1, 1])\n  File \"/pints/pints/_evaluation.py\", line 119, in evaluate\n    return self._evaluate(positions)\n  File \"/pints/pints/_evaluation.py\", line 515, in _evaluate\n    scores[k] = f(x, *arg)\nTypeError: f_args() missing 1 required positional argument: 'z'\n","stdout_sha256":"e8ad1716d5f8c81526f0d545d46b1920bc9d4e26a6b9a26c8d09b76a029a15a7","log_path":"~/dev/nebius-hackathon/pilot/v2-P/pints-team__pints-1444/runs/pilot-pints-team__pints-1444-190773ed22/logs/agent1/agent1-11.log","tree_digest":null,"tree_download_s":null,"started_at":"2026-10-03T20:29:01.771226Z","duration_s":1.2022000000000002,"timed_out":false,"image_before":"9f277683-611d-403d-9b35-ef436ce6a674","image_after":"b14f60c4-0d8b-4b13-b838-5e48a71377a7","junit":null,"diff":null,"patch_sha256":null,"dropped_paths":[],"snapshot_sha":null}
{"receipt_id":"agent1-12","seq":12,"branch_id":"agent1","kind":"write","cmd":"/opt/receipts-3f8c7f5c8da34f6498f0c00c48963ede/bin/busybox sh -c 'mkdir -p /pints/pints && cp /opt/receipts-3f8c7f5c8da34f6498f0c00c48963ede/incoming/953930bba9cd0a67abbbdaa64ce406f807ae20fdd0d40e8f122169692f498c1b /pints/pints/_evaluation.py'","path":"pints/_evaluation.py","exit_code":0,"stdout_tail":"","stderr_tail":"","stdout_sha256":"953930bba9cd0a67abbbdaa64ce406f807ae20fdd0d40e8f122169692f498c1b","log_path":"~/dev/nebius-hackathon/pilot/v2-P/pints-team__pints-1444/runs/pilot-pints-team__pints-1444-190773ed22/logs/agent1/agent1-12.log","tree_digest":null,"tree_download_s":null,"started_at":"2026-10-03T20:29:09.561138Z","duration_s":0.00459,"timed_out":false,"image_before":"b14f60c4-0d8b-4b13-b838-5e48a71377a7","image_after":"4a053cbe-de13-434a-801b-17804879659d","junit":null,"diff":null,"patch_sha256":null,"dropped_paths":[],"snapshot_sha":null}
{"receipt_id":"agent1-13","seq":13,"branch_id":"agent1","kind":"write","cmd":"/opt/receipts-b2aa744fb7494030a2fd01544f305d3b/bin/busybox sh -c 'mkdir -p /tmp && cp /opt/receipts-b2aa744fb7494030a2fd01544f305d3b/incoming/acbaa3f8a7a7495f929e0a5e2eaf6b49bef28bbe15c3ee6fd284180df8eef613 /tmp/debug_test2.py'","path":"/tmp/debug_test2.py","exit_code":0,"stdout_tail":"","stderr_tail":"","stdout_sha256":"acbaa3f8a7a7495f929e0a5e2eaf6b49bef28bbe15c3ee6fd284180df8eef613","log_path":"~/dev/nebius-hackathon/pilot/v2-P/pints-team__pints-1444/runs/pilot-pints-team__pints-1444-190773ed22/logs/agent1/agent1-13.log","tree_digest":null,"tree_download_s":null,"started_at":"2026-10-03T20:29:18.604374Z","duration_s":0.004716,"timed_out":false,"image_before":"4a053cbe-de13-434a-801b-17804879659d","image_after":"d4d54899-2daa-4599-a366-29c88826f1fd","junit":null,"diff":null,"patch_sha256":null,"dropped_paths":[],"snapshot_sha":null}
{"receipt_id":"agent1-14","seq":14,"branch_id":"agent1","kind":"command","cmd":"python /tmp/debug_test2.py","path":null,"exit_code":0,"stdout_tail":"Testing what the test likely means...\nCreated evaluator with [[10, 20], [10, 20]]\n_args: [(10, 20), (10, 20)]\nResult: [31, 32]\nExpected: [31, 32]\nMatch: True\n\n==================================================\n\nCreated evaluator with [(10, 20), (10, 20)]\n_args: [(10, 20), (10, 20)]\nResult: [31, 32]\nExpected: [31, 32]\nMatch: True\n","stderr_tail":"","stdout_sha256":"b84ef79f77c587f5544af088a8ddcff42c430c8d17c481789bd105f9ba6e1ffa","log_path":"~/dev/nebius-hackathon/pilot/v2-P/pints-team__pints-1444/runs/pilot-pints-team__pints-1444-190773ed22/logs/agent1/agent1-14.log","tree_digest":null,"tree_download_s":null,"started_at":"2026-10-03T20:29:22.246519Z","duration_s":1.146748,"timed_out":false,"image_before":"d4d54899-2daa-4599-a366-29c88826f1fd","image_after":"edc7abb3-fd84-476e-a351-9c42da37da4b","junit":null,"diff":null,"patch_sha256":null,"dropped_paths":[],"snapshot_sha":null}
{"receipt_id":"agent1-15","seq":15,"branch_id":"agent1","kind":"write","cmd":"/opt/receipts-3ee0c5f8f559435fb6378849279b3359/bin/busybox sh -c 'mkdir -p /tmp && cp /opt/receipts-3ee0c5f8f559435fb6378849279b3359/incoming/42139c0c904e50d501850f9a7f13b64aa9451a7705dfab71515318ab428c8245 /tmp/debug_test3.py'","path":"/tmp/debug_test3.py","exit_code":0,"stdout_tail":"","stderr_tail":"","stdout_sha256":"42139c0c904e50d501850f9a7f13b64aa9451a7705dfab71515318ab428c8245","log_path":"~/dev/nebius-hackathon/pilot/v2-P/pints-team__pints-1444/runs/pilot-pints-team__pints-1444-190773ed22/logs/agent1/agent1-15.log","tree_digest":null,"tree_download_s":null,"started_at":"2026-10-03T20:29:37.861978Z","duration_s":0.004583,"timed_out":false,"image_before":"edc7abb3-fd84-476e-a351-9c42da37da4b","image_after":"d2fe8032-e0d1-4a6d-b433-13b9d385ae35","junit":null,"diff":null,"patch_sha256":null,"dropped_paths":[],"snapshot_sha":null}
{"receipt_id":"agent1-16","seq":16,"branch_id":"agent1","kind":"command","cmd":"python /tmp/debug_test3.py","path":null,"exit_code":0,"stdout_tail":"Testing the specific failing case from the test...\nFailed as expected: The argument `args` must be either None or a sequence.\nException type: <class 'ValueError'>\n","stderr_tail":"","stdout_sha256":"a362c832ccc2428e1f7dfb00dcae09a56d153728f824226ac7a64165302675fc","log_path":"~/dev/nebius-hackathon/pilot/v2-P/pints-team__pints-1444/runs/pilot-pints-team__pints-1444-190773ed22/logs/agent1/agent1-16.log","tree_digest":null,"tree_download_s":null,"started_at":"2026-10-03T20:29:40.573119Z","duration_s":1.120603,"timed_out":false,"image_before":"d2fe8032-e0d1-4a6d-b433-13b9d385ae35","image_after":"2aa29894-7037-4e3a-9390-e41fd089fe94","junit":null,"diff":null,"patch_sha256":null,"dropped_paths":[],"snapshot_sha":null}
{"receipt_id":"agent1-17","seq":17,"branch_id":"agent1","kind":"write","cmd":"/opt/receipts-dbecf660dc36429cb237a69356c3dcc7/bin/busybox sh -c 'mkdir -p /tmp && cp /opt/receipts-dbecf660dc36429cb237a69356c3dcc7/incoming/fac22ae1bc5389176d450c6f2101ac476d12ea5e8d85632a7d72c57568086ad9 /tmp/debug_test4.py'","path":"/tmp/debug_test4.py","exit_code":0,"stdout_tail":"","stderr_tail":"","stdout_sha256":"fac22ae1bc5389176d450c6f2101ac476d12ea5e8d85632a7d72c57568086ad9","log_path":"~/dev/nebius-hackathon/pilot/v2-P/pints-team__pints-1444/runs/pilot-pints-team__pints-1444-190773ed22/logs/agent1/agent1-17.log","tree_digest":null,"tree_download_s":null,"started_at":"2026-10-03T20:29:45.908680Z","duration_s":0.0046300000000000004,"timed_out":false,"image_before":"2aa29894-7037-4e3a-9390-e41fd089fe94","image_after":"e524bf30-04dc-4418-9026-d245257ca467","junit":null,"diff":null,"patch_sha256":null,"dropped_paths":[],"snapshot_sha":null}
{"receipt_id":"agent1-18","seq":18,"branch_id":"agent1","kind":"command","cmd":"python /tmp/debug_test4.py","path":null,"exit_code":0,"stdout_tail":"Testing the positive case from the test...\nCreated evaluator successfully\n_functions: ['f_args', 'f_args_plus1']\n_args: [(10,), (20,)]\nFailed: f_args() missing 1 required positional argument: 'z'\n","stderr_tail":"Traceback (most recent call last):\n  File \"/tmp/debug_test4.py\", line 17, in <module>\n    result = e.evaluate([1, 1])\n  File \"/pints/pints/_evaluation.py\", line 119, in evaluate\n    return self._evaluate(positions)\n  File \"/pints/pints/_evaluation.py\", line 515, in _evaluate\n    scores[k] = f(x, *arg)\nTypeError: f_args() missing 1 required positional argument: 'z'\n","stdout_sha256":"b48bf3041637c68a45d6bbb464ea02269a252754d290d87a36862c2d9dd877dd","log_path":"~/dev/nebius-hackathon/pilot/v2-P/pints-team__pints-1444/runs/pilot-pints-team__pints-1444-190773ed22/logs/agent1/agent1-18.log","tree_digest":null,"tree_download_s":null,"started_at":"2026-10-03T20:29:49.161478Z","duration_s":1.139923,"timed_out":false,"image_before":"e524bf30-04dc-4418-9026-d245257ca467","image_after":"a2b12c1e-eac8-4b0b-913f-c35e021cfa93","junit":null,"diff":null,"patch_sha256":null,"dropped_paths":[],"snapshot_sha":null}
{"receipt_id":"agent1-19","seq":19,"branch_id":"agent1","kind":"write","cmd":"/opt/receipts-25dd71a92b5a46989dacc7482717ff87/bin/busybox sh -c 'mkdir -p /pints/pints && cp /opt/receipts-25dd71a92b5a46989dacc7482717ff87/incoming/ce13d6c50a25d47af1605f154e877cca2bb0ebc5eed6fbb79b782aa3ad279e79 /pints/pints/_evaluation.py'","path":"pints/_evaluation.py","exit_code":0,"stdout_tail":"","stderr_tail":"","stdout_sha256":"ce13d6c50a25d47af1605f154e877cca2bb0ebc5eed6fbb79b782aa3ad279e79","log_path":"~/dev/nebius-hackathon/pilot/v2-P/pints-team__pints-1444/runs/pilot-pints-team__pints-1444-190773ed22/logs/agent1/agent1-19.log","tree_digest":null,"tree_download_s":null,"started_at":"2026-10-03T20:29:56.731988Z","duration_s":0.004424,"timed_out":false,"image_before":"a2b12c1e-eac8-4b0b-913f-c35e021cfa93","image_after":"88731438-bd50-419b-923e-81aeb1c74e78","junit":null,"diff":null,"patch_sha256":null,"dropped_paths":[],"snapshot_sha":null}
{"receipt_id":"agent1-20","seq":20,"branch_id":"agent1","kind":"command","cmd":"python /tmp/debug_test4.py","path":null,"exit_code":0,"stdout_tail":"Testing the positive case from the test...\nCreated evaluator successfully\n_functions: ['f_args', 'f_args_plus1']\n_args: [(10, 20), (10, 20)]\nResult: [31, 32]\nExpected: [31, 32]\n","stderr_tail":"","stdout_sha256":"e23fb23234dce429f4628511259b4fa8237a061971d7388557be81f982728dd2","log_path":"~/dev/nebius-hackathon/pilot/v2-P/pints-team__pints-1444/runs/pilot-pints-team__pints-1444-190773ed22/logs/agent1/agent1-20.log","tree_digest":null,"tree_download_s":null,"started_at":"2026-10-03T20:29:59.408963Z","duration_s":1.113631,"timed_out":false,"image_before":"88731438-bd50-419b-923e-81aeb1c74e78","image_after":"554a3e6a-6e5a-4578-838f-20a0aa94c34b","junit":null,"diff":null,"patch_sha256":null,"dropped_paths":[],"snapshot_sha":null}
{"receipt_id":"agent1-21","seq":21,"branch_id":"agent1","kind":"command","cmd":"python /tmp/debug_test3.py","path":null,"exit_code":0,"stdout_tail":"Testing the specific failing case from the test...\nFailed as expected: The argument `args` must be either None or a sequence.\nException type: <class 'ValueError'>\n","stderr_tail":"","stdout_sha256":"a362c832ccc2428e1f7dfb00dcae09a56d153728f824226ac7a64165302675fc","log_path":"~/dev/nebius-hackathon/pilot/v2-P/pints-team__pints-1444/runs/pilot-pints-team__pints-1444-190773ed22/logs/agent1/agent1-21.log","tree_digest":null,"tree_download_s":null,"started_at":"2026-10-03T20:30:03.671273Z","duration_s":1.1130149999999999,"timed_out":false,"image_before":"554a3e6a-6e5a-4578-838f-20a0aa94c34b","image_after":"43112db7-ed5b-4023-808d-4f63939a090f","junit":null,"diff":null,"patch_sha256":null,"dropped_paths":[],"snapshot_sha":null}
{"receipt_id":"agent1-22","seq":22,"branch_id":"agent1","kind":"command","cmd":"/opt/receipts-7c3f9bad0235498e93a6f8b35cf154d5/bin/busybox mkdir -p /opt/receipts/reports && python -I /opt/receipts-7c3f9bad0235498e93a6f8b35cf154d5/receipts_pytest.py pints/tests/test_evaluators.py::TestEvaluators::test_multi_sequential -v -o junit_family=xunit1 -p no:cacheprovider -rA --continue-on-collection-errors --junitxml=/opt/receipts/reports/agent1-22.xml","path":null,"exit_code":0,"stdout_tail":"============================= test session starts ==============================\nplatform linux -- Python 3.10.19, pytest-9.0.2, pluggy-1.6.0 -- /usr/local/bin/python\nrootdir: /pints\nplugins: anyio-4.12.1\ncollecting ... collected 1 item\n\npints/tests/test_evaluators.py::TestEvaluators::test_multi_sequential PASSED [100%]\n\n=============================== warnings summary ===============================\npints/_mcmc/_nuts.py:211\n  /pints/pints/_mcmc/_nuts.py:211: DeprecationWarning: \"@coroutine\" decorator is deprecated since Python 3.8, use \"async def\" instead\n    def leapfrog(theta, L, grad_L, r, epsilon, inv_mass_matrix):\n\npints/_mcmc/_nuts.py:231\n  /pints/pints/_mcmc/_nuts.py:231: DeprecationWarning: \"@coroutine\" decorator is deprecated since Python 3.8, use \"async def\" instead\n    def build_tree(state, v, j, adaptor, hamiltonian0, hamiltonian_threshold):\n\npints/_mcmc/_nuts.py:287\n  /pints/pints/_mcmc/_nuts.py:287: DeprecationWarning: \"@coroutine\" decorator is deprecated since Python 3.8, use \"async def\" instead\n    def initialise_adaptor(\n\npints/_mcmc/_nuts.py:320\n  /pints/pints/_mcmc/_nuts.py:320: DeprecationWarning: \"@coroutine\" decorator is deprecated since Python 3.8, use \"async def\" instead\n    def find_reasonable_epsilon(theta, L, grad_L, inv_mass_matrix):\n\npints/_mcmc/_nuts.py:370\n  /pints/pints/_mcmc/_nuts.py:370: DeprecationWarning: \"@coroutine\" decorator is deprecated since Python 3.8, use \"async def\" instead\n    def nuts_sampler(\n\n-- Docs: https://docs.pytest.org/en/stable/how-to/capture-warnings.html\n==================================== PASSES ====================================\n----------- generated xml file: /opt/receipts/reports/agent1-22.xml ------------\n=========================== short test summary info ============================\nPASSED pints/tests/test_evaluators.py::TestEvaluators::test_multi_sequential\n======================== 1 passed, 5 warnings in 1.60s =========================\n","stderr_tail":"","stdout_sha256":"67a60b03901d18d61c684c8b9ac42d1645f67345c78e65596e11b065c9ed1f9f","log_path":"~/dev/nebius-hackathon/pilot/v2-P/pints-team__pints-1444/runs/pilot-pints-team__pints-1444-190773ed22/logs/agent1/agent1-22.log","tree_digest":"c0b02ae013708d76603151442921fda84ec4eefc972582eaf17e8dd2ff51aead","tree_download_s":24.47520983288996,"started_at":"2026-10-03T20:30:08.397280Z","duration_s":2.591233,"timed_out":false,"image_before":"43112db7-ed5b-4023-808d-4f63939a090f","image_after":"a6e63de6-14f8-45d1-8b55-ef9c2a9dfb79","junit":{"passed":["pints/tests/test_evaluators.py::TestEvaluators::test_multi_sequential"],"failed":[],"errors":[],"skipped":[],"collection_errors":[],"failure_text":{}},"diff":null,"patch_sha256":null,"dropped_paths":[],"snapshot_sha":null}
{"receipt_id":"agent1-23","seq":23,"branch_id":"agent1","kind":"command","cmd":"/opt/receipts-b9596f616eb544f8a042226cf20f2055/bin/busybox mkdir -p /opt/receipts/reports && python -I /opt/receipts-b9596f616eb544f8a042226cf20f2055/receipts_pytest.py pints/tests/test_evaluators.py -v -o junit_family=xunit1 -p no:cacheprovider -rA --continue-on-collection-errors --junitxml=/opt/receipts/reports/agent1-23.xml","path":null,"exit_code":0,"stdout_tail":"============================= test session starts ==============================\nplatform linux -- Python 3.10.19, pytest-9.0.2, pluggy-1.6.0 -- /usr/local/bin/python\nrootdir: /pints\nplugins: anyio-4.12.1\ncollecting ... collected 6 items\n\npints/tests/test_evaluators.py::TestEvaluators::test_function PASSED     [ 16%]\npints/tests/test_evaluators.py::TestEvaluators::test_multi_sequential PASSED [ 33%]\npints/tests/test_evaluators.py::TestEvaluators::test_parallel PASSED     [ 50%]\npints/tests/test_evaluators.py::TestEvaluators::test_parallel_random PASSED [ 66%]\npints/tests/test_evaluators.py::TestEvaluators::test_sequential PASSED   [ 83%]\npints/tests/test_evaluators.py::TestEvaluators::test_worker PASSED       [100%]\n\n=============================== warnings summary ===============================\npints/_mcmc/_nuts.py:211\n  /pints/pints/_mcmc/_nuts.py:211: DeprecationWarning: \"@coroutine\" decorator is deprecated since Python 3.8, use \"async def\" instead\n    def leapfrog(theta, L, grad_L, r, epsilon, inv_mass_matrix):\n\npints/_mcmc/_nuts.py:231\n  /pints/pints/_mcmc/_nuts.py:231: DeprecationWarning: \"@coroutine\" decorator is deprecated since Python 3.8, use \"async def\" instead\n    def build_tree(state, v, j, adaptor, hamiltonian0, hamiltonian_threshold):\n\npints/_mcmc/_nuts.py:287\n  /pints/pints/_mcmc/_nuts.py:287: DeprecationWarning: \"@coroutine\" decorator is deprecated since Python 3.8, use \"async def\" instead\n    def initialise_adaptor(\n\npints/_mcmc/_nuts.py:320\n  /pints/pints/_mcmc/_nuts.py:320: DeprecationWarning: \"@coroutine\" decorator is deprecated since Python 3.8, use \"async def\" instead\n    def find_reasonable_epsilon(theta, L, grad_L, inv_mass_matrix):\n\npints/_mcmc/_nuts.py:370\n  /pints/pints/_mcmc/_nuts.py:370: DeprecationWarning: \"@coroutine\" decorator is deprecated since Python 3.8, use \"async def\" instead\n    def nuts_sampler(\n\n-- Docs: https://docs.pytest.org/en/stable/how-to/capture-warnings.html\n==================================== PASSES ====================================\n----------- generated xml file: /opt/receipts/reports/agent1-23.xml ------------\n=========================== short test summary info ============================\nPASSED pints/tests/test_evaluators.py::TestEvaluators::test_function\nPASSED pints/tests/test_evaluators.py::TestEvaluators::test_multi_sequential\nPASSED pints/tests/test_evaluators.py::TestEvaluators::test_parallel\nPASSED pints/tests/test_evaluators.py::TestEvaluators::test_parallel_random\nPASSED pints/tests/test_evaluators.py::TestEvaluators::test_sequential\nPASSED pints/tests/test_evaluators.py::TestEvaluators::test_worker\n======================== 6 passed, 5 warnings in 6.99s =========================\n","stderr_tail":"","stdout_sha256":"cf732026e38468756bc44255e64794196033a6e78ab66fe8b5493e2714757997","log_path":"~/dev/nebius-hackathon/pilot/v2-P/pints-team__pints-1444/runs/pilot-pints-team__pints-1444-190773ed22/logs/agent1/agent1-23.log","tree_digest":"c0b02ae013708d76603151442921fda84ec4eefc972582eaf17e8dd2ff51aead","tree_download_s":23.715222750091925,"started_at":"2026-10-03T20:30:39.457948Z","duration_s":9.952485000000001,"timed_out":false,"image_before":"a6e63de6-14f8-45d1-8b55-ef9c2a9dfb79","image_after":"84c9ad60-68a6-41f2-87fd-468f446b92b7","junit":{"passed":["pints/tests/test_evaluators.py::TestEvaluators::test_function","pints/tests/test_evaluators.py::TestEvaluators::test_multi_sequential","pints/tests/test_evaluators.py::TestEvaluators::test_parallel","pints/tests/test_evaluators.py::TestEvaluators::test_parallel_random","pints/tests/test_evaluators.py::TestEvaluators::test_sequential","pints/tests/test_evaluators.py::TestEvaluators::test_worker"],"failed":[],"errors":[],"skipped":[],"collection_errors":[],"failure_text":{}},"diff":null,"patch_sha256":null,"dropped_paths":[],"snapshot_sha":null}
{"receipt_id":"agent1-24","seq":24,"branch_id":"agent1","kind":"command","cmd":"python -c \"import pints; print('MultiSequentialEvaluator available:', hasattr(pints, 'MultiSequentialEvaluator'))\"","path":null,"exit_code":0,"stdout_tail":"MultiSequentialEvaluator available: True\n","stderr_tail":"","stdout_sha256":"5b88ad4a3f6b98d1c23b5c585e9ab718fa76bcdcf04fe4016b6e2cb61640f256","log_path":"~/dev/nebius-hackathon/pilot/v2-P/pints-team__pints-1444/runs/pilot-pints-team__pints-1444-190773ed22/logs/agent1/agent1-24.log","tree_digest":null,"tree_download_s":null,"started_at":"2026-10-03T20:31:20.874447Z","duration_s":1.139321,"timed_out":false,"image_before":"84c9ad60-68a6-41f2-87fd-468f446b92b7","image_after":"36a81254-0d37-48f1-a7eb-b59786a1d065","junit":null,"diff":null,"patch_sha256":null,"dropped_paths":[],"snapshot_sha":null}
{"receipt_id":"agent1-25","seq":25,"branch_id":"agent1","kind":"command","cmd":"/opt/receipts-5958daaf81ff41f583d881c2655c4ea5/bin/busybox mkdir -p /opt/receipts/reports && python -I /opt/receipts-5958daaf81ff41f583d881c2655c4ea5/receipts_pytest.py pints/tests/test_evaluators.py pints/tests/test_mcmc_controller.py --no-header -rA --tb=line --color=no -p no:cacheprovider -W ignore::DeprecationWarning -o junit_family=xunit1 -p no:cacheprovider -rA --continue-on-collection-errors --junitxml=/opt/receipts/reports/agent1-25.xml","path":null,"exit_code":1,"stdout_tail":"____________\nE   AttributeError: module 'numpy' has no attribute 'product'\n______________ ERROR at setup of TestMCMCController.test_parallel ______________\nE   AttributeError: module 'numpy' has no attribute 'product'\n________ ERROR at setup of TestMCMCController.test_post_run_statistics _________\nE   AttributeError: module 'numpy' has no attribute 'product'\n_______________ ERROR at setup of TestMCMCController.test_single _______________\nE   AttributeError: module 'numpy' has no attribute 'product'\n______________ ERROR at setup of TestMCMCController.test_stopping ______________\nE   AttributeError: module 'numpy' has no attribute 'product'\n___ ERROR at setup of TestMCMCControllerLogging.test_disabling_disk_storage ____\nE   AttributeError: module 'numpy' has no attribute 'product'\n_ ERROR at setup of TestMCMCControllerLogging.test_writing_chains_and_likelihoods_single _\nE   AttributeError: module 'numpy' has no attribute 'product'\n_ ERROR at setup of TestMCMCControllerLogging.test_writing_chains_likelihoods_and_priors_multi _\nE   AttributeError: module 'numpy' has no attribute 'product'\n_ ERROR at setup of TestMCMCControllerLogging.test_writing_chains_likelihoods_and_priors_one_chain _\nE   AttributeError: module 'numpy' has no attribute 'product'\n_ ERROR at setup of TestMCMCControllerLogging.test_writing_chains_likelihoods_and_priors_single _\nE   AttributeError: module 'numpy' has no attribute 'product'\n_____ ERROR at setup of TestMCMCControllerLogging.test_writing_chains_only _____\nE   AttributeError: module 'numpy' has no attribute 'product'\n_ ERROR at setup of TestMCMCControllerLogging.test_writing_chains_only_no_memory_multi _\nE   AttributeError: module 'numpy' has no attribute 'product'\n_ ERROR at setup of TestMCMCControllerLogging.test_writing_chains_only_no_memory_single _\nE   AttributeError: module 'numpy' has no attribute 'product'\n_ ERROR at setup of TestMCMCControllerLogging.test_writing_priors_and_likelihoods _\nE   AttributeError: module 'numpy' has no attribute 'product'\n==================================== PASSES ====================================\n----------- generated xml file: /opt/receipts/reports/agent1-25.xml ------------\n=========================== short test summary info ============================\nPASSED pints/tests/test_evaluators.py::TestEvaluators::test_function\nPASSED pints/tests/test_evaluators.py::TestEvaluators::test_multi_sequential\nPASSED pints/tests/test_evaluators.py::TestEvaluators::test_parallel\nPASSED pints/tests/test_evaluators.py::TestEvaluators::test_parallel_random\nPASSED pints/tests/test_evaluators.py::TestEvaluators::test_sequential\nPASSED pints/tests/test_evaluators.py::TestEvaluators::test_worker\nPASSED pints/tests/test_mcmc_controller.py::TestMCMCControllerSingleChainStorage::test_multiple_samplers_mixed_index_nones\nPASSED pints/tests/test_mcmc_controller.py::TestMCMCControllerSingleChainStorage::test_multiple_samplers_no_nones\nPASSED pints/tests/test_mcmc_controller.py::TestMCMCControllerSingleChainStorage::test_multiple_samplers_same_index_nones\nPASSED pints/tests/test_mcmc_controller.py::TestMCMCControllerSingleChainStorage::test_one_sampler_no_nones\nPASSED pints/tests/test_mcmc_controller.py::TestMCMCControllerSingleChainStorage::test_one_sampler_with_nones\nPASSED pints/tests/test_mcmc_controller.py::TestMCMCControllerMultiChainStorage::test_multi_chain_no_nones\nPASSED pints/tests/test_mcmc_controller.py::TestMCMCControllerMultiChainStorage::test_multi_chain_with_nones\nPASSED pints/tests/test_mcmc_controller.py::TestMCMCControllerMultiChainStorage::test_single_chain_no_nones\nPASSED pints/tests/test_mcmc_controller.py::TestMCMCControllerMultiChainStorage::test_single_chain_with_nones\nERROR pints/tests/test_mcmc_controller.py::TestMCMCController::test_deprecated_alias\nERROR pints/tests/test_mcmc_controller.py::TestMCMCController::test_exception_on_multi_use\nERROR pints/tests/test_mcmc_controller.py::TestMCMCController::test_hyperparameters_constant\nERROR pints/tests/test_mcmc_controller.py::TestMCMCController::test_initial_phase\nERROR pints/tests/test_mcmc_controller.py::TestMCMCController::test_log_pdf_storage_in_memory_multi\nERROR pints/tests/test_mcmc_controller.py::TestMCMCController::test_log_pdf_storage_in_memory_single\nERROR pints/tests/test_mcmc_controller.py::TestMCMCController::test_log_pdf_storage_in_memory_single_complex\nERROR pints/tests/test_mcmc_controller.py::TestMCMCController::test_logging\nERROR pints/tests/test_mcmc_controller.py::TestMCMCController::test_multi - A...\nERROR pints/tests/test_mcmc_controller.py::TestMCMCController::test_multi_logpdf\nERROR pints/tests/test_mcmc_controller.py::TestMCMCController::test_parallel\nERROR pints/tests/test_mcmc_controller.py::TestMCMCController::test_post_run_statistics\nERROR pints/tests/test_mcmc_controller.py::TestMCMCController::test_single - ...\nERROR pints/tests/test_mcmc_controller.py::TestMCMCController::test_stopping\nERROR pints/tests/test_mcmc_controller.py::TestMCMCControllerLogging::test_disabling_disk_storage\nERROR pints/tests/test_mcmc_controller.py::TestMCMCControllerLogging::test_writing_chains_and_likelihoods_single\nERROR pints/tests/test_mcmc_controller.py::TestMCMCControllerLogging::test_writing_chains_likelihoods_and_priors_multi\nERROR pints/tests/test_mcmc_controller.py::TestMCMCControllerLogging::test_writing_chains_likelihoods_and_priors_one_chain\nERROR pints/tests/test_mcmc_controller.py::TestMCMCControllerLogging::test_writing_chains_likelihoods_and_priors_single\nERROR pints/tests/test_mcmc_controller.py::TestMCMCControllerLogging::test_writing_chains_only\nERROR pints/tests/test_mcmc_controller.py::TestMCMCControllerLogging::test_writing_chains_only_no_memory_multi\nERROR pints/tests/test_mcmc_controller.py::TestMCMCControllerLogging::test_writing_chains_only_no_memory_single\nERROR pints/tests/test_mcmc_controller.py::TestMCMCControllerLogging::test_writing_priors_and_likelihoods\n======================== 15 passed, 23 errors in 7.59s =========================\n","stderr_tail":"","stdout_sha256":"4e180bdb5d3fb5029c0405395b36a0f59c340961ca62bbf223de651394207e2c","log_path":"~/dev/nebius-hackathon/pilot/v2-P/pints-team__pints-1444/runs/pilot-pints-team__pints-1444-190773ed22/logs/agent1/agent1-25.log","tree_digest":"c0b02ae013708d76603151442921fda84ec4eefc972582eaf17e8dd2ff51aead","tree_download_s":10.602314457995817,"started_at":"2026-10-03T20:31:25.565000Z","duration_s":10.730657,"timed_out":false,"image_before":"36a81254-0d37-48f1-a7eb-b59786a1d065","image_after":"6e1eaf28-be91-460f-882a-f5568051a8e9","junit":{"passed":["pints/tests/test_evaluators.py::TestEvaluators::test_function","pints/tests/test_evaluators.py::TestEvaluators::test_multi_sequential","pints/tests/test_evaluators.py::TestEvaluators::test_parallel","pints/tests/test_evaluators.py::TestEvaluators::test_parallel_random","pints/tests/test_evaluators.py::TestEvaluators::test_sequential","pints/tests/test_evaluators.py::TestEvaluators::test_worker","pints/tests/test_mcmc_controller.py::TestMCMCControllerSingleChainStorage::test_multiple_samplers_mixed_index_nones","pints/tests/test_mcmc_controller.py::TestMCMCControllerSingleChainStorage::test_multiple_samplers_no_nones","pints/tests/test_mcmc_controller.py::TestMCMCControllerSingleChainStorage::test_multiple_samplers_same_index_nones","pints/tests/test_mcmc_controller.py::TestMCMCControllerSingleChainStorage::test_one_sampler_no_nones","pints/tests/test_mcmc_controller.py::TestMCMCControllerSingleChainStorage::test_one_sampler_with_nones","pints/tests/test_mcmc_controller.py::TestMCMCControllerMultiChainStorage::test_multi_chain_no_nones","pints/tests/test_mcmc_controller.py::TestMCMCControllerMultiChainStorage::test_multi_chain_with_nones","pints/tests/test_mcmc_controller.py::TestMCMCControllerMultiChainStorage::test_single_chain_no_nones","pints/tests/test_mcmc_controller.py::TestMCMCControllerMultiChainStorage::test_single_chain_with_nones"],"failed":[],"errors":["pints/tests/test_mcmc_controller.py::TestMCMCController::test_deprecated_alias","pints/tests/test_mcmc_controller.py::TestMCMCController::test_exception_on_multi_use","pints/tests/test_mcmc_controller.py::TestMCMCController::test_hyperparameters_constant","pints/tests/test_mcmc_controller.py::TestMCMCController::test_initial_phase","pints/tests/test_mcmc_controller.py::TestMCMCController::test_log_pdf_storage_in_memory_multi","pints/tests/test_mcmc_controller.py::TestMCMCController::test_log_pdf_storage_in_memory_single","pints/tests/test_mcmc_controller.py::TestMCMCController::test_log_pdf_storage_in_memory_single_complex","pints/tests/test_mcmc_controller.py::TestMCMCController::test_logging","pints/tests/test_mcmc_controller.py::TestMCMCController::test_multi","pints/tests/test_mcmc_controller.py::TestMCMCController::test_multi_logpdf","pints/tests/test_mcmc_controller.py::TestMCMCController::test_parallel","pints/tests/test_mcmc_controller.py::TestMCMCController::test_post_run_statistics","pints/tests/test_mcmc_controller.py::TestMCMCController::test_single","pints/tests/test_mcmc_controller.py::TestMCMCController::test_stopping","pints/tests/test_mcmc_controller.py::TestMCMCControllerLogging::test_disabling_disk_storage","pints/tests/test_mcmc_controller.py::TestMCMCControllerLogging::test_writing_chains_and_likelihoods_single","pints/tests/test_mcmc_controller.py::TestMCMCControllerLogging::test_writing_chains_likelihoods_and_priors_multi","pints/tests/test_mcmc_controller.py::TestMCMCControllerLogging::test_writing_chains_likelihoods_and_priors_one_chain","pints/tests/test_mcmc_controller.py::TestMCMCControllerLogging::test_writing_chains_likelihoods_and_priors_single","pints/tests/test_mcmc_controller.py::TestMCMCControllerLogging::test_writing_chains_only","pints/tests/test_mcmc_controller.py::TestMCMCControllerLogging::test_writing_chains_only_no_memory_multi","pints/tests/test_mcmc_controller.py::TestMCMCControllerLogging::test_writing_chains_only_no_memory_single","pints/tests/test_mcmc_controller.py::TestMCMCControllerLogging::test_writing_priors_and_likelihoods"],"skipped":[],"collection_errors":[],"failure_text":{"pints/tests/test_mcmc_controller.py::TestMCMCController::test_deprecated_alias":"failed on setup with \"AttributeError: module 'numpy' has no attribute 'product'\"\nE   AttributeError: module 'numpy' has no attribute 'product'","pints/tests/test_mcmc_controller.py::TestMCMCController::test_exception_on_multi_use":"failed on setup with \"AttributeError: module 'numpy' has no attribute 'product'\"\nE   AttributeError: module 'numpy' has no attribute 'product'","pints/tests/test_mcmc_controller.py::TestMCMCController::test_hyperparameters_constant":"failed on setup with \"AttributeError: module 'numpy' has no attribute 'product'\"\nE   AttributeError: module 'numpy' has no attribute 'product'","pints/tests/test_mcmc_controller.py::TestMCMCController::test_initial_phase":"failed on setup with \"AttributeError: module 'numpy' has no attribute 'product'\"\nE   AttributeError: module 'numpy' has no attribute 'product'","pints/tests/test_mcmc_controller.py::TestMCMCController::test_log_pdf_storage_in_memory_multi":"failed on setup with \"AttributeError: module 'numpy' has no attribute 'product'\"\nE   AttributeError: module 'numpy' has no attribute 'product'","pints/tests/test_mcmc_controller.py::TestMCMCController::test_log_pdf_storage_in_memory_single":"failed on setup with \"AttributeError: module 'numpy' has no attribute 'product'\"\nE   AttributeError: module 'numpy' has no attribute 'product'","pints/tests/test_mcmc_controller.py::TestMCMCController::test_log_pdf_storage_in_memory_single_complex":"failed on setup with \"AttributeError: module 'numpy' has no attribute 'product'\"\nE   AttributeError: module 'numpy' has no attribute 'product'","pints/tests/test_mcmc_controller.py::TestMCMCController::test_logging":"failed on setup with \"AttributeError: module 'numpy' has no attribute 'product'\"\nE   AttributeError: module 'numpy' has no attribute 'product'","pints/tests/test_mcmc_controller.py::TestMCMCController::test_multi":"failed on setup with \"AttributeError: module 'numpy' has no attribute 'product'\"\nE   AttributeError: module 'numpy' has no attribute 'product'","pints/tests/test_mcmc_controller.py::TestMCMCController::test_multi_logpdf":"failed on setup with \"AttributeError: module 'numpy' has no attribute 'product'\"\nE   AttributeError: module 'numpy' has no attribute 'product'","pints/tests/test_mcmc_controller.py::TestMCMCController::test_parallel":"failed on setup with \"AttributeError: module 'numpy' has no attribute 'product'\"\nE   AttributeError: module 'numpy' has no attribute 'product'","pints/tests/test_mcmc_controller.py::TestMCMCController::test_post_run_statistics":"failed on setup with \"AttributeError: module 'numpy' has no attribute 'product'\"\nE   AttributeError: module 'numpy' has no attribute 'product'","pints/tests/test_mcmc_controller.py::TestMCMCController::test_single":"failed on setup with \"AttributeError: module 'numpy' has no attribute 'product'\"\nE   AttributeError: module 'numpy' has no attribute 'product'","pints/tests/test_mcmc_controller.py::TestMCMCController::test_stopping":"failed on setup with \"AttributeError: module 'numpy' has no attribute 'product'\"\nE   AttributeError: module 'numpy' has no attribute 'product'","pints/tests/test_mcmc_controller.py::TestMCMCControllerLogging::test_disabling_disk_storage":"failed on setup with \"AttributeError: module 'numpy' has no attribute 'product'\"\nE   AttributeError: module 'numpy' has no attribute 'product'","pints/tests/test_mcmc_controller.py::TestMCMCControllerLogging::test_writing_chains_and_likelihoods_single":"failed on setup with \"AttributeError: module 'numpy' has no attribute 'product'\"\nE   AttributeError: module 'numpy' has no attribute 'product'","pints/tests/test_mcmc_controller.py::TestMCMCControllerLogging::test_writing_chains_likelihoods_and_priors_multi":"failed on setup with \"AttributeError: module 'numpy' has no attribute 'product'\"\nE   AttributeError: module 'numpy' has no attribute 'product'","pints/tests/test_mcmc_controller.py::TestMCMCControllerLogging::test_writing_chains_likelihoods_and_priors_one_chain":"failed on setup with \"AttributeError: module 'numpy' has no attribute 'product'\"\nE   AttributeError: module 'numpy' has no attribute 'product'","pints/tests/test_mcmc_controller.py::TestMCMCControllerLogging::test_writing_chains_likelihoods_and_priors_single":"failed on setup with \"AttributeError: module 'numpy' has no attribute 'product'\"\nE   AttributeError: module 'numpy' has no attribute 'product'","pints/tests/test_mcmc_controller.py::TestMCMCControllerLogging::test_writing_chains_only":"failed on setup with \"AttributeError: module 'numpy' has no attribute 'product'\"\nE   AttributeError: module 'numpy' has no attribute 'product'","pints/tests/test_mcmc_controller.py::TestMCMCControllerLogging::test_writing_chains_only_no_memory_multi":"failed on setup with \"AttributeError: module 'numpy' has no attribute 'product'\"\nE   AttributeError: module 'numpy' has no attribute 'product'","pints/tests/test_mcmc_controller.py::TestMCMCControllerLogging::test_writing_chains_only_no_memory_single":"failed on setup with \"AttributeError: module 'numpy' has no attribute 'product'\"\nE   AttributeError: module 'numpy' has no attribute 'product'","pints/tests/test_mcmc_controller.py::TestMCMCControllerLogging::test_writing_priors_and_likelihoods":"failed on setup with \"AttributeError: module 'numpy' has no attribute 'product'\"\nE   AttributeError: module 'numpy' has no attribute 'product'"}},"diff":null,"patch_sha256":null,"dropped_paths":[],"snapshot_sha":null}
{"receipt_id":"agent1-26","seq":26,"branch_id":"agent1","kind":"command","cmd":"/opt/receipts-3d4921d3f8634fe78e091fce6c7bc4de/bin/busybox mkdir -p /opt/receipts/reports && python -I /opt/receipts-3d4921d3f8634fe78e091fce6c7bc4de/receipts_pytest.py pints/tests/test_evaluators.py::TestEvaluators::test_multi_sequential pints/tests/test_mcmc_controller.py::TestMCMCController::test_multi_logpdf -v -o junit_family=xunit1 -p no:cacheprovider -rA --continue-on-collection-errors --junitxml=/opt/receipts/reports/agent1-26.xml","path":null,"exit_code":1,"stdout_tail":"    values += np.random.normal(0, cls.noise, values.shape)\n        cls.real_parameters.append(cls.noise)\n    \n        # Create an object with links to the model and time series\n        problem = pints.SingleOutputProblem(model, times, values)\n    \n        # Create a uniform prior over both the parameters and the new noise\n        # variable\n>       cls.log_prior = pints.UniformLogPrior(\n            [0.01, 400, cls.noise * 0.1],\n            [0.02, 600, cls.noise * 100]\n        )\n\npints/tests/test_mcmc_controller.py:73: \n_ _ _ _ _ _ _ _ _ _ _ _ _ _ _ _ _ _ _ _ _ _ _ _ _ _ _ _ _ _ _ _ _ _ _ _ _ _ _ _ \npints/_log_priors.py:1248: in __init__\n    self._value = -np.log(np.product(self._boundaries.range()))\n_ _ _ _ _ _ _ _ _ _ _ _ _ _ _ _ _ _ _ _ _ _ _ _ _ _ _ _ _ _ _ _ _ _ _ _ _ _ _ _ \n\nattr = 'product'\n\n    def __getattr__(attr):\n        # Warn for expired attributes\n        import warnings\n    \n        if attr == \"linalg\":\n            import numpy.linalg as linalg\n            return linalg\n        elif attr == \"fft\":\n            import numpy.fft as fft\n            return fft\n        elif attr == \"dtypes\":\n            import numpy.dtypes as dtypes\n            return dtypes\n        elif attr == \"random\":\n            import numpy.random as random\n            return random\n        elif attr == \"polynomial\":\n            import numpy.polynomial as polynomial\n            return polynomial\n        elif attr == \"ma\":\n            import numpy.ma as ma\n            return ma\n        elif attr == \"ctypeslib\":\n            import numpy.ctypeslib as ctypeslib\n            return ctypeslib\n        elif attr == \"exceptions\":\n            import numpy.exceptions as exceptions\n            return exceptions\n        elif attr == \"testing\":\n            import numpy.testing as testing\n            return testing\n        elif attr == \"matlib\":\n            import numpy.matlib as matlib\n            return matlib\n        elif attr == \"f2py\":\n            import numpy.f2py as f2py\n            return f2py\n        elif attr == \"typing\":\n            import numpy.typing as typing\n            return typing\n        elif attr == \"rec\":\n            import numpy.rec as rec\n            return rec\n        elif attr == \"char\":\n            import numpy.char as char\n            return char\n        elif attr == \"array_api\":\n            raise AttributeError(\"`numpy.array_api` is not available from \"\n                                 \"numpy 2.0 onwards\", name=None)\n        elif attr == \"core\":\n            import numpy.core as core\n            return core\n        elif attr == \"strings\":\n            import numpy.strings as strings\n            return strings\n        elif attr == \"distutils\":\n            if 'distutils' in __numpy_submodules__:\n                import numpy.distutils as distutils\n                return distutils\n            else:\n                raise AttributeError(\"`numpy.distutils` is not available from \"\n                                     \"Python 3.12 onwards\", name=None)\n    \n        if attr in __future_scalars__:\n            # And future warnings for those that will change, but also give\n            # the AttributeError\n            warnings.warn(\n                f\"In the future `np.{attr}` will be defined as the \"\n                \"corresponding NumPy scalar.\", FutureWarning, stacklevel=2)\n    \n        if attr in __former_attrs__:\n            raise AttributeError(__former_attrs__[attr], name=None)\n    \n        if attr in __expired_attributes__:\n            raise AttributeError(\n                f\"`np.{attr}` was removed in the NumPy 2.0 release. \"\n                f\"{__expired_attributes__[attr]}\",\n                name=None\n            )\n    \n        if attr == \"chararray\":\n            warnings.warn(\n                \"`np.chararray` is deprecated and will be removed from \"\n                \"the main namespace in the future. Use an array with a string \"\n                \"or bytes dtype instead.\", DeprecationWarning, stacklevel=2)\n            import numpy.char as char\n            return char.chararray\n    \n>       raise AttributeError(\"module {!r} has no attribute \"\n                             \"{!r}\".format(__name__, attr))\nE       AttributeError: module 'numpy' has no attribute 'product'\n\n/usr/local/lib/python3.10/site-packages/numpy/__init__.py:414: AttributeError\n=============================== warnings summary ===============================\npints/_mcmc/_nuts.py:211\n  /pints/pints/_mcmc/_nuts.py:211: DeprecationWarning: \"@coroutine\" decorator is deprecated since Python 3.8, use \"async def\" instead\n    def leapfrog(theta, L, grad_L, r, epsilon, inv_mass_matrix):\n\npints/_mcmc/_nuts.py:231\n  /pints/pints/_mcmc/_nuts.py:231: DeprecationWarning: \"@coroutine\" decorator is deprecated since Python 3.8, use \"async def\" instead\n    def build_tree(state, v, j, adaptor, hamiltonian0, hamiltonian_threshold):\n\npints/_mcmc/_nuts.py:287\n  /pints/pints/_mcmc/_nuts.py:287: DeprecationWarning: \"@coroutine\" decorator is deprecated since Python 3.8, use \"async def\" instead\n    def initialise_adaptor(\n\npints/_mcmc/_nuts.py:320\n  /pints/pints/_mcmc/_nuts.py:320: DeprecationWarning: \"@coroutine\" decorator is deprecated since Python 3.8, use \"async def\" instead\n    def find_reasonable_epsilon(theta, L, grad_L, inv_mass_matrix):\n\npints/_mcmc/_nuts.py:370\n  /pints/pints/_mcmc/_nuts.py:370: DeprecationWarning: \"@coroutine\" decorator is deprecated since Python 3.8, use \"async def\" instead\n    def nuts_sampler(\n\n-- Docs: https://docs.pytest.org/en/stable/how-to/capture-warnings.html\n==================================== PASSES ====================================\n----------- generated xml file: /opt/receipts/reports/agent1-26.xml ------------\n=========================== short test summary info ============================\nPASSED pints/tests/test_evaluators.py::TestEvaluators::test_multi_sequential\nERROR pints/tests/test_mcmc_controller.py::TestMCMCController::test_multi_logpdf\n==================== 1 passed, 5 warnings, 1 error in 1.73s ====================\n","stderr_tail":"","stdout_sha256":"bccb4513718390ee95925fc9f109cd96cbd8239175e7142853e0dd155ce3feb6","log_path":"~/dev/nebius-hackathon/pilot/v2-P/pints-team__pints-1444/runs/pilot-pints-team__pints-1444-190773ed22/logs/agent1/agent1-26.log","tree_digest":"c0b02ae013708d76603151442921fda84ec4eefc972582eaf17e8dd2ff51aead","tree_download_s":37.76203316706233,"started_at":"2026-10-03T20:31:54.391002Z","duration_s":2.69789,"timed_out":false,"image_before":"6e1eaf28-be91-460f-882a-f5568051a8e9","image_after":"75c6ada7-2147-4195-b31e-0390facd6dcb","junit":{"passed":["pints/tests/test_evaluators.py::TestEvaluators::test_multi_sequential"],"failed":[],"errors":["pints/tests/test_mcmc_controller.py::TestMCMCController::test_multi_logpdf"],"skipped":[],"collection_errors":[],"failure_text":{"pints/tests/test_mcmc_controller.py::TestMCMCController::test_multi_logpdf":"[...]api\":\n            raise AttributeError(\"`numpy.array_api` is not available from \"\n                                 \"numpy 2.0 onwards\", name=None)\n        elif attr == \"core\":\n            import numpy.core as core\n            return core\n        elif attr == \"strings\":\n            import numpy.strings as strings\n            return strings\n        elif attr == \"distutils\":\n            if 'distutils' in __numpy_submodules__:\n                import numpy.distutils as distutils\n                return distutils\n            else:\n                raise AttributeError(\"`numpy.distutils` is not available from \"\n                                     \"Python 3.12 onwards\", name=None)\n    \n        if attr in __future_scalars__:\n            # And future warnings for those that will change, but also give\n            # the AttributeError\n            warnings.warn(\n                f\"In the future `np.{attr}` will be defined as the \"\n                \"corresponding NumPy scalar.\", FutureWarning, stacklevel=2)\n    \n        if attr in __former_attrs__:\n            raise AttributeError(__former_attrs__[attr], name=None)\n    \n        if attr in __expired_attributes__:\n            raise AttributeError(\n                f\"`np.{attr}` was removed in the NumPy 2.0 release. \"\n                f\"{__expired_attributes__[attr]}\",\n                name=None\n            )\n    \n        if attr == \"chararray\":\n            warnings.warn(\n                \"`np.chararray` is deprecated and will be removed from \"\n                \"the main namespace in the future. Use an array with a string \"\n                \"or bytes dtype instead.\", DeprecationWarning, stacklevel=2)\n            import numpy.char as char\n            return char.chararray\n    \n>       raise AttributeError(\"module {!r} has no attribute \"\n                             \"{!r}\".format(__name__, attr))\nE       AttributeError: module 'numpy' has no attribute 'product'\n\n/usr/local/lib/python3.10/site-packages/numpy/__init__.py:414: AttributeError"}},"diff":null,"patch_sha256":null,"dropped_paths":[],"snapshot_sha":null}
{"receipt_id":"agent1-27","seq":27,"branch_id":"agent1","kind":"command","cmd":"/opt/receipts-c3fbd014cd22410ea94d291b1fe236e9/bin/busybox mkdir -p /opt/receipts/reports && python -I /opt/receipts-c3fbd014cd22410ea94d291b1fe236e9/receipts_pytest.py pints/tests/test_evaluators.py::TestEvaluators::test_multi_sequential --no-header -rA --tb=line --color=no -p no:cacheprovider -W ignore::DeprecationWarning -o junit_family=xunit1 -p no:cacheprovider -rA --continue-on-collection-errors --junitxml=/opt/receipts/reports/agent1-27.xml","path":null,"exit_code":0,"stdout_tail":"============================= test session starts ==============================\ncollected 1 item\n\npints/tests/test_evaluators.py .                                         [100%]\n\n==================================== PASSES ====================================\n----------- generated xml file: /opt/receipts/reports/agent1-27.xml ------------\n=========================== short test summary info ============================\nPASSED pints/tests/test_evaluators.py::TestEvaluators::test_multi_sequential\n============================== 1 passed in 1.53s ===============================\n","stderr_tail":"","stdout_sha256":"bc29f79621d893c0df11cd9074b8f99a49061807a522d5d35e19042f4b430ee3","log_path":"~/dev/nebius-hackathon/pilot/v2-P/pints-team__pints-1444/runs/pilot-pints-team__pints-1444-190773ed22/logs/agent1/agent1-27.log","tree_digest":"c0b02ae013708d76603151442921fda84ec4eefc972582eaf17e8dd2ff51aead","tree_download_s":35.2115800420288,"started_at":"2026-10-03T20:32:40.402692Z","duration_s":2.532436,"timed_out":false,"image_before":"75c6ada7-2147-4195-b31e-0390facd6dcb","image_after":"ad353ed4-1108-46f2-81a1-82f0f7d34070","junit":{"passed":["pints/tests/test_evaluators.py::TestEvaluators::test_multi_sequential"],"failed":[],"errors":[],"skipped":[],"collection_errors":[],"failure_text":{}},"diff":null,"patch_sha256":null,"dropped_paths":[],"snapshot_sha":null}
{"receipt_id":"agent1-28","seq":28,"branch_id":"agent1","kind":"command","cmd":"python -c \"import pints; print(hasattr(pints, 'MultiSequentialEvaluator')); print(getattr(pints, 'MultiSequentialEvaluator', 'NOT FOUND'))\"","path":null,"exit_code":0,"stdout_tail":"True\n<class 'pints._evaluation.MultiSequentialEvaluator'>\n","stderr_tail":"","stdout_sha256":"cfec216a45987f0375e0641f017cb37aafb63daf5a88945e32fcd5935e027e21","log_path":"~/dev/nebius-hackathon/pilot/v2-P/pints-team__pints-1444/runs/pilot-pints-team__pints-1444-190773ed22/logs/agent1/agent1-28.log","tree_digest":null,"tree_download_s":null,"started_at":"2026-10-03T20:33:23.471355Z","duration_s":1.1126060000000002,"timed_out":false,"image_before":"ad353ed4-1108-46f2-81a1-82f0f7d34070","image_after":"108961c3-288f-44a9-8fa5-b5aa81a10430","junit":null,"diff":null,"patch_sha256":null,"dropped_paths":[],"snapshot_sha":null}
{"receipt_id":"agent1-29","seq":29,"branch_id":"agent1","kind":"command","cmd":"python -c \"\nimport pints\nimport numpy as np\n\n# Test basic sequential evaluator\ndef f(x): return x**2\ne = pints.SequentialEvaluator(f)\nresult = e.evaluate([1, 2, 3])\nassert np.array_equal(result, [1, 4, 9]), f'SequentialEvaluator failed: {result}'\n\n# Test multi sequential evaluator (our new addition)\ndef f2(x): return x*2\ndef f3(x): return x*3\ne = pints.MultiSequentialEvaluator([f2, f3, f2])\nresult = e.evaluate([1, 2, 3])\nassert np.array_equal(result, [2, 6, 6]), f'MultiSequentialEvaluator failed: {result}'\n\n# Test with args\ndef f_args(x, y): return x + y\ne = pints.MultiSequentialEvaluator([f_args, f_args], [10])\nresult = e.evaluate([5, 6])\nassert np.array_equal(result, [15, 16]), f'MultiSequentialEvaluator with args failed: {result}'\n\nprint('All basic tests passed!')\n\"","path":null,"exit_code":0,"stdout_tail":"All basic tests passed!\n","stderr_tail":"","stdout_sha256":"e6bec56bdd32b2237b9cf6d32d722c5882ff62a7328722a2bd8535cf883d0106","log_path":"~/dev/nebius-hackathon/pilot/v2-P/pints-team__pints-1444/runs/pilot-pints-team__pints-1444-190773ed22/logs/agent1/agent1-29.log","tree_digest":null,"tree_download_s":null,"started_at":"2026-10-03T20:33:28.999668Z","duration_s":1.133465,"timed_out":false,"image_before":"108961c3-288f-44a9-8fa5-b5aa81a10430","image_after":"4bad4f37-65c4-4709-acb7-1c32813eb519","junit":null,"diff":null,"patch_sha256":null,"dropped_paths":[],"snapshot_sha":null}
{"receipt_id":"agent1-30","seq":30,"branch_id":"agent1","kind":"diff","cmd":"compute patch in executor staging agent1-8dd59044dfa04ae888b35d4d5af6e2d9: /opt/homebrew/Cellar/git/2.53.0/bin/git -c core.hooksPath=/dev/null -c core.attributesFile=/dev/null -c diff.external= -c core.quotePath=false add -A && /opt/homebrew/Cellar/git/2.53.0/bin/git -c core.hooksPath=/dev/null -c core.attributesFile=/dev/null -c diff.external= -c core.quotePath=false diff --cached --binary --no-ext-diff --no-textconv --no-renames 412104317dad9796c2cd629b28be40af5fec30cf","path":null,"exit_code":0,"stdout_tail":"diff --git a/pints/__init__.py b/pints/__init__.py\nindex 51b3e350..492ab4d5 100644\n--- a/pints/__init__.py\n+++ b/pints/__init__.py\n@@ -154,6 +154,7 @@ from ._error_measures import (\n from ._evaluation import (\n     evaluate,\n     Evaluator,\n+    MultiSequentialEvaluator,\n     ParallelEvaluator,\n     SequentialEvaluator,\n )\ndiff --git a/pints/_evaluation.py b/pints/_evaluation.py\nindex 51d267ee..b957ac05 100644\n--- a/pints/_evaluation.py\n+++ b/pints/_evaluation.py\n@@ -441,6 +441,77 @@ class SequentialEvaluator(Evaluator):\n         return scores\n \n \n+class MultiSequentialEvaluator(Evaluator):\n+    \"\"\"\n+    Evaluates a list of functions (or callable objects) on a corresponding\n+    list of input values, and returns a list containing the calculated\n+    function evaluations.\n+\n+    Runs sequentially, applying each function to the corresponding input\n+    value. The number of functions must match the number of input values.\n+\n+    Extends :class:`Evaluator`.\n+\n+    Parameters\n+    ----------\n+    functions : list of callable\n+        The functions to evaluate.\n+    args : list of sequence\n+        An optional list containing extra arguments for each function. If\n+        ``args`` is specified, each function will be called as\n+        ``f(x, *args)`` where ``x`` is the corresponding input value and\n+        ``args`` is the corresponding extra argument tuple.\n+    \"\"\"\n+    def __init__(self, functions, args=None):\n+        # Convert to list to allow indexing etc\n+        functions = list(functions)\n+        \n+        # Check functions\n+        if not all(callable(f) for f in functions):\n+            raise ValueError('All elements in functions must be callable.')\n+        self._functions = functions\n+\n+        # Check args\n+        if args is None:\n+            self._args = [()] * len(functions)\n+        else:\n+            try:\n+                len(args)\n+            except TypeError:\n+                raise ValueError(\n+                    'The argument `args` must be either None or a sequence.')\n+            # Args apply to all functions equally (like SequentialEvaluator)\n+            # Convert args to tuple if it isn't already a sequence\n+            # (but strings are treated as scalars here)\n+            if isinstance(args, (list, tuple)):\n+                processed_args = tuple(args)\n+            else:\n+                # Treat as single argument\n+                processed_args = (args,)\n+            # Apply the same args to all functions\n+            self._args = [processed_args] * len(functions)\n+\n+    def _evaluate(self, positions):\n+        \"\"\"\n+        See :meth:`evaluate()`.\n+        \"\"\"\n+        try:\n+            len(positions)\n+        except TypeError:\n+            raise ValueError(\n+                'The argument `positions` must be a sequence of input values'\n+                ' to the evaluator\\'s functions.')\n+        if len(self._functions) != len(positions):\n+            raise ValueError(\n+                'The length of `positions` must match the length of '\n+                '`functions`.')\n+        \n+        scores = [0] * len(positions)\n+        for k, (f, x, arg) in enumerate(zip(self._functions, positions, self._args)):\n+            scores[k] = f(x, *arg)\n+        return scores\n+\n+\n #\n # Note: For Windows multiprocessing to work, the _Worker can never be a nested\n # class!\n","stderr_tail":"","stdout_sha256":"0107fc59f441390f58db3438aa09f70efcb1fc9307896c5ef62ecdc22b10eb0a","log_path":null,"tree_digest":"c0b02ae013708d76603151442921fda84ec4eefc972582eaf17e8dd2ff51aead","tree_download_s":18.180851416895166,"started_at":"2026-10-03T20:34:53.497013Z","duration_s":0.2668530000373721,"timed_out":false,"image_before":"4bad4f37-65c4-4709-acb7-1c32813eb519","image_after":"4bad4f37-65c4-4709-acb7-1c32813eb519","junit":null,"diff":{"files":[{"path":"pints/__init__.py","added":1,"deleted":0,"category":"source","status":"modified"},{"path":"pints/_evaluation.py","added":71,"deleted":0,"category":"source","status":"modified"}],"patch_sha256":"0107fc59f441390f58db3438aa09f70efcb1fc9307896c5ef62ecdc22b10eb0a","patch_path":"~/dev/nebius-hackathon/pilot/v2-P/pints-team__pints-1444/runs/pilot-pints-team__pints-1444-190773ed22/artifacts/agent1/agent1-30.patch"},"patch_sha256":"0107fc59f441390f58db3438aa09f70efcb1fc9307896c5ef62ecdc22b10eb0a","dropped_paths":[],"snapshot_sha":"412104317dad9796c2cd629b28be40af5fec30cf"}
