{"receipt_id":"agent1-1","seq":1,"branch_id":"agent1","kind":"command","cmd":"git ls-files -z","path":null,"exit_code":0,"stdout_tail":"test_filters.py\u0000networkx/classes/tests/test_function.py\u0000networkx/classes/tests/test_graph.py\u0000networkx/classes/tests/test_graph_historical.py\u0000networkx/classes/tests/test_graphviews.py\u0000networkx/classes/tests/test_multidigraph.py\u0000networkx/classes/tests/test_multigraph.py\u0000networkx/classes/tests/test_ordered.py\u0000networkx/classes/tests/test_reportviews.py\u0000networkx/classes/tests/test_special.py\u0000networkx/classes/tests/test_subgraphviews.py\u0000networkx/convert.py\u0000networkx/convert_matrix.py\u0000networkx/drawing/__init__.py\u0000networkx/drawing/layout.py\u0000networkx/drawing/nx_agraph.py\u0000networkx/drawing/nx_pydot.py\u0000networkx/drawing/nx_pylab.py\u0000networkx/drawing/tests/test_agraph.py\u0000networkx/drawing/tests/test_layout.py\u0000networkx/drawing/tests/test_pydot.py\u0000networkx/drawing/tests/test_pylab.py\u0000networkx/exception.py\u0000networkx/generators/__init__.py\u0000networkx/generators/atlas.dat.gz\u0000networkx/generators/atlas.py\u0000networkx/generators/classic.py\u0000networkx/generators/community.py\u0000networkx/generators/degree_seq.py\u0000networkx/generators/directed.py\u0000networkx/generators/duplication.py\u0000networkx/generators/ego.py\u0000networkx/generators/expanders.py\u0000networkx/generators/geometric.py\u0000networkx/generators/intersection.py\u0000networkx/generators/joint_degree_seq.py\u0000networkx/generators/lattice.py\u0000networkx/generators/line.py\u0000networkx/generators/mycielski.py\u0000networkx/generators/nonisomorphic_trees.py\u0000networkx/generators/random_clustered.py\u0000networkx/generators/random_graphs.py\u0000networkx/generators/small.py\u0000networkx/generators/social.py\u0000networkx/generators/spectral_graph_forge.py\u0000networkx/generators/stochastic.py\u0000networkx/generators/tests/test_atlas.py\u0000networkx/generators/tests/test_classic.py\u0000networkx/generators/tests/test_community.py\u0000networkx/generators/tests/test_degree_seq.py\u0000networkx/generators/tests/test_directed.py\u0000networkx/generators/tests/test_duplication.py\u0000networkx/generators/tests/test_ego.py\u0000networkx/generators/tests/test_expanders.py\u0000networkx/generators/tests/test_geometric.py\u0000networkx/generators/tests/test_intersection.py\u0000networkx/generators/tests/test_joint_degree_seq.py\u0000networkx/generators/tests/test_lattice.py\u0000networkx/generators/tests/test_line.py\u0000networkx/generators/tests/test_mycielski.py\u0000networkx/generators/tests/test_nonisomorphic_trees.py\u0000networkx/generators/tests/test_random_clustered.py\u0000networkx/generators/tests/test_random_graphs.py\u0000networkx/generators/tests/test_small.py\u0000networkx/generators/tests/test_spectral_graph_forge.py\u0000networkx/generators/tests/test_stochastic.py\u0000networkx/generators/tests/test_trees.py\u0000networkx/generators/tests/test_triads.py\u0000networkx/generators/trees.py\u0000networkx/generators/triads.py\u0000networkx/linalg/__init__.py\u0000networkx/linalg/algebraicconnectivity.py\u0000networkx/linalg/attrmatrix.py\u0000networkx/linalg/graphmatrix.py\u0000networkx/linalg/laplacianmatrix.py\u0000networkx/linalg/modularitymatrix.py\u0000networkx/linalg/spectrum.py\u0000networkx/linalg/tests/test_algebraic_connectivity.py\u0000networkx/linalg/tests/test_graphmatrix.py\u0000networkx/linalg/tests/test_laplacian.py\u0000networkx/linalg/tests/test_modularity.py\u0000networkx/linalg/tests/test_spectrum.py\u0000networkx/readwrite/__init__.py\u0000networkx/readwrite/adjlist.py\u0000networkx/readwrite/edgelist.py\u0000networkx/readwrite/gexf.py\u0000networkx/readwrite/gml.py\u0000networkx/readwrite/gpickle.py\u0000networkx/readwrite/graph6.py\u0000networkx/readwrite/graphml.py\u0000networkx/readwrite/json_graph/__init__.py\u0000networkx/readwrite/json_graph/adjacency.py\u0000networkx/readwrite/json_graph/cytoscape.py\u0000networkx/readwrite/json_graph/jit.py\u0000networkx/readwrite/json_graph/node_link.py\u0000networkx/readwrite/json_graph/tests/test_adjacency.py\u0000networkx/readwrite/json_graph/tests/test_cytoscape.py\u0000networkx/readwrite/json_graph/tests/test_jit.py\u0000networkx/readwrite/json_graph/tests/test_node_link.py\u0000networkx/readwrite/json_graph/tests/test_tree.py\u0000networkx/readwrite/json_graph/tree.py\u0000networkx/readwrite/leda.py\u0000networkx/readwrite/multiline_adjlist.py\u0000networkx/readwrite/nx_shp.py\u0000networkx/readwrite/nx_yaml.py\u0000networkx/readwrite/p2g.py\u0000networkx/readwrite/pajek.py\u0000networkx/readwrite/sparse6.py\u0000networkx/readwrite/tests/test_adjlist.py\u0000networkx/readwrite/tests/test_edgelist.py\u0000networkx/readwrite/tests/test_gexf.py\u0000networkx/readwrite/tests/test_gml.py\u0000networkx/readwrite/tests/test_gpickle.py\u0000networkx/readwrite/tests/test_graph6.py\u0000networkx/readwrite/tests/test_graphml.py\u0000networkx/readwrite/tests/test_leda.py\u0000networkx/readwrite/tests/test_p2g.py\u0000networkx/readwrite/tests/test_pajek.py\u0000networkx/readwrite/tests/test_shp.py\u0000networkx/readwrite/tests/test_sparse6.py\u0000networkx/readwrite/tests/test_yaml.py\u0000networkx/relabel.py\u0000networkx/release.py\u0000networkx/testing/__init__.py\u0000networkx/testing/tests/test_utils.py\u0000networkx/testing/utils.py\u0000networkx/tests/README\u0000networkx/tests/__init__.py\u0000networkx/tests/test.py\u0000networkx/tests/test_all_random_functions.py\u0000networkx/tests/test_convert.py\u0000networkx/tests/test_convert_numpy.py\u0000networkx/tests/test_convert_pandas.py\u0000networkx/tests/test_convert_scipy.py\u0000networkx/tests/test_exceptions.py\u0000networkx/tests/test_relabel.py\u0000networkx/utils/__init__.py\u0000networkx/utils/contextmanagers.py\u0000networkx/utils/decorators.py\u0000networkx/utils/heaps.py\u0000networkx/utils/mapped_queue.py\u0000networkx/utils/misc.py\u0000networkx/utils/random_sequence.py\u0000networkx/utils/rcm.py\u0000networkx/utils/tests/test.txt\u0000networkx/utils/tests/test_contextmanager.py\u0000networkx/utils/tests/test_decorators.py\u0000networkx/utils/tests/test_heaps.py\u0000networkx/utils/tests/test_mapped_queue.py\u0000networkx/utils/tests/test_misc.py\u0000networkx/utils/tests/test_random_sequence.py\u0000networkx/utils/tests/test_rcm.py\u0000networkx/utils/tests/test_unionfind.py\u0000networkx/utils/union_find.py\u0000requirements.txt\u0000requirements/README.md\u0000requirements/default.txt\u0000requirements/doc.txt\u0000requirements/extras.txt\u0000requirements/test.txt\u0000setup.cfg\u0000setup.py\u0000tools/appveyor/install.ps1\u0000tools/appveyor/run_with_env.cmd\u0000tools/gitwash_dumper.py\u0000tools/travis/before_install.sh\u0000tools/travis/build_docs.sh\u0000tools/travis/deploy-key.enc\u0000tools/travis/deploy_docs.sh\u0000tools/travis/linux_install.sh\u0000tools/travis/osx_install.sh\u0000tools/travis/script.sh\u0000","stderr_tail":"","stdout_sha256":"9f4bfe20a59ce6afc3450fa2df94cee17ea13b321737fa92e7ca034a3f9ea707","log_path":"~/dev/nebius-hackathon/pilot/v2-P/networkx__networkx-3101/runs/pilot-networkx__networkx-3101-6b3707109a/logs/agent1/agent1-1.log","tree_digest":null,"tree_download_s":null,"started_at":"2026-10-03T17:58:14.981332Z","duration_s":0.003384,"timed_out":false,"image_before":"7f5734c9-5d1b-4e88-bbc8-1f6294f3b7d8","image_after":"19268c8f-9da5-4404-8696-34818c207423","junit":null,"diff":null,"patch_sha256":null,"dropped_paths":[],"snapshot_sha":null}
{"receipt_id":"agent1-2","seq":2,"branch_id":"agent1","kind":"write","cmd":"/opt/receipts-5e86bb76966a4145bd57fc23b6ff0a18/bin/busybox sh -c 'mkdir -p /networkx/networkx/classes && cp /opt/receipts-5e86bb76966a4145bd57fc23b6ff0a18/incoming/31283c43abf82ae027625d63bcbc085d8c1885e389bbaffb74c8b466cf9e7180 /networkx/networkx/classes/digraph.py'","path":"networkx/classes/digraph.py","exit_code":0,"stdout_tail":"","stderr_tail":"","stdout_sha256":"31283c43abf82ae027625d63bcbc085d8c1885e389bbaffb74c8b466cf9e7180","log_path":"~/dev/nebius-hackathon/pilot/v2-P/networkx__networkx-3101/runs/pilot-networkx__networkx-3101-6b3707109a/logs/agent1/agent1-2.log","tree_digest":null,"tree_download_s":null,"started_at":"2026-10-03T17:58:34.841988Z","duration_s":0.005396,"timed_out":false,"image_before":"19268c8f-9da5-4404-8696-34818c207423","image_after":"5e7240e5-9112-4e04-81bf-8bc9599e429c","junit":null,"diff":null,"patch_sha256":null,"dropped_paths":[],"snapshot_sha":null}
{"receipt_id":"agent1-3","seq":3,"branch_id":"agent1","kind":"command","cmd":"/opt/receipts-f1f35ac114374f318f4d98959607c8de/bin/busybox mkdir -p /opt/receipts/reports && python -I /opt/receipts-f1f35ac114374f318f4d98959607c8de/receipts_pytest.py networkx/classes/tests/test_special.py::test_factories -v -o junit_family=xunit1 -p no:cacheprovider -rA --continue-on-collection-errors --junitxml=/opt/receipts/reports/agent1-3.xml","path":null,"exit_code":0,"stdout_tail":"============================= test session starts ==============================\nplatform linux -- Python 3.7.17, pytest-7.4.4, pluggy-1.2.0 -- /usr/local/bin/python\nrootdir: /networkx\ncollecting ... collected 1 item\n\nnetworkx/classes/tests/test_special.py::test_factories PASSED            [100%]\n\n=============================== warnings summary ===============================\n../usr/local/lib/python3.7/site-packages/nose/plugins/manager.py:418\n  /usr/local/lib/python3.7/site-packages/nose/plugins/manager.py:418: DeprecationWarning: pkg_resources is deprecated as an API. See https://setuptools.pypa.io/en/latest/pkg_resources.html\n    import pkg_resources\n\n../usr/local/lib/python3.7/site-packages/nose/importer.py:12\n  /usr/local/lib/python3.7/site-packages/nose/importer.py:12: DeprecationWarning: the imp module is deprecated in favour of importlib; see the module's documentation for alternative uses\n    from imp import find_module, load_module, acquire_lock, release_lock\n\nnetworkx/classes/graph.py:23\n  /networkx/networkx/classes/graph.py:23: DeprecationWarning: Using or importing the ABCs from 'collections' instead of from 'collections.abc' is deprecated since Python 3.3,and in 3.9 it will stop working\n    from collections import Mapping\n\nnetworkx/classes/reportviews.py:95\nnetworkx/classes/reportviews.py:95\n  /networkx/networkx/classes/reportviews.py:95: DeprecationWarning: Using or importing the ABCs from 'collections' instead of from 'collections.abc' is deprecated since Python 3.3,and in 3.9 it will stop working\n    from collections import Mapping, Set, Iterable\n\nnetworkx/generators/expanders.py:70\n  /networkx/networkx/generators/expanders.py:70: DeprecationWarning: invalid escape sequence \\s\n    \"\"\"\n\nnetworkx/generators/geometric.py:275\n  /networkx/networkx/generators/geometric.py:275: DeprecationWarning: invalid escape sequence \\l\n    \"\"\"\n\nnetworkx/generators/geometric.py:764\n  /networkx/networkx/generators/geometric.py:764: DeprecationWarning: invalid escape sequence \\l\n    \"\"\"\n\nnetworkx/algorithms/centrality/current_flow_betweenness.py:325\n  /networkx/networkx/algorithms/centrality/current_flow_betweenness.py:325: DeprecationWarning: invalid escape sequence \\l\n    \"\"\"\n\nnetworkx/algorithms/cluster.py:534\n  /networkx/networkx/algorithms/cluster.py:534: DeprecationWarning: invalid escape sequence \\m\n    \"\"\"\n\nnetworkx/algorithms/reciprocity.py:47\n  /networkx/networkx/algorithms/reciprocity.py:47: DeprecationWarning: invalid escape sequence \\i\n    \"\"\"\n\nnetworkx/algorithms/shortest_paths/weighted.py:2023\n  /networkx/networkx/algorithms/shortest_paths/weighted.py:2023: DeprecationWarning: invalid escape sequence \\p\n    \"\"\"\n\nnetworkx/algorithms/connectivity/connectivity.py:302\n  /networkx/networkx/algorithms/connectivity/connectivity.py:302: DeprecationWarning: invalid escape sequence \\d\n    \"\"\"\n\nnetworkx/algorithms/flow/preflowpush.py:426\n  /networkx/networkx/algorithms/flow/preflowpush.py:426: DeprecationWarning: invalid escape sequence \\s\n    \"\"\"\n\nnetworkx/algorithms/flow/shortestaugmentingpath.py:298\n  /networkx/networkx/algorithms/flow/shortestaugmentingpath.py:298: DeprecationWarning: invalid escape sequence \\m\n    \"\"\"\n\nnetworkx/algorithms/connectivity/stoerwagner.py:94\n  /networkx/networkx/algorithms/connectivity/stoerwagner.py:94: DeprecationWarning: invalid escape sequence \\l\n    \"\"\"\n\nnetworkx/generators/lattice.py:226\n  /networkx/networkx/generators/lattice.py:226: DeprecationWarning: invalid escape sequence \\s\n    \"\"\"\n\nnetworkx/generators/line.py:113\n  /networkx/networkx/generators/line.py:113: DeprecationWarning: invalid escape sequence \\{\n    \"\"\"\n\nnetworkx/linalg/modularitymatrix.py:74\n  /networkx/networkx/linalg/modularitymatrix.py:74: DeprecationWarning: invalid escape sequence \\o\n    \"\"\"\n\n-- Docs: https://docs.pytest.org/en/stable/how-to/capture-warnings.html\n==================================== PASSES ====================================\n------------ generated xml file: /opt/receipts/reports/agent1-3.xml ------------\n=========================== short test summary info ============================\nPASSED networkx/classes/tests/test_special.py::test_factories\n======================== 1 passed, 19 warnings in 0.38s ========================\n","stderr_tail":"","stdout_sha256":"6e9cfc319df950557b4a46a97b350bee32cfb62a725884651cfde2ef82c7a3eb","log_path":"~/dev/nebius-hackathon/pilot/v2-P/networkx__networkx-3101/runs/pilot-networkx__networkx-3101-6b3707109a/logs/agent1/agent1-3.log","tree_digest":"3ceae08433a84217b99823bd132d03ce399448970108e950f41275c04a19ce36","tree_download_s":23.64804904186167,"started_at":"2026-10-03T17:58:37.262043Z","duration_s":0.47200400000000003,"timed_out":false,"image_before":"5e7240e5-9112-4e04-81bf-8bc9599e429c","image_after":"b1dba33e-3d6f-4a83-b919-75043e77b260","junit":{"passed":["networkx/classes/tests/test_special.py::test_factories"],"failed":[],"errors":[],"skipped":[],"collection_errors":[],"failure_text":{}},"diff":null,"patch_sha256":null,"dropped_paths":[],"snapshot_sha":null}
{"receipt_id":"agent1-4","seq":4,"branch_id":"agent1","kind":"command","cmd":"/opt/receipts-1f56f276fcc74cdf9291a2b9fb429176/bin/busybox mkdir -p /opt/receipts/reports && python -I /opt/receipts-1f56f276fcc74cdf9291a2b9fb429176/receipts_pytest.py --no-header -rA --tb=line --color=no -p no:cacheprovider -W ignore::DeprecationWarning networkx/algorithms/shortest_paths/tests/test_weighted.py networkx/algorithms/shortest_paths/weighted.py networkx/classes/tests/test_special.py -o junit_family=xunit1 -p no:cacheprovider -rA --continue-on-collection-errors --junitxml=/opt/receipts/reports/agent1-4.xml","path":null,"exit_code":1,"stdout_tail":"ses/tests/test_special.py::TestMultiGraph::test_remove_node\nFAILED networkx/classes/tests/test_special.py::TestMultiGraph::test_add_edge\nFAILED networkx/classes/tests/test_special.py::TestMultiGraph::test_add_edge_conflicting_key\nFAILED networkx/classes/tests/test_special.py::TestMultiGraph::test_add_edges_from\nFAILED networkx/classes/tests/test_special.py::TestMultiGraph::test_remove_edge\nFAILED networkx/classes/tests/test_special.py::TestMultiGraph::test_remove_edges_from\nFAILED networkx/classes/tests/test_special.py::TestMultiGraph::test_remove_multiedge\nFAILED networkx/classes/tests/test_special.py::TestMultiDiGraph::test_contains\nFAILED networkx/classes/tests/test_special.py::TestMultiDiGraph::test_order\nFAILED networkx/classes/tests/test_special.py::TestMultiDiGraph::test_nodes\nFAILED networkx/classes/tests/test_special.py::TestMultiDiGraph::test_has_node\nFAILED networkx/classes/tests/test_special.py::TestMultiDiGraph::test_neighbors\nFAILED networkx/classes/tests/test_special.py::TestMultiDiGraph::test_memory_leak\nFAILED networkx/classes/tests/test_special.py::TestMultiDiGraph::test_nbunch_iter\nFAILED networkx/classes/tests/test_special.py::TestMultiDiGraph::test_nbunch_iter_node_format_raise\nFAILED networkx/classes/tests/test_special.py::TestMultiDiGraph::test_selfloop_degree\nFAILED networkx/classes/tests/test_special.py::TestMultiDiGraph::test_selfloops\nFAILED networkx/classes/tests/test_special.py::TestMultiDiGraph::test_weighted_degree\nFAILED networkx/classes/tests/test_special.py::TestMultiDiGraph::test_name - ...\nFAILED networkx/classes/tests/test_special.py::TestMultiDiGraph::test_graph_chain\nFAILED networkx/classes/tests/test_special.py::TestMultiDiGraph::test_copy - ...\nFAILED networkx/classes/tests/test_special.py::TestMultiDiGraph::test_class_copy\nFAILED networkx/classes/tests/test_special.py::TestMultiDiGraph::test_fresh_copy\nFAILED networkx/classes/tests/test_special.py::TestMultiDiGraph::test_graph_attr\nFAILED networkx/classes/tests/test_special.py::TestMultiDiGraph::test_node_attr\nFAILED networkx/classes/tests/test_special.py::TestMultiDiGraph::test_node_attr2\nFAILED networkx/classes/tests/test_special.py::TestMultiDiGraph::test_edge_attr\nFAILED networkx/classes/tests/test_special.py::TestMultiDiGraph::test_edge_attr2\nFAILED networkx/classes/tests/test_special.py::TestMultiDiGraph::test_edge_attr3\nFAILED networkx/classes/tests/test_special.py::TestMultiDiGraph::test_subgraph\nFAILED networkx/classes/tests/test_special.py::TestMultiDiGraph::test_selfloops_attr\nFAILED networkx/classes/tests/test_special.py::TestMultiDiGraph::test_pickle\nFAILED networkx/classes/tests/test_special.py::TestMultiDiGraph::test_add_node\nFAILED networkx/classes/tests/test_special.py::TestMultiDiGraph::test_add_nodes_from\nFAILED networkx/classes/tests/test_special.py::TestMultiDiGraph::test_remove_nodes_from\nFAILED networkx/classes/tests/test_special.py::TestMultiDiGraph::test_clear\nFAILED networkx/classes/tests/test_special.py::TestMultiDiGraph::test_update\nFAILED networkx/classes/tests/test_special.py::TestMultiDiGraph::test_has_edge\nFAILED networkx/classes/tests/test_special.py::TestMultiDiGraph::test_get_edge_data\nFAILED networkx/classes/tests/test_special.py::TestMultiDiGraph::test_adjacency\nFAILED networkx/classes/tests/test_special.py::TestMultiDiGraph::test_to_directed\nFAILED networkx/classes/tests/test_special.py::TestMultiDiGraph::test_number_of_edges_selfloops\nFAILED networkx/classes/tests/test_special.py::TestMultiDiGraph::test_edge_lookup\nFAILED networkx/classes/tests/test_special.py::TestMultiDiGraph::test_edge_attr4\nFAILED networkx/classes/tests/test_special.py::TestMultiDiGraph::test_data_input\nFAILED networkx/classes/tests/test_special.py::TestMultiDiGraph::test_getitem\nFAILED networkx/classes/tests/test_special.py::TestMultiDiGraph::test_remove_node\nFAILED networkx/classes/tests/test_special.py::TestMultiDiGraph::test_add_edge_conflicting_key\nFAILED networkx/classes/tests/test_special.py::TestMultiDiGraph::test_edges\nFAILED networkx/classes/tests/test_special.py::TestMultiDiGraph::test_edges_data\nFAILED networkx/classes/tests/test_special.py::TestMultiDiGraph::test_edges_multi\nFAILED networkx/classes/tests/test_special.py::TestMultiDiGraph::test_out_edges\nFAILED networkx/classes/tests/test_special.py::TestMultiDiGraph::test_out_edges_multi\nFAILED networkx/classes/tests/test_special.py::TestMultiDiGraph::test_out_edges_data\nFAILED networkx/classes/tests/test_special.py::TestMultiDiGraph::test_in_edges\nFAILED networkx/classes/tests/test_special.py::TestMultiDiGraph::test_in_edges_no_keys\nFAILED networkx/classes/tests/test_special.py::TestMultiDiGraph::test_in_edges_data\nFAILED networkx/classes/tests/test_special.py::TestMultiDiGraph::test_to_undirected\nFAILED networkx/classes/tests/test_special.py::TestMultiDiGraph::test_has_successor\nFAILED networkx/classes/tests/test_special.py::TestMultiDiGraph::test_successors\nFAILED networkx/classes/tests/test_special.py::TestMultiDiGraph::test_has_predecessor\nFAILED networkx/classes/tests/test_special.py::TestMultiDiGraph::test_predecessors\nFAILED networkx/classes/tests/test_special.py::TestMultiDiGraph::test_degree\nFAILED networkx/classes/tests/test_special.py::TestMultiDiGraph::test_in_degree\nFAILED networkx/classes/tests/test_special.py::TestMultiDiGraph::test_out_degree\nFAILED networkx/classes/tests/test_special.py::TestMultiDiGraph::test_size - ...\nFAILED networkx/classes/tests/test_special.py::TestMultiDiGraph::test_to_undirected_reciprocal\nFAILED networkx/classes/tests/test_special.py::TestMultiDiGraph::test_add_edge\nFAILED networkx/classes/tests/test_special.py::TestMultiDiGraph::test_add_edges_from\nFAILED networkx/classes/tests/test_special.py::TestMultiDiGraph::test_remove_edge\nFAILED networkx/classes/tests/test_special.py::TestMultiDiGraph::test_remove_multiedge\nFAILED networkx/classes/tests/test_special.py::TestMultiDiGraph::test_remove_edges_from\n======================== 224 failed, 44 passed in 0.92s ========================\n","stderr_tail":"","stdout_sha256":"3feb09a7c4a820ad6eda4902fb5025c36e21b2462216e0bf2b8217af0f05e1b5","log_path":"~/dev/nebius-hackathon/pilot/v2-P/networkx__networkx-3101/runs/pilot-networkx__networkx-3101-6b3707109a/logs/agent1/agent1-4.log","tree_digest":"3ceae08433a84217b99823bd132d03ce399448970108e950f41275c04a19ce36","tree_download_s":3.5529057499952614,"started_at":"2026-10-03T17:59:06.136271Z","duration_s":0.8496509999999999,"timed_out":false,"image_before":"b1dba33e-3d6f-4a83-b919-75043e77b260","image_after":"6721af3b-0ea2-4366-b005-65c78c140c5a","junit":{"passed":["networkx/algorithms/shortest_paths/tests/test_weighted.py::TestWeightedPath::test_dijkstra","networkx/algorithms/shortest_paths/tests/test_weighted.py::TestWeightedPath::test_bidirectional_dijkstra","networkx/algorithms/shortest_paths/tests/test_weighted.py::TestWeightedPath::test_bidirectional_dijkstra_no_path","networkx/algorithms/shortest_paths/tests/test_weighted.py::TestWeightedPath::test_absent_source","networkx/algorithms/shortest_paths/tests/test_weighted.py::TestWeightedPath::test_dijkstra_predecessor1","networkx/algorithms/shortest_paths/tests/test_weighted.py::TestWeightedPath::test_dijkstra_predecessor2","networkx/algorithms/shortest_paths/tests/test_weighted.py::TestWeightedPath::test_dijkstra_predecessor3","networkx/algorithms/shortest_paths/tests/test_weighted.py::TestWeightedPath::test_single_source_dijkstra_path_length","networkx/algorithms/shortest_paths/tests/test_weighted.py::TestWeightedPath::test_bidirectional_dijkstra_multigraph","networkx/algorithms/shortest_paths/tests/test_weighted.py::TestWeightedPath::test_dijkstra_pred_distance_multigraph","networkx/algorithms/shortest_paths/tests/test_weighted.py::TestWeightedPath::test_negative_edge_cycle","networkx/algorithms/shortest_paths/tests/test_weighted.py::TestWeightedPath::test_weight_function","networkx/algorithms/shortest_paths/tests/test_weighted.py::TestWeightedPath::test_all_pairs_dijkstra_path","networkx/algorithms/shortest_paths/tests/test_weighted.py::TestWeightedPath::test_all_pairs_dijkstra_path_length","networkx/algorithms/shortest_paths/tests/test_weighted.py::TestWeightedPath::test_all_pairs_dijkstra","networkx/algorithms/shortest_paths/tests/test_weighted.py::TestDijkstraPathLength::test_weight_function","networkx/algorithms/shortest_paths/tests/test_weighted.py::TestMultiSourceDijkstra::test_no_sources","networkx/algorithms/shortest_paths/tests/test_weighted.py::TestMultiSourceDijkstra::test_path_no_sources","networkx/algorithms/shortest_paths/tests/test_weighted.py::TestMultiSourceDijkstra::test_path_length_no_sources","networkx/algorithms/shortest_paths/tests/test_weighted.py::TestMultiSourceDijkstra::test_absent_source","networkx/algorithms/shortest_paths/tests/test_weighted.py::TestMultiSourceDijkstra::test_two_sources","networkx/algorithms/shortest_paths/tests/test_weighted.py::TestMultiSourceDijkstra::test_simple_paths","networkx/algorithms/shortest_paths/tests/test_weighted.py::TestBellmanFordAndGoldbergRadzik::test_single_node_graph","networkx/algorithms/shortest_paths/tests/test_weighted.py::TestBellmanFordAndGoldbergRadzik::test_absent_source_bellman_ford","networkx/algorithms/shortest_paths/tests/test_weighted.py::TestBellmanFordAndGoldbergRadzik::test_absent_source_goldberg_radzik","networkx/algorithms/shortest_paths/tests/test_weighted.py::TestBellmanFordAndGoldbergRadzik::test_negative_weight_cycle","networkx/algorithms/shortest_paths/tests/test_weighted.py::TestBellmanFordAndGoldbergRadzik::test_not_connected","networkx/algorithms/shortest_paths/tests/test_weighted.py::TestBellmanFordAndGoldbergRadzik::test_multigraph","networkx/algorithms/shortest_paths/tests/test_weighted.py::TestBellmanFordAndGoldbergRadzik::test_others","networkx/algorithms/shortest_paths/tests/test_weighted.py::TestBellmanFordAndGoldbergRadzik::test_path_graph","networkx/algorithms/shortest_paths/tests/test_weighted.py::TestBellmanFordAndGoldbergRadzik::test_4_cycle","networkx/algorithms/shortest_paths/tests/test_weighted.py::TestJohnsonAlgorithm::test_single_node_graph","networkx/algorithms/shortest_paths/tests/test_weighted.py::TestJohnsonAlgorithm::test_negative_cycle","networkx/algorithms/shortest_paths/tests/test_weighted.py::TestJohnsonAlgorithm::test_negative_weights","networkx/algorithms/shortest_paths/tests/test_weighted.py::TestJohnsonAlgorithm::test_unweighted_graph","networkx/algorithms/shortest_paths/tests/test_weighted.py::TestJohnsonAlgorithm::test_graphs","networkx/classes/tests/test_digraph.py::networkx::classes::tests::test_special::TestDiGraph::test_out_edges_data","networkx/classes/tests/test_digraph.py::networkx::classes::tests::test_special::TestDiGraph::test_in_edges_data","networkx/classes/tests/test_digraph.py::networkx::classes::tests::test_special::TestDiGraph::test_reverse_copy","networkx/classes/tests/test_digraph.py::networkx::classes::tests::test_special::TestDiGraph::test_reverse_nocopy","networkx/classes/tests/test_digraph.py::networkx::classes::tests::test_special::TestDiGraph::test_reverse_hashable","networkx/classes/tests/test_multidigraph.py::networkx::classes::tests::test_special::TestMultiDiGraph::test_reverse_copy","networkx/classes/tests/test_multidigraph.py::networkx::classes::tests::test_special::TestMultiDiGraph::test_reverse_nocopy","networkx/classes/tests/test_special.py::test_factories"],"failed":["networkx/classes/tests/test_graph.py::networkx::classes::tests::test_special::TestGraph::test_contains","networkx/classes/tests/test_graph.py::networkx::classes::tests::test_special::TestGraph::test_order","networkx/classes/tests/test_graph.py::networkx::classes::tests::test_special::TestGraph::test_nodes","networkx/classes/tests/test_graph.py::networkx::classes::tests::test_special::TestGraph::test_has_node","networkx/classes/tests/test_graph.py::networkx::classes::tests::test_special::TestGraph::test_has_edge","networkx/classes/tests/test_graph.py::networkx::classes::tests::test_special::TestGraph::test_neighbors","networkx/classes/tests/test_graph.py::networkx::classes::tests::test_special::TestGraph::test_memory_leak","networkx/classes/tests/test_graph.py::networkx::classes::tests::test_special::TestGraph::test_edges","networkx/classes/tests/test_graph.py::networkx::classes::tests::test_special::TestGraph::test_degree","networkx/classes/tests/test_graph.py::networkx::classes::tests::test_special::TestGraph::test_size","networkx/classes/tests/test_graph.py::networkx::classes::tests::test_special::TestGraph::test_nbunch_iter","networkx/classes/tests/test_graph.py::networkx::classes::tests::test_special::TestGraph::test_nbunch_iter_node_format_raise","networkx/classes/tests/test_graph.py::networkx::classes::tests::test_special::TestGraph::test_selfloop_degree","networkx/classes/tests/test_graph.py::networkx::classes::tests::test_special::TestGraph::test_selfloops","networkx/classes/tests/test_graph.py::networkx::classes::tests::test_special::TestGraph::test_weighted_degree","networkx/classes/tests/test_graph.py::networkx::classes::tests::test_special::TestGraph::test_name","networkx/classes/tests/test_graph.py::networkx::classes::tests::test_special::TestGraph::test_graph_chain","networkx/classes/tests/test_graph.py::networkx::classes::tests::test_special::TestGraph::test_copy","networkx/classes/tests/test_graph.py::networkx::classes::tests::test_special::TestGraph::test_class_copy","networkx/classes/tests/test_graph.py::networkx::classes::tests::test_special::TestGraph::test_fresh_copy","networkx/classes/tests/test_graph.py::networkx::classes::tests::test_special::TestGraph::test_graph_attr","networkx/classes/tests/test_graph.py::networkx::classes::tests::test_special::TestGraph::test_node_attr","networkx/classes/tests/test_graph.py::networkx::classes::tests::test_special::TestGraph::test_node_attr2","networkx/classes/tests/test_graph.py::networkx::classes::tests::test_special::TestGraph::test_edge_lookup","networkx/classes/tests/test_graph.py::networkx::classes::tests::test_special::TestGraph::test_edge_attr","networkx/classes/tests/test_graph.py::networkx::classes::tests::test_special::TestGraph::test_edge_attr2","networkx/classes/tests/test_graph.py::networkx::classes::tests::test_special::TestGraph::test_edge_attr3","networkx/classes/tests/test_graph.py::networkx::classes::tests::test_special::TestGraph::test_edge_attr4","networkx/classes/tests/test_graph.py::networkx::classes::tests::test_special::TestGraph::test_to_undirected","networkx/classes/tests/test_graph.py::networkx::classes::tests::test_special::TestGraph::test_to_directed","networkx/classes/tests/test_graph.py::networkx::classes::tests::test_special::TestGraph::test_subgraph","networkx/classes/tests/test_graph.py::networkx::classes::tests::test_special::TestGraph::test_selfloops_attr","networkx/classes/tests/test_graph.py::networkx::classes::tests::test_special::TestGraph::test_pickle","networkx/classes/tests/test_graph.py::networkx::classes::tests::test_special::TestGraph::test_data_input","networkx/classes/tests/test_graph.py::networkx::classes::tests::test_special::TestGraph::test_adjacency","networkx/classes/tests/test_graph.py::networkx::classes::tests::test_special::TestGraph::test_getitem","networkx/classes/tests/test_graph.py::networkx::classes::tests::test_special::TestGraph::test_add_node","networkx/classes/tests/test_graph.py::networkx::classes::tests::test_special::TestGraph::test_add_nodes_from","networkx/classes/tests/test_graph.py::networkx::classes::tests::test_special::TestGraph::test_remove_node","networkx/classes/tests/test_graph.py::networkx::classes::tests::test_special::TestGraph::test_remove_nodes_from","networkx/classes/tests/test_graph.py::networkx::classes::tests::test_special::TestGraph::test_add_edge","networkx/classes/tests/test_graph.py::networkx::classes::tests::test_special::TestGraph::test_add_edges_from","networkx/classes/tests/test_graph.py::networkx::classes::tests::test_special::TestGraph::test_remove_edge","networkx/classes/tests/test_graph.py::networkx::classes::tests::test_special::TestGraph::test_remove_edges_from","networkx/classes/tests/test_graph.py::networkx::classes::tests::test_special::TestGraph::test_clear","networkx/classes/tests/test_graph.py::networkx::classes::tests::test_special::TestGraph::test_edges_data","networkx/classes/tests/test_graph.py::networkx::classes::tests::test_special::TestGraph::test_get_edge_data","networkx/classes/tests/test_graph.py::networkx::classes::tests::test_special::TestGraph::test_update","networkx/classes/tests/test_graph.py::networkx::classes::tests::test_special::TestDiGraph::test_contains","networkx/classes/tests/test_graph.py::networkx::classes::tests::test_special::TestDiGraph::test_order","networkx/classes/tests/test_graph.py::networkx::classes::tests::test_special::TestDiGraph::test_nodes","networkx/classes/tests/test_graph.py::networkx::classes::tests::test_special::TestDiGraph::test_has_node","networkx/classes/tests/test_graph.py::networkx::classes::tests::test_special::TestDiGraph::test_has_edge","networkx/classes/tests/test_graph.py::networkx::classes::tests::test_special::TestDiGraph::test_neighbors","networkx/classes/tests/test_graph.py::networkx::classes::tests::test_special::TestDiGraph::test_memory_leak","networkx/classes/tests/test_graph.py::networkx::classes::tests::test_special::TestDiGraph::test_nbunch_iter","networkx/classes/tests/test_graph.py::networkx::classes::tests::test_special::TestDiGraph::test_nbunch_iter_node_format_raise","networkx/classes/tests/test_graph.py::networkx::classes::tests::test_special::TestDiGraph::test_selfloop_degree","networkx/classes/tests/test_graph.py::networkx::classes::tests::test_special::TestDiGraph::test_selfloops","networkx/classes/tests/test_graph.py::networkx::classes::tests::test_special::TestDiGraph::test_weighted_degree","networkx/classes/tests/test_graph.py::networkx::classes::tests::test_special::TestDiGraph::test_name","networkx/classes/tests/test_graph.py::networkx::classes::tests::test_special::TestDiGraph::test_graph_chain","networkx/classes/tests/test_graph.py::networkx::classes::tests::test_special::TestDiGraph::test_copy","networkx/classes/tests/test_graph.py::networkx::classes::tests::test_special::TestDiGraph::test_class_copy","networkx/classes/tests/test_graph.py::networkx::classes::tests::test_special::TestDiGraph::test_fresh_copy","networkx/classes/tests/test_graph.py::networkx::classes::tests::test_special::TestDiGraph::test_graph_attr","networkx/classes/tests/test_graph.py::networkx::classes::tests::test_special::TestDiGraph::test_node_attr","networkx/classes/tests/test_graph.py::networkx::classes::tests::test_special::TestDiGraph::test_node_attr2","networkx/classes/tests/test_graph.py::networkx::classes::tests::test_special::TestDiGraph::test_edge_lookup","networkx/classes/tests/test_graph.py::networkx::classes::tests::test_special::TestDiGraph::test_edge_attr","networkx/classes/tests/test_graph.py::networkx::classes::tests::test_special::TestDiGraph::test_edge_attr2","networkx/classes/tests/test_graph.py::networkx::classes::tests::test_special::TestDiGraph::test_edge_attr3","networkx/classes/tests/test_graph.py::networkx::classes::tests::test_special::TestDiGraph::test_edge_attr4","networkx/classes/tests/test_graph.py::networkx::classes::tests::test_special::TestDiGraph::test_to_undirected","networkx/classes/tests/test_graph.py::networkx::classes::tests::test_special::TestDiGraph::test_to_directed","networkx/classes/tests/test_graph.py::networkx::classes::tests::test_special::TestDiGraph::test_subgraph","networkx/classes/tests/test_graph.py::networkx::classes::tests::test_special::TestDiGraph::test_selfloops_attr","networkx/classes/tests/test_graph.py::networkx::classes::tests::test_special::TestDiGraph::test_pickle","networkx/classes/tests/test_graph.py::networkx::classes::tests::test_special::TestDiGraph::test_adjacency","networkx/classes/tests/test_graph.py::networkx::classes::tests::test_special::TestDiGraph::test_getitem","networkx/classes/tests/test_graph.py::networkx::classes::tests::test_special::TestDiGraph::test_add_node","networkx/classes/tests/test_graph.py::networkx::classes::tests::test_special::TestDiGraph::test_add_nodes_from","networkx/classes/tests/test_graph.py::networkx::classes::tests::test_special::TestDiGraph::test_remove_node","networkx/classes/tests/test_graph.py::networkx::classes::tests::test_special::TestDiGraph::test_remove_nodes_from","networkx/classes/tests/test_graph.py::networkx::classes::tests::test_special::TestDiGraph::test_clear","networkx/classes/tests/test_graph.py::networkx::classes::tests::test_special::TestDiGraph::test_get_edge_data","networkx/classes/tests/test_graph.py::networkx::classes::tests::test_special::TestDiGraph::test_update","networkx/classes/tests/test_digraph.py::networkx::classes::tests::test_special::TestDiGraph::test_has_successor","networkx/classes/tests/test_digraph.py::networkx::classes::tests::test_special::TestDiGraph::test_successors","networkx/classes/tests/test_digraph.py::networkx::classes::tests::test_special::TestDiGraph::test_has_predecessor","networkx/classes/tests/test_digraph.py::networkx::classes::tests::test_special::TestDiGraph::test_predecessors","networkx/classes/tests/test_digraph.py::networkx::classes::tests::test_special::TestDiGraph::test_edges","networkx/classes/tests/test_digraph.py::networkx::classes::tests::test_special::TestDiGraph::test_edges_data","networkx/classes/tests/test_digraph.py::networkx::classes::tests::test_special::TestDiGraph::test_out_edges","networkx/classes/tests/test_digraph.py::networkx::classes::tests::test_special::TestDiGraph::test_out_edges_dir","networkx/classes/tests/test_digraph.py::networkx::classes::tests::test_special::TestDiGraph::test_in_edges_dir","networkx/classes/tests/test_digraph.py::networkx::classes::tests::test_special::TestDiGraph::test_degree","networkx/classes/tests/test_digraph.py::networkx::classes::tests::test_special::TestDiGraph::test_in_degree","networkx/classes/tests/test_digraph.py::networkx::classes::tests::test_special::TestDiGraph::test_in_degree_weighted","networkx/classes/tests/test_digraph.py::networkx::classes::tests::test_special::TestDiGraph::test_out_degree_weighted","networkx/classes/tests/test_digraph.py::networkx::classes::tests::test_special::TestDiGraph::test_out_degree","networkx/classes/tests/test_digraph.py::networkx::classes::tests::test_special::TestDiGraph::test_size","networkx/classes/tests/test_digraph.py::networkx::classes::tests::test_special::TestDiGraph::test_to_undirected_reciprocal","networkx/classes/tests/test_digraph.py::networkx::classes::tests::test_special::TestDiGraph::test_data_input","networkx/classes/tests/test_digraph.py::networkx::classes::tests::test_special::TestDiGraph::test_add_edge","networkx/classes/tests/test_digraph.py::networkx::classes::tests::test_special::TestDiGraph::test_add_edges_from","networkx/classes/tests/test_digraph.py::networkx::classes::tests::test_special::TestDiGraph::test_remove_edge","networkx/classes/tests/test_digraph.py::networkx::classes::tests::test_special::TestDiGraph::test_remove_edges_from","networkx/classes/tests/test_graph.py::networkx::classes::tests::test_special::TestMultiGraph::test_contains","networkx/classes/tests/test_graph.py::networkx::classes::tests::test_special::TestMultiGraph::test_order","networkx/classes/tests/test_graph.py::networkx::classes::tests::test_special::TestMultiGraph::test_nodes","networkx/classes/tests/test_graph.py::networkx::classes::tests::test_special::TestMultiGraph::test_has_node","networkx/classes/tests/test_graph.py::networkx::classes::tests::test_special::TestMultiGraph::test_neighbors","networkx/classes/tests/test_graph.py::networkx::classes::tests::test_special::TestMultiGraph::test_memory_leak","networkx/classes/tests/test_graph.py::networkx::classes::tests::test_special::TestMultiGraph::test_edges","networkx/classes/tests/test_graph.py::networkx::classes::tests::test_special::TestMultiGraph::test_degree","networkx/classes/tests/test_graph.py::networkx::classes::tests::test_special::TestMultiGraph::test_size","networkx/classes/tests/test_graph.py::networkx::classes::tests::test_special::TestMultiGraph::test_nbunch_iter","networkx/classes/tests/test_graph.py::networkx::classes::tests::test_special::TestMultiGraph::test_nbunch_iter_node_format_raise","networkx/classes/tests/test_graph.py::networkx::classes::tests::test_special::TestMultiGraph::test_selfloop_degree","networkx/classes/tests/test_graph.py::networkx::classes::tests::test_special::TestMultiGraph::test_selfloops","networkx/classes/tests/test_graph.py::networkx::classes::tests::test_special::TestMultiGraph::test_weighted_degree","networkx/classes/tests/test_graph.py::networkx::classes::tests::test_special::TestMultiGraph::test_name","networkx/classes/tests/test_graph.py::networkx::classes::tests::test_special::TestMultiGraph::test_graph_chain","networkx/classes/tests/test_graph.py::networkx::classes::tests::test_special::TestMultiGraph::test_copy","networkx/classes/tests/test_graph.py::networkx::classes::tests::test_special::TestMultiGraph::test_class_copy","networkx/classes/tests/test_graph.py::networkx::classes::tests::test_special::TestMultiGraph::test_fresh_copy","networkx/classes/tests/test_graph.py::networkx::classes::tests::test_special::TestMultiGraph::test_graph_attr","networkx/classes/tests/test_graph.py::networkx::classes::tests::test_special::TestMultiGraph::test_node_attr","networkx/classes/tests/test_graph.py::networkx::classes::tests::test_special::TestMultiGraph::test_node_attr2","networkx/classes/tests/test_graph.py::networkx::classes::tests::test_special::TestMultiGraph::test_edge_attr","networkx/classes/tests/test_graph.py::networkx::classes::tests::test_special::TestMultiGraph::test_edge_attr2","networkx/classes/tests/test_graph.py::networkx::classes::tests::test_special::TestMultiGraph::test_edge_attr3","networkx/classes/tests/test_graph.py::networkx::classes::tests::test_special::TestMultiGraph::test_subgraph","networkx/classes/tests/test_graph.py::networkx::classes::tests::test_special::TestMultiGraph::test_selfloops_attr","networkx/classes/tests/test_graph.py::networkx::classes::tests::test_special::TestMultiGraph::test_pickle","networkx/classes/tests/test_graph.py::networkx::classes::tests::test_special::TestMultiGraph::test_add_node","networkx/classes/tests/test_graph.py::networkx::classes::tests::test_special::TestMultiGraph::test_add_nodes_from","networkx/classes/tests/test_graph.py::networkx::classes::tests::test_special::TestMultiGraph::test_remove_nodes_from","networkx/classes/tests/test_graph.py::networkx::classes::tests::test_special::TestMultiGraph::test_clear","networkx/classes/tests/test_graph.py::networkx::classes::tests::test_special::TestMultiGraph::test_edges_data","networkx/classes/tests/test_graph.py::networkx::classes::tests::test_special::TestMultiGraph::test_update","networkx/classes/tests/test_multigraph.py::networkx::classes::tests::test_special::TestMultiGraph::test_has_edge","networkx/classes/tests/test_multigraph.py::networkx::classes::tests::test_special::TestMultiGraph::test_get_edge_data","networkx/classes/tests/test_multigraph.py::networkx::classes::tests::test_special::TestMultiGraph::test_adjacency","networkx/classes/tests/test_multigraph.py::networkx::classes::tests::test_special::TestMultiGraph::test_to_undirected","networkx/classes/tests/test_multigraph.py::networkx::classes::tests::test_special::TestMultiGraph::test_to_directed","networkx/classes/tests/test_multigraph.py::networkx::classes::tests::test_special::TestMultiGraph::test_number_of_edges_selfloops","networkx/classes/tests/test_multigraph.py::networkx::classes::tests::test_special::TestMultiGraph::test_edge_lookup","networkx/classes/tests/test_multigraph.py::networkx::classes::tests::test_special::TestMultiGraph::test_edge_attr4","networkx/classes/tests/test_multigraph.py::networkx::classes::tests::test_special::TestMultiGraph::test_data_input","networkx/classes/tests/test_multigraph.py::networkx::classes::tests::test_special::TestMultiGraph::test_getitem","networkx/classes/tests/test_multigraph.py::networkx::classes::tests::test_special::TestMultiGraph::test_remove_node","networkx/classes/tests/test_multigraph.py::networkx::classes::tests::test_special::TestMultiGraph::test_add_edge","networkx/classes/tests/test_multigraph.py::networkx::classes::tests::test_special::TestMultiGraph::test_add_edge_conflicting_key","networkx/classes/tests/test_multigraph.py::networkx::classes::tests::test_special::TestMultiGraph::test_add_edges_from","networkx/classes/tests/test_multigraph.py::networkx::classes::tests::test_special::TestMultiGraph::test_remove_edge","networkx/classes/tests/test_multigraph.py::networkx::classes::tests::test_special::TestMultiGraph::test_remove_edges_from","networkx/classes/tests/test_multigraph.py::networkx::classes::tests::test_special::TestMultiGraph::test_remove_multiedge","networkx/classes/tests/test_graph.py::networkx::classes::tests::test_special::TestMultiDiGraph::test_contains","networkx/classes/tests/test_graph.py::networkx::classes::tests::test_special::TestMultiDiGraph::test_order","networkx/classes/tests/test_graph.py::networkx::classes::tests::test_special::TestMultiDiGraph::test_nodes","networkx/classes/tests/test_graph.py::networkx::classes::tests::test_special::TestMultiDiGraph::test_has_node","networkx/classes/tests/test_graph.py::networkx::classes::tests::test_special::TestMultiDiGraph::test_neighbors","networkx/classes/tests/test_graph.py::networkx::classes::tests::test_special::TestMultiDiGraph::test_memory_leak","networkx/classes/tests/test_graph.py::networkx::classes::tests::test_special::TestMultiDiGraph::test_nbunch_iter","networkx/classes/tests/test_graph.py::networkx::classes::tests::test_special::TestMultiDiGraph::test_nbunch_iter_node_format_raise","networkx/classes/tests/test_graph.py::networkx::classes::tests::test_special::TestMultiDiGraph::test_selfloop_degree","networkx/classes/tests/test_graph.py::networkx::classes::tests::test_special::TestMultiDiGraph::test_selfloops","networkx/classes/tests/test_graph.py::networkx::classes::tests::test_special::TestMultiDiGraph::test_weighted_degree","networkx/classes/tests/test_graph.py::networkx::classes::tests::test_special::TestMultiDiGraph::test_name","networkx/classes/tests/test_graph.py::networkx::classes::tests::test_special::TestMultiDiGraph::test_graph_chain","networkx/classes/tests/test_graph.py::networkx::classes::tests::test_special::TestMultiDiGraph::test_copy","networkx/classes/tests/test_graph.py::networkx::classes::tests::test_special::TestMultiDiGraph::test_class_copy","networkx/classes/tests/test_graph.py::networkx::classes::tests::test_special::TestMultiDiGraph::test_fresh_copy","networkx/classes/tests/test_graph.py::networkx::classes::tests::test_special::TestMultiDiGraph::test_graph_attr","networkx/classes/tests/test_graph.py::networkx::classes::tests::test_special::TestMultiDiGraph::test_node_attr","networkx/classes/tests/test_graph.py::networkx::classes::tests::test_special::TestMultiDiGraph::test_node_attr2","networkx/classes/tests/test_graph.py::networkx::classes::tests::test_special::TestMultiDiGraph::test_edge_attr","networkx/classes/tests/test_graph.py::networkx::classes::tests::test_special::TestMultiDiGraph::test_edge_attr2","networkx/classes/tests/test_graph.py::networkx::classes::tests::test_special::TestMultiDiGraph::test_edge_attr3","networkx/classes/tests/test_graph.py::networkx::classes::tests::test_special::TestMultiDiGraph::test_subgraph","networkx/classes/tests/test_graph.py::networkx::classes::tests::test_special::TestMultiDiGraph::test_selfloops_attr","networkx/classes/tests/test_graph.py::networkx::classes::tests::test_special::TestMultiDiGraph::test_pickle","networkx/classes/tests/test_graph.py::networkx::classes::tests::test_special::TestMultiDiGraph::test_add_node","networkx/classes/tests/test_graph.py::networkx::classes::tests::test_special::TestMultiDiGraph::test_add_nodes_from","networkx/classes/tests/test_graph.py::networkx::classes::tests::test_special::TestMultiDiGraph::test_remove_nodes_from","networkx/classes/tests/test_graph.py::networkx::classes::tests::test_special::TestMultiDiGraph::test_clear","networkx/classes/tests/test_graph.py::networkx::classes::tests::test_special::TestMultiDiGraph::test_update","networkx/classes/tests/test_multigraph.py::networkx::classes::tests::test_special::TestMultiDiGraph::test_has_edge","networkx/classes/tests/test_multigraph.py::networkx::classes::tests::test_special::TestMultiDiGraph::test_get_edge_data","networkx/classes/tests/test_multigraph.py::networkx::classes::tests::test_special::TestMultiDiGraph::test_adjacency","networkx/classes/tests/test_multigraph.py::networkx::classes::tests::test_special::TestMultiDiGraph::test_to_directed","networkx/classes/tests/test_multigraph.py::networkx::classes::tests::test_special::TestMultiDiGraph::test_number_of_edges_selfloops","networkx/classes/tests/test_multigraph.py::networkx::classes::tests::test_special::TestMultiDiGraph::test_edge_lookup","networkx/classes/tests/test_multigraph.py::networkx::classes::tests::test_special::TestMultiDiGraph::test_edge_attr4","networkx/classes/tests/test_multigraph.py::networkx::classes::tests::test_special::TestMultiDiGraph::test_data_input","networkx/classes/tests/test_multigraph.py::networkx::classes::tests::test_special::TestMultiDiGraph::test_getitem","networkx/classes/tests/test_multigraph.py::networkx::classes::tests::test_special::TestMultiDiGraph::test_remove_node","networkx/classes/tests/test_multigraph.py::networkx::classes::tests::test_special::TestMultiDiGraph::test_add_edge_conflicting_key","networkx/classes/tests/test_multidigraph.py::networkx::classes::tests::test_special::TestMultiDiGraph::test_edges","networkx/classes/tests/test_multidigraph.py::networkx::classes::tests::test_special::TestMultiDiGraph::test_edges_data","networkx/classes/tests/test_multidigraph.py::networkx::classes::tests::test_special::TestMultiDiGraph::test_edges_multi","networkx/classes/tests/test_multidigraph.py::networkx::classes::tests::test_special::TestMultiDiGraph::test_out_edges","networkx/classes/tests/test_multidigraph.py::networkx::classes::tests::test_special::TestMultiDiGraph::test_out_edges_multi","networkx/classes/tests/test_multidigraph.py::networkx::classes::tests::test_special::TestMultiDiGraph::test_out_edges_data","networkx/classes/tests/test_multidigraph.py::networkx::classes::tests::test_special::TestMultiDiGraph::test_in_edges","networkx/classes/tests/test_multidigraph.py::networkx::classes::tests::test_special::TestMultiDiGraph::test_in_edges_no_keys","networkx/classes/tests/test_multidigraph.py::networkx::classes::tests::test_special::TestMultiDiGraph::test_in_edges_data","networkx/classes/tests/test_multidigraph.py::networkx::classes::tests::test_special::TestMultiDiGraph::test_to_undirected","networkx/classes/tests/test_multidigraph.py::networkx::classes::tests::test_special::TestMultiDiGraph::test_has_successor","networkx/classes/tests/test_multidigraph.py::networkx::classes::tests::test_special::TestMultiDiGraph::test_successors","networkx/classes/tests/test_multidigraph.py::networkx::classes::tests::test_special::TestMultiDiGraph::test_has_predecessor","networkx/classes/tests/test_multidigraph.py::networkx::classes::tests::test_special::TestMultiDiGraph::test_predecessors","networkx/classes/tests/test_multidigraph.py::networkx::classes::tests::test_special::TestMultiDiGraph::test_degree","networkx/classes/tests/test_multidigraph.py::networkx::classes::tests::test_special::TestMultiDiGraph::test_in_degree","networkx/classes/tests/test_multidigraph.py::networkx::classes::tests::test_special::TestMultiDiGraph::test_out_degree","networkx/classes/tests/test_multidigraph.py::networkx::classes::tests::test_special::TestMultiDiGraph::test_size","networkx/classes/tests/test_multidigraph.py::networkx::classes::tests::test_special::TestMultiDiGraph::test_to_undirected_reciprocal","networkx/classes/tests/test_multidigraph.py::networkx::classes::tests::test_special::TestMultiDiGraph::test_add_edge","networkx/classes/tests/test_multidigraph.py::networkx::classes::tests::test_special::TestMultiDiGraph::test_add_edges_from","networkx/classes/tests/test_multidigraph.py::networkx::classes::tests::test_special::TestMultiDiGraph::test_remove_edge","networkx/classes/tests/test_multidigraph.py::networkx::classes::tests::test_special::TestMultiDiGraph::test_remove_multiedge","networkx/classes/tests/test_multidigraph.py::networkx::classes::tests::test_special::TestMultiDiGraph::test_remove_edges_from"],"errors":[],"skipped":[],"collection_errors":[],"failure_text":{"networkx/classes/tests/test_graph.py::networkx::classes::tests::test_special::TestGraph::test_contains":"AttributeError: 'TestGraph' object has no attribute 'K3'\nE   AttributeError: 'TestGraph' object has no attribute 'K3'","networkx/classes/tests/test_graph.py::networkx::classes::tests::test_special::TestGraph::test_order":"AttributeError: 'TestGraph' object has no attribute 'K3'\nE   AttributeError: 'TestGraph' object has no attribute 'K3'","networkx/classes/tests/test_graph.py::networkx::classes::tests::test_special::TestGraph::test_nodes":"AttributeError: 'TestGraph' object has no attribute 'K3'\nE   AttributeError: 'TestGraph' object has no attribute 'K3'","networkx/classes/tests/test_graph.py::networkx::classes::tests::test_special::TestGraph::test_has_node":"AttributeError: 'TestGraph' object has no attribute 'K3'\nE   AttributeError: 'TestGraph' object has no attribute 'K3'","networkx/classes/tests/test_graph.py::networkx::classes::tests::test_special::TestGraph::test_has_edge":"AttributeError: 'TestGraph' object has no attribute 'K3'\nE   AttributeError: 'TestGraph' object has no attribute 'K3'","networkx/classes/tests/test_graph.py::networkx::classes::tests::test_special::TestGraph::test_neighbors":"AttributeError: 'TestGraph' object has no attribute 'K3'\nE   AttributeError: 'TestGraph' object has no attribute 'K3'","networkx/classes/tests/test_graph.py::networkx::classes::tests::test_special::TestGraph::test_memory_leak":"AttributeError: 'TestGraph' object has no attribute 'Graph'\nE   AttributeError: 'TestGraph' object has no attribute 'Graph'","networkx/classes/tests/test_graph.py::networkx::classes::tests::test_special::TestGraph::test_edges":"AttributeError: 'TestGraph' object has no attribute 'K3'\nE   AttributeError: 'TestGraph' object has no attribute 'K3'","networkx/classes/tests/test_graph.py::networkx::classes::tests::test_special::TestGraph::test_degree":"AttributeError: 'TestGraph' object has no attribute 'K3'\nE   AttributeError: 'TestGraph' object has no attribute 'K3'","networkx/classes/tests/test_graph.py::networkx::classes::tests::test_special::TestGraph::test_size":"AttributeError: 'TestGraph' object has no attribute 'K3'\nE   AttributeError: 'TestGraph' object has no attribute 'K3'","networkx/classes/tests/test_graph.py::networkx::classes::tests::test_special::TestGraph::test_nbunch_iter":"AttributeError: 'TestGraph' object has no attribute 'K3'\nE   AttributeError: 'TestGraph' object has no attribute 'K3'","networkx/classes/tests/test_graph.py::networkx::classes::tests::test_special::TestGraph::test_nbunch_iter_node_format_raise":"AttributeError: 'TestGraph' object has no attribute 'Graph'\nE   AttributeError: 'TestGraph' object has no attribute 'Graph'","networkx/classes/tests/test_graph.py::networkx::classes::tests::test_special::TestGraph::test_selfloop_degree":"AttributeError: 'TestGraph' object has no attribute 'Graph'\nE   AttributeError: 'TestGraph' object has no attribute 'Graph'","networkx/classes/tests/test_graph.py::networkx::classes::tests::test_special::TestGraph::test_selfloops":"AttributeError: 'TestGraph' object has no attribute 'K3'\nE   AttributeError: 'TestGraph' object has no attribute 'K3'","networkx/classes/tests/test_graph.py::networkx::classes::tests::test_special::TestGraph::test_weighted_degree":"AttributeError: 'TestGraph' object has no attribute 'Graph'\nE   AttributeError: 'TestGraph' object has no attribute 'Graph'","networkx/classes/tests/test_graph.py::networkx::classes::tests::test_special::TestGraph::test_name":"AttributeError: 'TestGraph' object has no attribute 'Graph'\nE   AttributeError: 'TestGraph' object has no attribute 'Graph'","networkx/classes/tests/test_graph.py::networkx::classes::tests::test_special::TestGraph::test_graph_chain":"AttributeError: 'TestGraph' object has no attribute 'Graph'\nE   AttributeError: 'TestGraph' object has no attribute 'Graph'","networkx/classes/tests/test_graph.py::networkx::classes::tests::test_special::TestGraph::test_copy":"AttributeError: 'TestGraph' object has no attribute 'Graph'\nE   AttributeError: 'TestGraph' object has no attribute 'Graph'","networkx/classes/tests/test_graph.py::networkx::classes::tests::test_special::TestGraph::test_class_copy":"AttributeError: 'TestGraph' object has no attribute 'Graph'\nE   AttributeError: 'TestGraph' object has no attribute 'Graph'","networkx/classes/tests/test_graph.py::networkx::classes::tests::test_special::TestGraph::test_fresh_copy":"AttributeError: 'TestGraph' object has no attribute 'Graph'\nE   AttributeError: 'TestGraph' object has no attribute 'Graph'","networkx/classes/tests/test_graph.py::networkx::classes::tests::test_special::TestGraph::test_graph_attr":"AttributeError: 'TestGraph' object has no attribute 'K3'\nE   AttributeError: 'TestGraph' object has no attribute 'K3'","networkx/classes/tests/test_graph.py::networkx::classes::tests::test_special::TestGraph::test_node_attr":"AttributeError: 'TestGraph' object has no attribute 'K3'\nE   AttributeError: 'TestGraph' object has no attribute 'K3'","networkx/classes/tests/test_graph.py::networkx::classes::tests::test_special::TestGraph::test_node_attr2":"AttributeError: 'TestGraph' object has no attribute 'K3'\nE   AttributeError: 'TestGraph' object has no attribute 'K3'","networkx/classes/tests/test_graph.py::networkx::classes::tests::test_special::TestGraph::test_edge_lookup":"AttributeError: 'TestGraph' object has no attribute 'Graph'\nE   AttributeError: 'TestGraph' object has no attribute 'Graph'","networkx/classes/tests/test_graph.py::networkx::classes::tests::test_special::TestGraph::test_edge_attr":"AttributeError: 'TestGraph' object has no attribute 'Graph'\nE   AttributeError: 'TestGraph' object has no attribute 'Graph'","networkx/classes/tests/test_graph.py::networkx::classes::tests::test_special::TestGraph::test_edge_attr2":"AttributeError: 'TestGraph' object has no attribute 'Graph'\nE   AttributeError: 'TestGraph' object has no attribute 'Graph'","networkx/classes/tests/test_graph.py::networkx::classes::tests::test_special::TestGraph::test_edge_attr3":"AttributeError: 'TestGraph' object has no attribute 'Graph'\nE   AttributeError: 'TestGraph' object has no attribute 'Graph'","networkx/classes/tests/test_graph.py::networkx::classes::tests::test_special::TestGraph::test_edge_attr4":"AttributeError: 'TestGraph' object has no attribute 'Graph'\nE   AttributeError: 'TestGraph' object has no attribute 'Graph'","networkx/classes/tests/test_graph.py::networkx::classes::tests::test_special::TestGraph::test_to_undirected":"AttributeError: 'TestGraph' object has no attribute 'K3'\nE   AttributeError: 'TestGraph' object has no attribute 'K3'","networkx/classes/tests/test_graph.py::networkx::classes::tests::test_special::TestGraph::test_to_directed":"AttributeError: 'TestGraph' object has no attribute 'K3'\nE   AttributeError: 'TestGraph' object has no attribute 'K3'","networkx/classes/tests/test_graph.py::networkx::classes::tests::test_special::TestGraph::test_subgraph":"AttributeError: 'TestGraph' object has no attribute 'K3'\nE   AttributeError: 'TestGraph' object has no attribute 'K3'","networkx/classes/tests/test_graph.py::networkx::classes::tests::test_special::TestGraph::test_selfloops_attr":"AttributeError: 'TestGraph' object has no attribute 'K3'\nE   AttributeError: 'TestGraph' object has no attribute 'K3'","networkx/classes/tests/test_graph.py::networkx::classes::tests::test_special::TestGraph::test_pickle":"AttributeError: 'TestGraph' object has no attribute 'K3'\nE   AttributeError: 'TestGraph' object has no attribute 'K3'","networkx/classes/tests/test_graph.py::networkx::classes::tests::test_special::TestGraph::test_data_input":"AttributeError: 'TestGraph' object has no attribute 'Graph'\nE   AttributeError: 'TestGraph' object has no attribute 'Graph'","networkx/classes/tests/test_graph.py::networkx::classes::tests::test_special::TestGraph::test_adjacency":"AttributeError: 'TestGraph' object has no attribute 'K3'\nE   AttributeError: 'TestGraph' object has no attribute 'K3'","networkx/classes/tests/test_graph.py::networkx::classes::tests::test_special::TestGraph::test_getitem":"AttributeError: 'TestGraph' object has no attribute 'K3'\nE   AttributeError: 'TestGraph' object has no attribute 'K3'","networkx/classes/tests/test_graph.py::networkx::classes::tests::test_special::TestGraph::test_add_node":"AttributeError: 'TestGraph' object has no attribute 'Graph'\nE   AttributeError: 'TestGraph' object has no attribute 'Graph'","networkx/classes/tests/test_graph.py::networkx::classes::tests::test_special::TestGraph::test_add_nodes_from":"AttributeError: 'TestGraph' object has no attribute 'Graph'\nE   AttributeError: 'TestGraph' object has no attribute 'Graph'","networkx/classes/tests/test_graph.py::networkx::classes::tests::test_special::TestGraph::test_remove_node":"AttributeError: 'TestGraph' object has no attribute 'K3'\nE   AttributeError: 'TestGraph' object has no attribute 'K3'","networkx/classes/tests/test_graph.py::networkx::classes::tests::test_special::TestGraph::test_remove_nodes_from":"AttributeError: 'TestGraph' object has no attribute 'K3'\nE   AttributeError: 'TestGraph' object has no attribute 'K3'","networkx/classes/tests/test_graph.py::networkx::classes::tests::test_special::TestGraph::test_add_edge":"AttributeError: 'TestGraph' object has no attribute 'Graph'\nE   AttributeError: 'TestGraph' object has no attribute 'Graph'","networkx/classes/tests/test_graph.py::networkx::classes::tests::test_special::TestGraph::test_add_edges_from":"AttributeError: 'TestGraph' object has no attribute 'Graph'\nE   AttributeError: 'TestGraph' object has no attribute 'Graph'","networkx/classes/tests/test_graph.py::networkx::classes::tests::test_special::TestGraph::test_remove_edge":"AttributeError: 'TestGraph' object has no attribute 'K3'\nE   AttributeError: 'TestGraph' object has no attribute 'K3'","networkx/classes/tests/test_graph.py::networkx::classes::tests::test_special::TestGraph::test_remove_edges_from":"AttributeError: 'TestGraph' object has no attribute 'K3'\nE   AttributeError: 'TestGraph' object has no attribute 'K3'","networkx/classes/tests/test_graph.py::networkx::classes::tests::test_special::TestGraph::test_clear":"AttributeError: 'TestGraph' object has no attribute 'K3'\nE   AttributeError: 'TestGraph' object has no attribute 'K3'","networkx/classes/tests/test_graph.py::networkx::classes::tests::test_special::TestGraph::test_edges_data":"AttributeError: 'TestGraph' object has no attribute 'K3'\nE   AttributeError: 'TestGraph' object has no attribute 'K3'","networkx/classes/tests/test_graph.py::networkx::classes::tests::test_special::TestGraph::test_get_edge_data":"AttributeError: 'TestGraph' object has no attribute 'K3'\nE   AttributeError: 'TestGraph' object has no attribute 'K3'","networkx/classes/tests/test_graph.py::networkx::classes::tests::test_special::TestGraph::test_update":"AttributeError: 'TestGraph' object has no attribute 'K3'\nE   AttributeError: 'TestGraph' object has no attribute 'K3'","networkx/classes/tests/test_graph.py::networkx::classes::tests::test_special::TestDiGraph::test_contains":"AttributeError: 'TestDiGraph' object has no attribute 'K3'\nE   AttributeError: 'TestDiGraph' object has no attribute 'K3'","networkx/classes/tests/test_graph.py::networkx::classes::tests::test_special::TestDiGraph::test_order":"AttributeError: 'TestDiGraph' object has no attribute 'K3'\nE   AttributeError: 'TestDiGraph' object has no attribute 'K3'","networkx/classes/tests/test_graph.py::networkx::classes::tests::test_special::TestDiGraph::test_nodes":"AttributeError: 'TestDiGraph' object has no attribute 'K3'\nE   AttributeError: 'TestDiGraph' object has no attribute 'K3'","networkx/classes/tests/test_graph.py::networkx::classes::tests::test_special::TestDiGraph::test_has_node":"AttributeError: 'TestDiGraph' object has no attribute 'K3'\nE   AttributeError: 'TestDiGraph' object has no attribute 'K3'","networkx/classes/tests/test_graph.py::networkx::classes::tests::test_special::TestDiGraph::test_has_edge":"AttributeError: 'TestDiGraph' object has no attribute 'K3'\nE   AttributeError: 'TestDiGraph' object has no attribute 'K3'","networkx/classes/tests/test_graph.py::networkx::classes::tests::test_special::TestDiGraph::test_neighbors":"AttributeError: 'TestDiGraph' object has no attribute 'K3'\nE   AttributeError: 'TestDiGraph' object has no attribute 'K3'","networkx/classes/tests/test_graph.py::networkx::classes::tests::test_special::TestDiGraph::test_memory_leak":"AttributeError: 'TestDiGraph' object has no attribute 'Graph'\nE   AttributeError: 'TestDiGraph' object has no attribute 'Graph'","networkx/classes/tests/test_graph.py::networkx::classes::tests::test_special::TestDiGraph::test_nbunch_iter":"AttributeError: 'TestDiGraph' object has no attribute 'K3'\nE   AttributeError: 'TestDiGraph' object has no attribute 'K3'","networkx/classes/tests/test_graph.py::networkx::classes::tests::test_special::TestDiGraph::test_nbunch_iter_node_format_raise":"AttributeError: 'TestDiGraph' object has no attribute 'Graph'\nE   AttributeError: 'TestDiGraph' object has no attribute 'Graph'","networkx/classes/tests/test_graph.py::networkx::classes::tests::test_special::TestDiGraph::test_selfloop_degree":"AttributeError: 'TestDiGraph' object has no attribute 'Graph'\nE   AttributeError: 'TestDiGraph' object has no attribute 'Graph'","networkx/classes/tests/test_graph.py::networkx::classes::tests::test_special::TestDiGraph::test_selfloops":"AttributeError: 'TestDiGraph' object has no attribute 'K3'\nE   AttributeError: 'TestDiGraph' object has no attribute 'K3'","networkx/classes/tests/test_graph.py::networkx::classes::tests::test_special::TestDiGraph::test_weighted_degree":"AttributeError: 'TestDiGraph' object has no attribute 'Graph'\nE   AttributeError: 'TestDiGraph' object has no attribute 'Graph'","networkx/classes/tests/test_graph.py::networkx::classes::tests::test_special::TestDiGraph::test_name":"AttributeError: 'TestDiGraph' object has no attribute 'Graph'\nE   AttributeError: 'TestDiGraph' object has no attribute 'Graph'","networkx/classes/tests/test_graph.py::networkx::classes::tests::test_special::TestDiGraph::test_graph_chain":"AttributeError: 'TestDiGraph' object has no attribute 'Graph'\nE   AttributeError: 'TestDiGraph' object has no attribute 'Graph'","networkx/classes/tests/test_graph.py::networkx::classes::tests::test_special::TestDiGraph::test_copy":"AttributeError: 'TestDiGraph' object has no attribute 'Graph'\nE   AttributeError: 'TestDiGraph' object has no attribute 'Graph'","networkx/classes/tests/test_graph.py::networkx::classes::tests::test_special::TestDiGraph::test_class_copy":"AttributeError: 'TestDiGraph' object has no attribute 'Graph'\nE   AttributeError: 'TestDiGraph' object has no attribute 'Graph'","networkx/classes/tests/test_graph.py::networkx::classes::tests::test_special::TestDiGraph::test_fresh_copy":"AttributeError: 'TestDiGraph' object has no attribute 'Graph'\nE   AttributeError: 'TestDiGraph' object has no attribute 'Graph'","networkx/classes/tests/test_graph.py::networkx::classes::tests::test_special::TestDiGraph::test_graph_attr":"AttributeError: 'TestDiGraph' object has no attribute 'K3'\nE   AttributeError: 'TestDiGraph' object has no attribute 'K3'","networkx/classes/tests/test_graph.py::networkx::classes::tests::test_special::TestDiGraph::test_node_attr":"AttributeError: 'TestDiGraph' object has no attribute 'K3'\nE   AttributeError: 'TestDiGraph' object has no attribute 'K3'","networkx/classes/tests/test_graph.py::networkx::classes::tests::test_special::TestDiGraph::test_node_attr2":"AttributeError: 'TestDiGraph' object has no attribute 'K3'\nE   AttributeError: 'TestDiGraph' object has no attribute 'K3'","networkx/classes/tests/test_graph.py::networkx::classes::tests::test_special::TestDiGraph::test_edge_lookup":"AttributeError: 'TestDiGraph' object has no attribute 'Graph'\nE   AttributeError: 'TestDiGraph' object has no attribute 'Graph'","networkx/classes/tests/test_graph.py::networkx::classes::tests::test_special::TestDiGraph::test_edge_attr":"AttributeError: 'TestDiGraph' object has no attribute 'Graph'\nE   AttributeError: 'TestDiGraph' object has no attribute 'Graph'","networkx/classes/tests/test_graph.py::networkx::classes::tests::test_special::TestDiGraph::test_edge_attr2":"AttributeError: 'TestDiGraph' object has no attribute 'Graph'\nE   AttributeError: 'TestDiGraph' object has no attribute 'Graph'","networkx/classes/tests/test_graph.py::networkx::classes::tests::test_special::TestDiGraph::test_edge_attr3":"AttributeError: 'TestDiGraph' object has no attribute 'Graph'\nE   AttributeError: 'TestDiGraph' object has no attribute 'Graph'","networkx/classes/tests/test_graph.py::networkx::classes::tests::test_special::TestDiGraph::test_edge_attr4":"AttributeError: 'TestDiGraph' object has no attribute 'Graph'\nE   AttributeError: 'TestDiGraph' object has no attribute 'Graph'","networkx/classes/tests/test_graph.py::networkx::classes::tests::test_special::TestDiGraph::test_to_undirected":"AttributeError: 'TestDiGraph' object has no attribute 'K3'\nE   AttributeError: 'TestDiGraph' object has no attribute 'K3'","networkx/classes/tests/test_graph.py::networkx::classes::tests::test_special::TestDiGraph::test_to_directed":"AttributeError: 'TestDiGraph' object has no attribute 'K3'\nE   AttributeError: 'TestDiGraph' object has no attribute 'K3'","networkx/classes/tests/test_graph.py::networkx::classes::tests::test_special::TestDiGraph::test_subgraph":"AttributeError: 'TestDiGraph' object has no attribute 'K3'\nE   AttributeError: 'TestDiGraph' object has no attribute 'K3'","networkx/classes/tests/test_graph.py::networkx::classes::tests::test_special::TestDiGraph::test_selfloops_attr":"AttributeError: 'TestDiGraph' object has no attribute 'K3'\nE   AttributeError: 'TestDiGraph' object has no attribute 'K3'","networkx/classes/tests/test_graph.py::networkx::classes::tests::test_special::TestDiGraph::test_pickle":"AttributeError: 'TestDiGraph' object has no attribute 'K3'\nE   AttributeError: 'TestDiGraph' object has no attribute 'K3'","networkx/classes/tests/test_graph.py::networkx::classes::tests::test_special::TestDiGraph::test_adjacency":"AttributeError: 'TestDiGraph' object has no attribute 'K3'\nE   AttributeError: 'TestDiGraph' object has no attribute 'K3'","networkx/classes/tests/test_graph.py::networkx::classes::tests::test_special::TestDiGraph::test_getitem":"AttributeError: 'TestDiGraph' object has no attribute 'K3'\nE   AttributeError: 'TestDiGraph' object has no attribute 'K3'","networkx/classes/tests/test_graph.py::networkx::classes::tests::test_special::TestDiGraph::test_add_node":"AttributeError: 'TestDiGraph' object has no attribute 'Graph'\nE   AttributeError: 'TestDiGraph' object has no attribute 'Graph'","networkx/classes/tests/test_graph.py::networkx::classes::tests::test_special::TestDiGraph::test_add_nodes_from":"AttributeError: 'TestDiGraph' object has no attribute 'Graph'\nE   AttributeError: 'TestDiGraph' object has no attribute 'Graph'","networkx/classes/tests/test_graph.py::networkx::classes::tests::test_special::TestDiGraph::test_remove_node":"AttributeError: 'TestDiGraph' object has no attribute 'K3'\nE   AttributeError: 'TestDiGraph' object has no attribute 'K3'","networkx/classes/tests/test_graph.py::networkx::classes::tests::test_special::TestDiGraph::test_remove_nodes_from":"AttributeError: 'TestDiGraph' object has no attribute 'K3'\nE   AttributeError: 'TestDiGraph' object has no attribute 'K3'","networkx/classes/tests/test_graph.py::networkx::classes::tests::test_special::TestDiGraph::test_clear":"AttributeError: 'TestDiGraph' object has no attribute 'K3'\nE   AttributeError: 'TestDiGraph' object has no attribute 'K3'","networkx/classes/tests/test_graph.py::networkx::classes::tests::test_special::TestDiGraph::test_get_edge_data":"AttributeError: 'TestDiGraph' object has no attribute 'K3'\nE   AttributeError: 'TestDiGraph' object has no attribute 'K3'","networkx/classes/tests/test_graph.py::networkx::classes::tests::test_special::TestDiGraph::test_update":"AttributeError: 'TestDiGraph' object has no attribute 'K3'\nE   AttributeError: 'TestDiGraph' object has no attribute 'K3'","networkx/classes/tests/test_digraph.py::networkx::classes::tests::test_special::TestDiGraph::test_has_successor":"AttributeError: 'TestDiGraph' object has no attribute 'K3'\nE   AttributeError: 'TestDiGraph' object has no attribute 'K3'","networkx/classes/tests/test_digraph.py::networkx::classes::tests::test_special::TestDiGraph::test_successors":"AttributeError: 'TestDiGraph' object has no attribute 'K3'\nE   AttributeError: 'TestDiGraph' object has no attribute 'K3'","networkx/classes/tests/test_digraph.py::networkx::classes::tests::test_special::TestDiGraph::test_has_predecessor":"AttributeError: 'TestDiGraph' object has no attribute 'K3'\nE   AttributeError: 'TestDiGraph' object has no attribute 'K3'","networkx/classes/tests/test_digraph.py::networkx::classes::tests::test_special::TestDiGraph::test_predecessors":"AttributeError: 'TestDiGraph' object has no attribute 'K3'\nE   AttributeError: 'TestDiGraph' object has no attribute 'K3'","networkx/classes/tests/test_digraph.py::networkx::classes::tests::test_special::TestDiGraph::test_edges":"AttributeError: 'TestDiGraph' object has no attribute 'K3'\nE   AttributeError: 'TestDiGraph' object has no attribute 'K3'","networkx/classes/tests/test_digraph.py::networkx::classes::tests::test_special::TestDiGraph::test_edges_data":"AttributeError: 'TestDiGraph' object has no attribute 'K3'\nE   AttributeError: 'TestDiGraph' object has no attribute 'K3'","networkx/classes/tests/test_digraph.py::networkx::classes::tests::test_special::TestDiGraph::test_out_edges":"AttributeError: 'TestDiGraph' object has no attribute 'K3'\nE   AttributeError: 'TestDiGraph' object has no attribute 'K3'","networkx/classes/tests/test_digraph.py::networkx::classes::tests::test_special::TestDiGraph::test_out_edges_dir":"AttributeError: 'TestDiGraph' object has no attribute 'P3'\nE   AttributeError: 'TestDiGraph' object has no attribute 'P3'","networkx/classes/tests/test_digraph.py::networkx::classes::tests::test_special::TestDiGraph::test_in_edges_dir":"AttributeError: 'TestDiGraph' object has no attribute 'P3'\nE   AttributeError: 'TestDiGraph' object has no attribute 'P3'","networkx/classes/tests/test_digraph.py::networkx::classes::tests::test_special::TestDiGraph::test_degree":"AttributeError: 'TestDiGraph' object has no attribute 'K3'\nE   AttributeError: 'TestDiGraph' object has no attribute 'K3'","networkx/classes/tests/test_digraph.py::networkx::classes::tests::test_special::TestDiGraph::test_in_degree":"AttributeError: 'TestDiGraph' object has no attribute 'K3'\nE   AttributeError: 'TestDiGraph' object has no attribute 'K3'","networkx/classes/tests/test_digraph.py::networkx::classes::tests::test_special::TestDiGraph::test_in_degree_weighted":"AttributeError: 'TestDiGraph' object has no attribute 'K3'\nE   AttributeError: 'TestDiGraph' object has no attribute 'K3'","networkx/classes/tests/test_digraph.py::networkx::classes::tests::test_special::TestDiGraph::test_out_degree_weighted":"AttributeError: 'TestDiGraph' object has no attribute 'K3'\nE   AttributeError: 'TestDiGraph' object has no attribute 'K3'","networkx/classes/tests/test_digraph.py::networkx::classes::tests::test_special::TestDiGraph::test_out_degree":"AttributeError: 'TestDiGraph' object has no attribute 'K3'\nE   AttributeError: 'TestDiGraph' object has no attribute 'K3'","networkx/classes/tests/test_digraph.py::networkx::classes::tests::test_special::TestDiGraph::test_size":"AttributeError: 'TestDiGraph' object has no attribute 'K3'\nE   AttributeError: 'TestDiGraph' object has no attribute 'K3'","networkx/classes/tests/test_digraph.py::networkx::classes::tests::test_special::TestDiGraph::test_to_undirected_reciprocal":"AttributeError: 'TestDiGraph' object has no attribute 'Graph'\nE   AttributeError: 'TestDiGraph' object has no attribute 'Graph'","networkx/classes/tests/test_digraph.py::networkx::classes::tests::test_special::TestDiGraph::test_data_input":"AttributeError: 'TestDiGraph' object has no attribute 'Graph'\nE   AttributeError: 'TestDiGraph' object has no attribute 'Graph'","networkx/classes/tests/test_digraph.py::networkx::classes::tests::test_special::TestDiGraph::test_add_edge":"AttributeError: 'TestDiGraph' object has no attribute 'Graph'\nE   AttributeError: 'TestDiGraph' object has no attribute 'Graph'","networkx/classes/tests/test_digraph.py::networkx::classes::tests::test_special::TestDiGraph::test_add_edges_from":"AttributeError: 'TestDiGraph' object has no attribute 'Graph'\nE   AttributeError: 'TestDiGraph' object has no attribute 'Graph'","networkx/classes/tests/test_digraph.py::networkx::classes::tests::test_special::TestDiGraph::test_remove_edge":"AttributeError: 'TestDiGraph' object has no attribute 'K3'\nE   AttributeError: 'TestDiGraph' object has no attribute 'K3'","networkx/classes/tests/test_digraph.py::networkx::classes::tests::test_special::TestDiGraph::test_remove_edges_from":"AttributeError: 'TestDiGraph' object has no attribute 'K3'\nE   AttributeError: 'TestDiGraph' object has no attribute 'K3'","networkx/classes/tests/test_graph.py::networkx::classes::tests::test_special::TestMultiGraph::test_contains":"AttributeError: 'TestMultiGraph' object has no attribute 'K3'\nE   AttributeError: 'TestMultiGraph' object has no attribute 'K3'","networkx/classes/tests/test_graph.py::networkx::classes::tests::test_special::TestMultiGraph::test_order":"AttributeError: 'TestMultiGraph' object has no attribute 'K3'\nE   AttributeError: 'TestMultiGraph' object has no attribute 'K3'","networkx/classes/tests/test_graph.py::networkx::classes::tests::test_special::TestMultiGraph::test_nodes":"AttributeError: 'TestMultiGraph' object has no attribute 'K3'\nE   AttributeError: 'TestMultiGraph' object has no attribute 'K3'","networkx/classes/tests/test_graph.py::networkx::classes::tests::test_special::TestMultiGraph::test_has_node":"AttributeError: 'TestMultiGraph' object has no attribute 'K3'\nE   AttributeError: 'TestMultiGraph' object has no attribute 'K3'","networkx/classes/tests/test_graph.py::networkx::classes::tests::test_special::TestMultiGraph::test_neighbors":"AttributeError: 'TestMultiGraph' object has no attribute 'K3'\nE   AttributeError: 'TestMultiGraph' object has no attribute 'K3'","networkx/classes/tests/test_graph.py::networkx::classes::tests::test_special::TestMultiGraph::test_memory_leak":"AttributeError: 'TestMultiGraph' object has no attribute 'Graph'\nE   AttributeError: 'TestMultiGraph' object has no attribute 'Graph'","networkx/classes/tests/test_graph.py::networkx::classes::tests::test_special::TestMultiGraph::test_edges":"AttributeError: 'TestMultiGraph' object has no attribute 'K3'\nE   AttributeError: 'TestMultiGraph' object has no attribute 'K3'","networkx/classes/tests/test_graph.py::networkx::classes::tests::test_special::TestMultiGraph::test_degree":"AttributeError: 'TestMultiGraph' object has no attribute 'K3'\nE   AttributeError: 'TestMultiGraph' object has no attribute 'K3'","networkx/classes/tests/test_graph.py::networkx::classes::tests::test_special::TestMultiGraph::test_size":"AttributeError: 'TestMultiGraph' object has no attribute 'K3'\nE   AttributeError: 'TestMultiGraph' object has no attribute 'K3'","networkx/classes/tests/test_graph.py::networkx::classes::tests::test_special::TestMultiGraph::test_nbunch_iter":"AttributeError: 'TestMultiGraph' object has no attribute 'K3'\nE   AttributeError: 'TestMultiGraph' object has no attribute 'K3'","networkx/classes/tests/test_graph.py::networkx::classes::tests::test_special::TestMultiGraph::test_nbunch_iter_node_format_raise":"AttributeError: 'TestMultiGraph' object has no attribute 'Graph'\nE   AttributeError: 'TestMultiGraph' object has no attribute 'Graph'","networkx/classes/tests/test_graph.py::networkx::classes::tests::test_special::TestMultiGraph::test_selfloop_degree":"AttributeError: 'TestMultiGraph' object has no attribute 'Graph'\nE   AttributeError: 'TestMultiGraph' object has no attribute 'Graph'","networkx/classes/tests/test_graph.py::networkx::classes::tests::test_special::TestMultiGraph::test_selfloops":"AttributeError: 'TestMultiGraph' object has no attribute 'K3'\nE   AttributeError: 'TestMultiGraph' object has no attribute 'K3'","networkx/classes/tests/test_graph.py::networkx::classes::tests::test_special::TestMultiGraph::test_weighted_degree":"AttributeError: 'TestMultiGraph' object has no attribute 'Graph'\nE   AttributeError: 'TestMultiGraph' object has no attribute 'Graph'","networkx/classes/tests/test_graph.py::networkx::classes::tests::test_special::TestMultiGraph::test_name":"AttributeError: 'TestMultiGraph' object has no attribute 'Graph'\nE   AttributeError: 'TestMultiGraph' object has no attribute 'Graph'","networkx/classes/tests/test_graph.py::networkx::classes::tests::test_special::TestMultiGraph::test_graph_chain":"AttributeError: 'TestMultiGraph' object has no attribute 'Graph'\nE   AttributeError: 'TestMultiGraph' object has no attribute 'Graph'","networkx/classes/tests/test_graph.py::networkx::classes::tests::test_special::TestMultiGraph::test_copy":"AttributeError: 'TestMultiGraph' object has no attribute 'Graph'\nE   AttributeError: 'TestMultiGraph' object has no attribute 'Graph'","networkx/classes/tests/test_graph.py::networkx::classes::tests::test_special::TestMultiGraph::test_class_copy":"AttributeError: 'TestMultiGraph' object has no attribute 'Graph'\nE   AttributeError: 'TestMultiGraph' object has no attribute 'Graph'","networkx/classes/tests/test_graph.py::networkx::classes::tests::test_special::TestMultiGraph::test_fresh_copy":"AttributeError: 'TestMultiGraph' object has no attribute 'Graph'\nE   AttributeError: 'TestMultiGraph' object has no attribute 'Graph'","networkx/classes/tests/test_graph.py::networkx::classes::tests::test_special::TestMultiGraph::test_graph_attr":"AttributeError: 'TestMultiGraph' object has no attribute 'K3'\nE   AttributeError: 'TestMultiGraph' object has no attribute 'K3'","networkx/classes/tests/test_graph.py::networkx::classes::tests::test_special::TestMultiGraph::test_node_attr":"AttributeError: 'TestMultiGraph' object has no attribute 'K3'\nE   AttributeError: 'TestMultiGraph' object has no attribute 'K3'","networkx/classes/tests/test_graph.py::networkx::classes::tests::test_special::TestMultiGraph::test_node_attr2":"AttributeError: 'TestMultiGraph' object has no attribute 'K3'\nE   AttributeError: 'TestMultiGraph' object has no attribute 'K3'","networkx/classes/tests/test_graph.py::networkx::classes::tests::test_special::TestMultiGraph::test_edge_attr":"AttributeError: 'TestMultiGraph' object has no attribute 'Graph'\nE   AttributeError: 'TestMultiGraph' object has no attribute 'Graph'","networkx/classes/tests/test_graph.py::networkx::classes::tests::test_special::TestMultiGraph::test_edge_attr2":"AttributeError: 'TestMultiGraph' object has no attribute 'Graph'\nE   AttributeError: 'TestMultiGraph' object has no attribute 'Graph'","networkx/classes/tests/test_graph.py::networkx::classes::tests::test_special::TestMultiGraph::test_edge_attr3":"AttributeError: 'TestMultiGraph' object has no attribute 'Graph'\nE   AttributeError: 'TestMultiGraph' object has no attribute 'Graph'","networkx/classes/tests/test_graph.py::networkx::classes::tests::test_special::TestMultiGraph::test_subgraph":"AttributeError: 'TestMultiGraph' object has no attribute 'K3'\nE   AttributeError: 'TestMultiGraph' object has no attribute 'K3'","networkx/classes/tests/test_graph.py::networkx::classes::tests::test_special::TestMultiGraph::test_selfloops_attr":"AttributeError: 'TestMultiGraph' object has no attribute 'K3'\nE   AttributeError: 'TestMultiGraph' object has no attribute 'K3'","networkx/classes/tests/test_graph.py::networkx::classes::tests::test_special::TestMultiGraph::test_pickle":"AttributeError: 'TestMultiGraph' object has no attribute 'K3'\nE   AttributeError: 'TestMultiGraph' object has no attribute 'K3'","networkx/classes/tests/test_graph.py::networkx::classes::tests::test_special::TestMultiGraph::test_add_node":"AttributeError: 'TestMultiGraph' object has no attribute 'Graph'\nE   AttributeError: 'TestMultiGraph' object has no attribute 'Graph'","networkx/classes/tests/test_graph.py::networkx::classes::tests::test_special::TestMultiGraph::test_add_nodes_from":"AttributeError: 'TestMultiGraph' object has no attribute 'Graph'\nE   AttributeError: 'TestMultiGraph' object has no attribute 'Graph'","networkx/classes/tests/test_graph.py::networkx::classes::tests::test_special::TestMultiGraph::test_remove_nodes_from":"AttributeError: 'TestMultiGraph' object has no attribute 'K3'\nE   AttributeError: 'TestMultiGraph' object has no attribute 'K3'","networkx/classes/tests/test_graph.py::networkx::classes::tests::test_special::TestMultiGraph::test_clear":"AttributeError: 'TestMultiGraph' object has no attribute 'K3'\nE   AttributeError: 'TestMultiGraph' object has no attribute 'K3'","networkx/classes/tests/test_graph.py::networkx::classes::tests::test_special::TestMultiGraph::test_edges_data":"AttributeError: 'TestMultiGraph' object has no attribute 'K3'\nE   AttributeError: 'TestMultiGraph' object has no attribute 'K3'","networkx/classes/tests/test_graph.py::networkx::classes::tests::test_special::TestMultiGraph::test_update":"AttributeError: 'TestMultiGraph' object has no attribute 'K3'\nE   AttributeError: 'TestMultiGraph' object has no attribute 'K3'","networkx/classes/tests/test_multigraph.py::networkx::classes::tests::test_special::TestMultiGraph::test_has_edge":"AttributeError: 'TestMultiGraph' object has no attribute 'K3'\nE   AttributeError: 'TestMultiGraph' object has no attribute 'K3'","networkx/classes/tests/test_multigraph.py::networkx::classes::tests::test_special::TestMultiGraph::test_get_edge_data":"AttributeError: 'TestMultiGraph' object has no attribute 'K3'\nE   AttributeError: 'TestMultiGraph' object has no attribute 'K3'","networkx/classes/tests/test_multigraph.py::networkx::classes::tests::test_special::TestMultiGraph::test_adjacency":"AttributeError: 'TestMultiGraph' object has no attribute 'K3'\nE   AttributeError: 'TestMultiGraph' object has no attribute 'K3'","networkx/classes/tests/test_multigraph.py::networkx::classes::tests::test_special::TestMultiGraph::test_to_undirected":"AttributeError: 'TestMultiGraph' object has no attribute 'K3'\nE   AttributeError: 'TestMultiGraph' object has no attribute 'K3'","networkx/classes/tests/test_multigraph.py::networkx::classes::tests::test_special::TestMultiGraph::test_to_directed":"AttributeError: 'TestMultiGraph' object has no attribute 'K3'\nE   AttributeError: 'TestMultiGraph' object has no attribute 'K3'","networkx/classes/tests/test_multigraph.py::networkx::classes::tests::test_special::TestMultiGraph::test_number_of_edges_selfloops":"AttributeError: 'TestMultiGraph' object has no attribute 'K3'\nE   AttributeError: 'TestMultiGraph' object has no attribute 'K3'","networkx/classes/tests/test_multigraph.py::networkx::classes::tests::test_special::TestMultiGraph::test_edge_lookup":"AttributeError: 'TestMultiGraph' object has no attribute 'Graph'\nE   AttributeError: 'TestMultiGraph' object has no attribute 'Graph'","networkx/classes/tests/test_multigraph.py::networkx::classes::tests::test_special::TestMultiGraph::test_edge_attr4":"AttributeError: 'TestMultiGraph' object has no attribute 'Graph'\nE   AttributeError: 'TestMultiGraph' object has no attribute 'Graph'","networkx/classes/tests/test_multigraph.py::networkx::classes::tests::test_special::TestMultiGraph::test_data_input":"AttributeError: 'TestMultiGraph' object has no attribute 'Graph'\nE   AttributeError: 'TestMultiGraph' object has no attribute 'Graph'","networkx/classes/tests/test_multigraph.py::networkx::classes::tests::test_special::TestMultiGraph::test_getitem":"AttributeError: 'TestMultiGraph' object has no attribute 'K3'\nE   AttributeError: 'TestMultiGraph' object has no attribute 'K3'","networkx/classes/tests/test_multigraph.py::networkx::classes::tests::test_special::TestMultiGraph::test_remove_node":"AttributeError: 'TestMultiGraph' object has no attribute 'K3'\nE   AttributeError: 'TestMultiGraph' object has no attribute 'K3'","networkx/classes/tests/test_multigraph.py::networkx::classes::tests::test_special::TestMultiGraph::test_add_edge":"AttributeError: 'TestMultiGraph' object has no attribute 'Graph'\nE   AttributeError: 'TestMultiGraph' object has no attribute 'Graph'","networkx/classes/tests/test_multigraph.py::networkx::classes::tests::test_special::TestMultiGraph::test_add_edge_conflicting_key":"AttributeError: 'TestMultiGraph' object has no attribute 'Graph'\nE   AttributeError: 'TestMultiGraph' object has no attribute 'Graph'","networkx/classes/tests/test_multigraph.py::networkx::classes::tests::test_special::TestMultiGraph::test_add_edges_from":"AttributeError: 'TestMultiGraph' object has no attribute 'Graph'\nE   AttributeError: 'TestMultiGraph' object has no attribute 'Graph'","networkx/classes/tests/test_multigraph.py::networkx::classes::tests::test_special::TestMultiGraph::test_remove_edge":"AttributeError: 'TestMultiGraph' object has no attribute 'K3'\nE   AttributeError: 'TestMultiGraph' object has no attribute 'K3'","networkx/classes/tests/test_multigraph.py::networkx::classes::tests::test_special::TestMultiGraph::test_remove_edges_from":"AttributeError: 'TestMultiGraph' object has no attribute 'K3'\nE   AttributeError: 'TestMultiGraph' object has no attribute 'K3'","networkx/classes/tests/test_multigraph.py::networkx::classes::tests::test_special::TestMultiGraph::test_remove_multiedge":"AttributeError: 'TestMultiGraph' object has no attribute 'K3'\nE   AttributeError: 'TestMultiGraph' object has no attribute 'K3'","networkx/classes/tests/test_graph.py::networkx::classes::tests::test_special::TestMultiDiGraph::test_contains":"AttributeError: 'TestMultiDiGraph' object has no attribute 'K3'\nE   AttributeError: 'TestMultiDiGraph' object has no attribute 'K3'","networkx/classes/tests/test_graph.py::networkx::classes::tests::test_special::TestMultiDiGraph::test_order":"AttributeError: 'TestMultiDiGraph' object has no attribute 'K3'\nE   AttributeError: 'TestMultiDiGraph' object has no attribute 'K3'","networkx/classes/tests/test_graph.py::networkx::classes::tests::test_special::TestMultiDiGraph::test_nodes":"AttributeError: 'TestMultiDiGraph' object has no attribute 'K3'\nE   AttributeError: 'TestMultiDiGraph' object has no attribute 'K3'","networkx/classes/tests/test_graph.py::networkx::classes::tests::test_special::TestMultiDiGraph::test_has_node":"AttributeError: 'TestMultiDiGraph' object has no attribute 'K3'\nE   AttributeError: 'TestMultiDiGraph' object has no attribute 'K3'","networkx/classes/tests/test_graph.py::networkx::classes::tests::test_special::TestMultiDiGraph::test_neighbors":"AttributeError: 'TestMultiDiGraph' object has no attribute 'K3'\nE   AttributeError: 'TestMultiDiGraph' object has no attribute 'K3'","networkx/classes/tests/test_graph.py::networkx::classes::tests::test_special::TestMultiDiGraph::test_memory_leak":"AttributeError: 'TestMultiDiGraph' object has no attribute 'Graph'\nE   AttributeError: 'TestMultiDiGraph' object has no attribute 'Graph'","networkx/classes/tests/test_graph.py::networkx::classes::tests::test_special::TestMultiDiGraph::test_nbunch_iter":"AttributeError: 'TestMultiDiGraph' object has no attribute 'K3'\nE   AttributeError: 'TestMultiDiGraph' object has no attribute 'K3'","networkx/classes/tests/test_graph.py::networkx::classes::tests::test_special::TestMultiDiGraph::test_nbunch_iter_node_format_raise":"AttributeError: 'TestMultiDiGraph' object has no attribute 'Graph'\nE   AttributeError: 'TestMultiDiGraph' object has no attribute 'Graph'","networkx/classes/tests/test_graph.py::networkx::classes::tests::test_special::TestMultiDiGraph::test_selfloop_degree":"AttributeError: 'TestMultiDiGraph' object has no attribute 'Graph'\nE   AttributeError: 'TestMultiDiGraph' object has no attribute 'Graph'","networkx/classes/tests/test_graph.py::networkx::classes::tests::test_special::TestMultiDiGraph::test_selfloops":"AttributeError: 'TestMultiDiGraph' object has no attribute 'K3'\nE   AttributeError: 'TestMultiDiGraph' object has no attribute 'K3'","networkx/classes/tests/test_graph.py::networkx::classes::tests::test_special::TestMultiDiGraph::test_weighted_degree":"AttributeError: 'TestMultiDiGraph' object has no attribute 'Graph'\nE   AttributeError: 'TestMultiDiGraph' object has no attribute 'Graph'","networkx/classes/tests/test_graph.py::networkx::classes::tests::test_special::TestMultiDiGraph::test_name":"AttributeError: 'TestMultiDiGraph' object has no attribute 'Graph'\nE   AttributeError: 'TestMultiDiGraph' object has no attribute 'Graph'","networkx/classes/tests/test_graph.py::networkx::classes::tests::test_special::TestMultiDiGraph::test_graph_chain":"AttributeError: 'TestMultiDiGraph' object has no attribute 'Graph'\nE   AttributeError: 'TestMultiDiGraph' object has no attribute 'Graph'","networkx/classes/tests/test_graph.py::networkx::classes::tests::test_special::TestMultiDiGraph::test_copy":"AttributeError: 'TestMultiDiGraph' object has no attribute 'Graph'\nE   AttributeError: 'TestMultiDiGraph' object has no attribute 'Graph'","networkx/classes/tests/test_graph.py::networkx::classes::tests::test_special::TestMultiDiGraph::test_class_copy":"AttributeError: 'TestMultiDiGraph' object has no attribute 'Graph'\nE   AttributeError: 'TestMultiDiGraph' object has no attribute 'Graph'","networkx/classes/tests/test_graph.py::networkx::classes::tests::test_special::TestMultiDiGraph::test_fresh_copy":"AttributeError: 'TestMultiDiGraph' object has no attribute 'Graph'\nE   AttributeError: 'TestMultiDiGraph' object has no attribute 'Graph'","networkx/classes/tests/test_graph.py::networkx::classes::tests::test_special::TestMultiDiGraph::test_graph_attr":"AttributeError: 'TestMultiDiGraph' object has no attribute 'K3'\nE   AttributeError: 'TestMultiDiGraph' object has no attribute 'K3'","networkx/classes/tests/test_graph.py::networkx::classes::tests::test_special::TestMultiDiGraph::test_node_attr":"AttributeError: 'TestMultiDiGraph' object has no attribute 'K3'\nE   AttributeError: 'TestMultiDiGraph' object has no attribute 'K3'","networkx/classes/tests/test_graph.py::networkx::classes::tests::test_special::TestMultiDiGraph::test_node_attr2":"AttributeError: 'TestMultiDiGraph' object has no attribute 'K3'\nE   AttributeError: 'TestMultiDiGraph' object has no attribute 'K3'","networkx/classes/tests/test_graph.py::networkx::classes::tests::test_special::TestMultiDiGraph::test_edge_attr":"AttributeError: 'TestMultiDiGraph' object has no attribute 'Graph'\nE   AttributeError: 'TestMultiDiGraph' object has no attribute 'Graph'","networkx/classes/tests/test_graph.py::networkx::classes::tests::test_special::TestMultiDiGraph::test_edge_attr2":"AttributeError: 'TestMultiDiGraph' object has no attribute 'Graph'\nE   AttributeError: 'TestMultiDiGraph' object has no attribute 'Graph'","networkx/classes/tests/test_graph.py::networkx::classes::tests::test_special::TestMultiDiGraph::test_edge_attr3":"AttributeError: 'TestMultiDiGraph' object has no attribute 'Graph'\nE   AttributeError: 'TestMultiDiGraph' object has no attribute 'Graph'","networkx/classes/tests/test_graph.py::networkx::classes::tests::test_special::TestMultiDiGraph::test_subgraph":"AttributeError: 'TestMultiDiGraph' object has no attribute 'K3'\nE   AttributeError: 'TestMultiDiGraph' object has no attribute 'K3'","networkx/classes/tests/test_graph.py::networkx::classes::tests::test_special::TestMultiDiGraph::test_selfloops_attr":"AttributeError: 'TestMultiDiGraph' object has no attribute 'K3'\nE   AttributeError: 'TestMultiDiGraph' object has no attribute 'K3'","networkx/classes/tests/test_graph.py::networkx::classes::tests::test_special::TestMultiDiGraph::test_pickle":"AttributeError: 'TestMultiDiGraph' object has no attribute 'K3'\nE   AttributeError: 'TestMultiDiGraph' object has no attribute 'K3'","networkx/classes/tests/test_graph.py::networkx::classes::tests::test_special::TestMultiDiGraph::test_add_node":"AttributeError: 'TestMultiDiGraph' object has no attribute 'Graph'\nE   AttributeError: 'TestMultiDiGraph' object has no attribute 'Graph'","networkx/classes/tests/test_graph.py::networkx::classes::tests::test_special::TestMultiDiGraph::test_add_nodes_from":"AttributeError: 'TestMultiDiGraph' object has no attribute 'Graph'\nE   AttributeError: 'TestMultiDiGraph' object has no attribute 'Graph'","networkx/classes/tests/test_graph.py::networkx::classes::tests::test_special::TestMultiDiGraph::test_remove_nodes_from":"AttributeError: 'TestMultiDiGraph' object has no attribute 'K3'\nE   AttributeError: 'TestMultiDiGraph' object has no attribute 'K3'","networkx/classes/tests/test_graph.py::networkx::classes::tests::test_special::TestMultiDiGraph::test_clear":"AttributeError: 'TestMultiDiGraph' object has no attribute 'K3'\nE   AttributeError: 'TestMultiDiGraph' object has no attribute 'K3'","networkx/classes/tests/test_graph.py::networkx::classes::tests::test_special::TestMultiDiGraph::test_update":"AttributeError: 'TestMultiDiGraph' object has no attribute 'K3'\nE   AttributeError: 'TestMultiDiGraph' object has no attribute 'K3'","networkx/classes/tests/test_multigraph.py::networkx::classes::tests::test_special::TestMultiDiGraph::test_has_edge":"AttributeError: 'TestMultiDiGraph' object has no attribute 'K3'\nE   AttributeError: 'TestMultiDiGraph' object has no attribute 'K3'","networkx/classes/tests/test_multigraph.py::networkx::classes::tests::test_special::TestMultiDiGraph::test_get_edge_data":"AttributeError: 'TestMultiDiGraph' object has no attribute 'K3'\nE   AttributeError: 'TestMultiDiGraph' object has no attribute 'K3'","networkx/classes/tests/test_multigraph.py::networkx::classes::tests::test_special::TestMultiDiGraph::test_adjacency":"AttributeError: 'TestMultiDiGraph' object has no attribute 'K3'\nE   AttributeError: 'TestMultiDiGraph' object has no attribute 'K3'","networkx/classes/tests/test_multigraph.py::networkx::classes::tests::test_special::TestMultiDiGraph::test_to_directed":"AttributeError: 'TestMultiDiGraph' object has no attribute 'K3'\nE   AttributeError: 'TestMultiDiGraph' object has no attribute 'K3'","networkx/classes/tests/test_multigraph.py::networkx::classes::tests::test_special::TestMultiDiGraph::test_number_of_edges_selfloops":"AttributeError: 'TestMultiDiGraph' object has no attribute 'K3'\nE   AttributeError: 'TestMultiDiGraph' object has no attribute 'K3'","networkx/classes/tests/test_multigraph.py::networkx::classes::tests::test_special::TestMultiDiGraph::test_edge_lookup":"AttributeError: 'TestMultiDiGraph' object has no attribute 'Graph'\nE   AttributeError: 'TestMultiDiGraph' object has no attribute 'Graph'","networkx/classes/tests/test_multigraph.py::networkx::classes::tests::test_special::TestMultiDiGraph::test_edge_attr4":"AttributeError: 'TestMultiDiGraph' object has no attribute 'Graph'\nE   AttributeError: 'TestMultiDiGraph' object has no attribute 'Graph'","networkx/classes/tests/test_multigraph.py::networkx::classes::tests::test_special::TestMultiDiGraph::test_data_input":"AttributeError: 'TestMultiDiGraph' object has no attribute 'Graph'\nE   AttributeError: 'TestMultiDiGraph' object has no attribute 'Graph'","networkx/classes/tests/test_multigraph.py::networkx::classes::tests::test_special::TestMultiDiGraph::test_getitem":"AttributeError: 'TestMultiDiGraph' object has no attribute 'K3'\nE   AttributeError: 'TestMultiDiGraph' object has no attribute 'K3'","networkx/classes/tests/test_multigraph.py::networkx::classes::tests::test_special::TestMultiDiGraph::test_remove_node":"AttributeError: 'TestMultiDiGraph' object has no attribute 'K3'\nE   AttributeError: 'TestMultiDiGraph' object has no attribute 'K3'","networkx/classes/tests/test_multigraph.py::networkx::classes::tests::test_special::TestMultiDiGraph::test_add_edge_conflicting_key":"AttributeError: 'TestMultiDiGraph' object has no attribute 'Graph'\nE   AttributeError: 'TestMultiDiGraph' object has no attribute 'Graph'","networkx/classes/tests/test_multidigraph.py::networkx::classes::tests::test_special::TestMultiDiGraph::test_edges":"AttributeError: 'TestMultiDiGraph' object has no attribute 'K3'\nE   AttributeError: 'TestMultiDiGraph' object has no attribute 'K3'","networkx/classes/tests/test_multidigraph.py::networkx::classes::tests::test_special::TestMultiDiGraph::test_edges_data":"AttributeError: 'TestMultiDiGraph' object has no attribute 'K3'\nE   AttributeError: 'TestMultiDiGraph' object has no attribute 'K3'","networkx/classes/tests/test_multidigraph.py::networkx::classes::tests::test_special::TestMultiDiGraph::test_edges_multi":"AttributeError: 'TestMultiDiGraph' object has no attribute 'K3'\nE   AttributeError: 'TestMultiDiGraph' object has no attribute 'K3'","networkx/classes/tests/test_multidigraph.py::networkx::classes::tests::test_special::TestMultiDiGraph::test_out_edges":"AttributeError: 'TestMultiDiGraph' object has no attribute 'K3'\nE   AttributeError: 'TestMultiDiGraph' object has no attribute 'K3'","networkx/classes/tests/test_multidigraph.py::networkx::classes::tests::test_special::TestMultiDiGraph::test_out_edges_multi":"AttributeError: 'TestMultiDiGraph' object has no attribute 'K3'\nE   AttributeError: 'TestMultiDiGraph' object has no attribute 'K3'","networkx/classes/tests/test_multidigraph.py::networkx::classes::tests::test_special::TestMultiDiGraph::test_out_edges_data":"AttributeError: 'TestMultiDiGraph' object has no attribute 'K3'\nE   AttributeError: 'TestMultiDiGraph' object has no attribute 'K3'","networkx/classes/tests/test_multidigraph.py::networkx::classes::tests::test_special::TestMultiDiGraph::test_in_edges":"AttributeError: 'TestMultiDiGraph' object has no attribute 'K3'\nE   AttributeError: 'TestMultiDiGraph' object has no attribute 'K3'","networkx/classes/tests/test_multidigraph.py::networkx::classes::tests::test_special::TestMultiDiGraph::test_in_edges_no_keys":"AttributeError: 'TestMultiDiGraph' object has no attribute 'K3'\nE   AttributeError: 'TestMultiDiGraph' object has no attribute 'K3'","networkx/classes/tests/test_multidigraph.py::networkx::classes::tests::test_special::TestMultiDiGraph::test_in_edges_data":"AttributeError: 'TestMultiDiGraph' object has no attribute 'K3'\nE   AttributeError: 'TestMultiDiGraph' object has no attribute 'K3'","networkx/classes/tests/test_multidigraph.py::networkx::classes::tests::test_special::TestMultiDiGraph::test_to_undirected":"AttributeError: 'TestMultiDiGraph' object has no attribute 'K3'\nE   AttributeError: 'TestMultiDiGraph' object has no attribute 'K3'","networkx/classes/tests/test_multidigraph.py::networkx::classes::tests::test_special::TestMultiDiGraph::test_has_successor":"AttributeError: 'TestMultiDiGraph' object has no attribute 'K3'\nE   AttributeError: 'TestMultiDiGraph' object has no attribute 'K3'","networkx/classes/tests/test_multidigraph.py::networkx::classes::tests::test_special::TestMultiDiGraph::test_successors":"AttributeError: 'TestMultiDiGraph' object has no attribute 'K3'\nE   AttributeError: 'TestMultiDiGraph' object has no attribute 'K3'","networkx/classes/tests/test_multidigraph.py::networkx::classes::tests::test_special::TestMultiDiGraph::test_has_predecessor":"AttributeError: 'TestMultiDiGraph' object has no attribute 'K3'\nE   AttributeError: 'TestMultiDiGraph' object has no attribute 'K3'","networkx/classes/tests/test_multidigraph.py::networkx::classes::tests::test_special::TestMultiDiGraph::test_predecessors":"AttributeError: 'TestMultiDiGraph' object has no attribute 'K3'\nE   AttributeError: 'TestMultiDiGraph' object has no attribute 'K3'","networkx/classes/tests/test_multidigraph.py::networkx::classes::tests::test_special::TestMultiDiGraph::test_degree":"AttributeError: 'TestMultiDiGraph' object has no attribute 'K3'\nE   AttributeError: 'TestMultiDiGraph' object has no attribute 'K3'","networkx/classes/tests/test_multidigraph.py::networkx::classes::tests::test_special::TestMultiDiGraph::test_in_degree":"AttributeError: 'TestMultiDiGraph' object has no attribute 'K3'\nE   AttributeError: 'TestMultiDiGraph' object has no attribute 'K3'","networkx/classes/tests/test_multidigraph.py::networkx::classes::tests::test_special::TestMultiDiGraph::test_out_degree":"AttributeError: 'TestMultiDiGraph' object has no attribute 'K3'\nE   AttributeError: 'TestMultiDiGraph' object has no attribute 'K3'","networkx/classes/tests/test_multidigraph.py::networkx::classes::tests::test_special::TestMultiDiGraph::test_size":"AttributeError: 'TestMultiDiGraph' object has no attribute 'K3'\nE   AttributeError: 'TestMultiDiGraph' object has no attribute 'K3'","networkx/classes/tests/test_multidigraph.py::networkx::classes::tests::test_special::TestMultiDiGraph::test_to_undirected_reciprocal":"AttributeError: 'TestMultiDiGraph' object has no attribute 'Graph'\nE   AttributeError: 'TestMultiDiGraph' object has no attribute 'Graph'","networkx/classes/tests/test_multidigraph.py::networkx::classes::tests::test_special::TestMultiDiGraph::test_add_edge":"AttributeError: 'TestMultiDiGraph' object has no attribute 'Graph'\nE   AttributeError: 'TestMultiDiGraph' object has no attribute 'Graph'","networkx/classes/tests/test_multidigraph.py::networkx::classes::tests::test_special::TestMultiDiGraph::test_add_edges_from":"AttributeError: 'TestMultiDiGraph' object has no attribute 'Graph'\nE   AttributeError: 'TestMultiDiGraph' object has no attribute 'Graph'","networkx/classes/tests/test_multidigraph.py::networkx::classes::tests::test_special::TestMultiDiGraph::test_remove_edge":"AttributeError: 'TestMultiDiGraph' object has no attribute 'K3'\nE   AttributeError: 'TestMultiDiGraph' object has no attribute 'K3'","networkx/classes/tests/test_multidigraph.py::networkx::classes::tests::test_special::TestMultiDiGraph::test_remove_multiedge":"AttributeError: 'TestMultiDiGraph' object has no attribute 'K3'\nE   AttributeError: 'TestMultiDiGraph' object has no attribute 'K3'","networkx/classes/tests/test_multidigraph.py::networkx::classes::tests::test_special::TestMultiDiGraph::test_remove_edges_from":"AttributeError: 'TestMultiDiGraph' object has no attribute 'K3'\nE   AttributeError: 'TestMultiDiGraph' object has no attribute 'K3'"}},"diff":null,"patch_sha256":null,"dropped_paths":[],"snapshot_sha":null}
{"receipt_id":"agent1-5","seq":5,"branch_id":"agent1","kind":"write","cmd":"/opt/receipts-af8b4e00b14a45beba6280fe0cef6a00/bin/busybox sh -c 'mkdir -p /networkx/networkx/classes && cp /opt/receipts-af8b4e00b14a45beba6280fe0cef6a00/incoming/af145d5e432f36460575294d5e7da3b123f24871ce0734f30edc73c5ed438c91 /networkx/networkx/classes/digraph.py'","path":"networkx/classes/digraph.py","exit_code":0,"stdout_tail":"","stderr_tail":"","stdout_sha256":"af145d5e432f36460575294d5e7da3b123f24871ce0734f30edc73c5ed438c91","log_path":"~/dev/nebius-hackathon/pilot/v2-P/networkx__networkx-3101/runs/pilot-networkx__networkx-3101-6b3707109a/logs/agent1/agent1-5.log","tree_digest":null,"tree_download_s":null,"started_at":"2026-10-03T17:59:18.828409Z","duration_s":0.004444,"timed_out":false,"image_before":"6721af3b-0ea2-4366-b005-65c78c140c5a","image_after":"38a2b333-966a-4887-819a-8545be3d8cb8","junit":null,"diff":null,"patch_sha256":null,"dropped_paths":[],"snapshot_sha":null}
{"receipt_id":"agent1-6","seq":6,"branch_id":"agent1","kind":"command","cmd":"/opt/receipts-0427361e681244c99cfee1579f50e987/bin/busybox mkdir -p /opt/receipts/reports && python -I /opt/receipts-0427361e681244c99cfee1579f50e987/receipts_pytest.py networkx/classes/tests/test_special.py::test_factories -v -o junit_family=xunit1 -p no:cacheprovider -rA --continue-on-collection-errors --junitxml=/opt/receipts/reports/agent1-6.xml","path":null,"exit_code":1,"stdout_tail":"============================= test session starts ==============================\nplatform linux -- Python 3.7.17, pytest-7.4.4, pluggy-1.2.0 -- /usr/local/bin/python\nrootdir: /networkx\ncollecting ... collected 1 item\n\nnetworkx/classes/tests/test_special.py::test_factories FAILED            [100%]\n\n=================================== FAILURES ===================================\n________________________________ test_factories ________________________________\n\n    def test_factories():\n        class mydict1(dict):\n            pass\n    \n        class mydict2(dict):\n            pass\n    \n        class mydict3(dict):\n            pass\n    \n        class mydict4(dict):\n            pass\n    \n        class mydict5(dict):\n            pass\n    \n        for Graph in (nx.Graph, nx.DiGraph, nx.MultiGraph, nx.MultiDiGraph):\n            # print(\"testing class: \", Graph.__name__)\n            class MyGraph(Graph):\n                node_dict_factory = mydict1\n                adjlist_outer_dict_factory = mydict2\n                adjlist_inner_dict_factory = mydict3\n                edge_key_dict_factory = mydict4\n                edge_attr_dict_factory = mydict5\n            G = MyGraph()\n            assert_is_instance(G._node, mydict1)\n>           assert_is_instance(G._adj, mydict2)\n\nnetworkx/classes/tests/test_special.py:37: \n_ _ _ _ _ _ _ _ _ _ _ _ _ _ _ _ _ _ _ _ _ _ _ _ _ _ _ _ _ _ _ _ _ _ _ _ _ _ _ _ \n/usr/local/lib/python3.7/unittest/case.py:1276: in assertIsInstance\n    self.fail(self._formatMessage(msg, standardMsg))\n_ _ _ _ _ _ _ _ _ _ _ _ _ _ _ _ _ _ _ _ _ _ _ _ _ _ _ _ _ _ _ _ _ _ _ _ _ _ _ _ \n\nself = <nose.tools.trivial.Dummy testMethod=nop>\nmsg = \"{} is not an instance of <class 'test_special.test_factories.<locals>.mydict2'>\"\n\n    def fail(self, msg=None):\n        \"\"\"Fail immediately, with the given message.\"\"\"\n>       raise self.failureException(msg)\nE       AssertionError: {} is not an instance of <class 'test_special.test_factories.<locals>.mydict2'>\n\n/usr/local/lib/python3.7/unittest/case.py:693: AssertionError\n=============================== warnings summary ===============================\n../usr/local/lib/python3.7/site-packages/nose/plugins/manager.py:418\n  /usr/local/lib/python3.7/site-packages/nose/plugins/manager.py:418: DeprecationWarning: pkg_resources is deprecated as an API. See https://setuptools.pypa.io/en/latest/pkg_resources.html\n    import pkg_resources\n\n../usr/local/lib/python3.7/site-packages/nose/importer.py:12\n  /usr/local/lib/python3.7/site-packages/nose/importer.py:12: DeprecationWarning: the imp module is deprecated in favour of importlib; see the module's documentation for alternative uses\n    from imp import find_module, load_module, acquire_lock, release_lock\n\nnetworkx/classes/graph.py:23\n  /networkx/networkx/classes/graph.py:23: DeprecationWarning: Using or importing the ABCs from 'collections' instead of from 'collections.abc' is deprecated since Python 3.3,and in 3.9 it will stop working\n    from collections import Mapping\n\nnetworkx/classes/reportviews.py:95\nnetworkx/classes/reportviews.py:95\n  /networkx/networkx/classes/reportviews.py:95: DeprecationWarning: Using or importing the ABCs from 'collections' instead of from 'collections.abc' is deprecated since Python 3.3,and in 3.9 it will stop working\n    from collections import Mapping, Set, Iterable\n\nnetworkx/generators/expanders.py:70\n  /networkx/networkx/generators/expanders.py:70: DeprecationWarning: invalid escape sequence \\s\n    \"\"\"\n\nnetworkx/generators/geometric.py:275\n  /networkx/networkx/generators/geometric.py:275: DeprecationWarning: invalid escape sequence \\l\n    \"\"\"\n\nnetworkx/generators/geometric.py:764\n  /networkx/networkx/generators/geometric.py:764: DeprecationWarning: invalid escape sequence \\l\n    \"\"\"\n\nnetworkx/algorithms/centrality/current_flow_betweenness.py:325\n  /networkx/networkx/algorithms/centrality/current_flow_betweenness.py:325: DeprecationWarning: invalid escape sequence \\l\n    \"\"\"\n\nnetworkx/algorithms/cluster.py:534\n  /networkx/networkx/algorithms/cluster.py:534: DeprecationWarning: invalid escape sequence \\m\n    \"\"\"\n\nnetworkx/algorithms/reciprocity.py:47\n  /networkx/networkx/algorithms/reciprocity.py:47: DeprecationWarning: invalid escape sequence \\i\n    \"\"\"\n\nnetworkx/algorithms/shortest_paths/weighted.py:2023\n  /networkx/networkx/algorithms/shortest_paths/weighted.py:2023: DeprecationWarning: invalid escape sequence \\p\n    \"\"\"\n\nnetworkx/algorithms/connectivity/connectivity.py:302\n  /networkx/networkx/algorithms/connectivity/connectivity.py:302: DeprecationWarning: invalid escape sequence \\d\n    \"\"\"\n\nnetworkx/algorithms/flow/preflowpush.py:426\n  /networkx/networkx/algorithms/flow/preflowpush.py:426: DeprecationWarning: invalid escape sequence \\s\n    \"\"\"\n\nnetworkx/algorithms/flow/shortestaugmentingpath.py:298\n  /networkx/networkx/algorithms/flow/shortestaugmentingpath.py:298: DeprecationWarning: invalid escape sequence \\m\n    \"\"\"\n\nnetworkx/algorithms/connectivity/stoerwagner.py:94\n  /networkx/networkx/algorithms/connectivity/stoerwagner.py:94: DeprecationWarning: invalid escape sequence \\l\n    \"\"\"\n\nnetworkx/generators/lattice.py:226\n  /networkx/networkx/generators/lattice.py:226: DeprecationWarning: invalid escape sequence \\s\n    \"\"\"\n\nnetworkx/generators/line.py:113\n  /networkx/networkx/generators/line.py:113: DeprecationWarning: invalid escape sequence \\{\n    \"\"\"\n\nnetworkx/linalg/modularitymatrix.py:74\n  /networkx/networkx/linalg/modularitymatrix.py:74: DeprecationWarning: invalid escape sequence \\o\n    \"\"\"\n\n-- Docs: https://docs.pytest.org/en/stable/how-to/capture-warnings.html\n------------ generated xml file: /opt/receipts/reports/agent1-6.xml ------------\n=========================== short test summary info ============================\nFAILED networkx/classes/tests/test_special.py::test_factories - AssertionErro...\n======================== 1 failed, 19 warnings in 0.44s ========================\n","stderr_tail":"","stdout_sha256":"13457b1a644dfaf53c6fa7aed1174b5e3447bb051ec3c2e6d48c9154a537796a","log_path":"~/dev/nebius-hackathon/pilot/v2-P/networkx__networkx-3101/runs/pilot-networkx__networkx-3101-6b3707109a/logs/agent1/agent1-6.log","tree_digest":"c83280df1f9c93d57d5fa89bd07e6a596aaefe5e930df0e9381ee37b47e8e146","tree_download_s":10.96800629212521,"started_at":"2026-10-03T17:59:21.338212Z","duration_s":0.5216000000000001,"timed_out":false,"image_before":"38a2b333-966a-4887-819a-8545be3d8cb8","image_after":"9c3e7cc1-7444-4737-82ae-80719b5fbe00","junit":{"passed":[],"failed":["networkx/classes/tests/test_special.py::test_factories"],"errors":[],"skipped":[],"collection_errors":[],"failure_text":{"networkx/classes/tests/test_special.py::test_factories":"AssertionError: {} is not an instance of <class 'test_special.test_factories.<locals>.mydict2'>\ndef test_factories():\n        class mydict1(dict):\n            pass\n    \n        class mydict2(dict):\n            pass\n    \n        class mydict3(dict):\n            pass\n    \n        class mydict4(dict):\n            pass\n    \n        class mydict5(dict):\n            pass\n    \n        for Graph in (nx.Graph, nx.DiGraph, nx.MultiGraph, nx.MultiDiGraph):\n            # print(\"testing class: \", Graph.__name__)\n            class MyGraph(Graph):\n                node_dict_factory = mydict1\n                adjlist_outer_dict_factory = mydict2\n                adjlist_inner_dict_factory = mydict3\n                edge_key_dict_factory = mydict4\n                edge_attr_dict_factory = mydict5\n            G = MyGraph()\n            assert_is_instance(G._node, mydict1)\n>           assert_is_instance(G._adj, mydict2)\n\nnetworkx/classes/tests/test_special.py:37: \n_ _ _ _ _ _ _ _ _ _ _ _ _ _ _ _ _ _ _ _ _ _ _ _ _ _ _ _ _ _ _ _ _ _ _ _ _ _ _ _ \n/usr/local/lib/python3.7/unittest/case.py:1276: in assertIsInstance\n    self.fail(self._formatMessage(msg, standardMsg))\n_ _ _ _ _ _ _ _ _ _ _ _ _ _ _ _ _ _ _ _ _ _ _ _ _ _ _ _ _ _ _ _ _ _ _ _ _ _ _ _ \n\nself = <nose.tools.trivial.Dummy testMethod=nop>\nmsg = \"{} is not an instance of <class 'test_special.test_factories.<locals>.mydict2'>\"\n\n    def fail(self, msg=None):\n        \"\"\"Fail immediately, with the given message.\"\"\"\n>       raise self.failureException(msg)\nE       AssertionError: {} is not an instance of <class 'test_special.test_factories.<locals>.mydict2'>\n\n/usr/local/lib/python3.7/unittest/case.py:693: AssertionError"}},"diff":null,"patch_sha256":null,"dropped_paths":[],"snapshot_sha":null}
{"receipt_id":"agent1-7","seq":7,"branch_id":"agent1","kind":"write","cmd":"/opt/receipts-a9e65deb35cb4303ad997105b543f604/bin/busybox sh -c 'mkdir -p /networkx/networkx/classes && cp /opt/receipts-a9e65deb35cb4303ad997105b543f604/incoming/a4e59f6db5ba0bfcf8f649822b0944d6d4895da98ae15b45947ac3cd675f2168 /networkx/networkx/classes/digraph.py'","path":"networkx/classes/digraph.py","exit_code":0,"stdout_tail":"","stderr_tail":"","stdout_sha256":"a4e59f6db5ba0bfcf8f649822b0944d6d4895da98ae15b45947ac3cd675f2168","log_path":"~/dev/nebius-hackathon/pilot/v2-P/networkx__networkx-3101/runs/pilot-networkx__networkx-3101-6b3707109a/logs/agent1/agent1-7.log","tree_digest":null,"tree_download_s":null,"started_at":"2026-10-03T17:59:40.004678Z","duration_s":0.004951,"timed_out":false,"image_before":"9c3e7cc1-7444-4737-82ae-80719b5fbe00","image_after":"7d530854-0f8e-466a-b74a-e495a4176238","junit":null,"diff":null,"patch_sha256":null,"dropped_paths":[],"snapshot_sha":null}
{"receipt_id":"agent1-8","seq":8,"branch_id":"agent1","kind":"command","cmd":"/opt/receipts-cad57ab6bd864259ae9f3092f43464ff/bin/busybox mkdir -p /opt/receipts/reports && python -I /opt/receipts-cad57ab6bd864259ae9f3092f43464ff/receipts_pytest.py networkx/classes/tests/test_special.py::test_factories -v -o junit_family=xunit1 -p no:cacheprovider -rA --continue-on-collection-errors --junitxml=/opt/receipts/reports/agent1-8.xml","path":null,"exit_code":1,"stdout_tail":"platform linux -- Python 3.7.17, pytest-7.4.4, pluggy-1.2.0 -- /usr/local/bin/python\nrootdir: /networkx\ncollecting ... collected 1 item\n\nnetworkx/classes/tests/test_special.py::test_factories FAILED            [100%]\n\n=================================== FAILURES ===================================\n________________________________ test_factories ________________________________\n\n    def test_factories():\n        class mydict1(dict):\n            pass\n    \n        class mydict2(dict):\n            pass\n    \n        class mydict3(dict):\n            pass\n    \n        class mydict4(dict):\n            pass\n    \n        class mydict5(dict):\n            pass\n    \n        for Graph in (nx.Graph, nx.DiGraph, nx.MultiGraph, nx.MultiDiGraph):\n            # print(\"testing class: \", Graph.__name__)\n            class MyGraph(Graph):\n                node_dict_factory = mydict1\n                adjlist_outer_dict_factory = mydict2\n                adjlist_inner_dict_factory = mydict3\n                edge_key_dict_factory = mydict4\n                edge_attr_dict_factory = mydict5\n            G = MyGraph()\n            assert_is_instance(G._node, mydict1)\n            assert_is_instance(G._adj, mydict2)\n            G.add_node(1)\n            assert_is_instance(G._adj[1], mydict3)\n            if G.is_directed():\n>               assert_is_instance(G._pred, mydict2)\n\nnetworkx/classes/tests/test_special.py:41: \n_ _ _ _ _ _ _ _ _ _ _ _ _ _ _ _ _ _ _ _ _ _ _ _ _ _ _ _ _ _ _ _ _ _ _ _ _ _ _ _ \n/usr/local/lib/python3.7/unittest/case.py:1276: in assertIsInstance\n    self.fail(self._formatMessage(msg, standardMsg))\n_ _ _ _ _ _ _ _ _ _ _ _ _ _ _ _ _ _ _ _ _ _ _ _ _ _ _ _ _ _ _ _ _ _ _ _ _ _ _ _ \n\nself = <nose.tools.trivial.Dummy testMethod=nop>\nmsg = \"{1: {}} is not an instance of <class 'test_special.test_factories.<locals>.mydict2'>\"\n\n    def fail(self, msg=None):\n        \"\"\"Fail immediately, with the given message.\"\"\"\n>       raise self.failureException(msg)\nE       AssertionError: {1: {}} is not an instance of <class 'test_special.test_factories.<locals>.mydict2'>\n\n/usr/local/lib/python3.7/unittest/case.py:693: AssertionError\n=============================== warnings summary ===============================\n../usr/local/lib/python3.7/site-packages/nose/plugins/manager.py:418\n  /usr/local/lib/python3.7/site-packages/nose/plugins/manager.py:418: DeprecationWarning: pkg_resources is deprecated as an API. See https://setuptools.pypa.io/en/latest/pkg_resources.html\n    import pkg_resources\n\n../usr/local/lib/python3.7/site-packages/nose/importer.py:12\n  /usr/local/lib/python3.7/site-packages/nose/importer.py:12: DeprecationWarning: the imp module is deprecated in favour of importlib; see the module's documentation for alternative uses\n    from imp import find_module, load_module, acquire_lock, release_lock\n\nnetworkx/classes/graph.py:23\n  /networkx/networkx/classes/graph.py:23: DeprecationWarning: Using or importing the ABCs from 'collections' instead of from 'collections.abc' is deprecated since Python 3.3,and in 3.9 it will stop working\n    from collections import Mapping\n\nnetworkx/classes/reportviews.py:95\nnetworkx/classes/reportviews.py:95\n  /networkx/networkx/classes/reportviews.py:95: DeprecationWarning: Using or importing the ABCs from 'collections' instead of from 'collections.abc' is deprecated since Python 3.3,and in 3.9 it will stop working\n    from collections import Mapping, Set, Iterable\n\nnetworkx/generators/expanders.py:70\n  /networkx/networkx/generators/expanders.py:70: DeprecationWarning: invalid escape sequence \\s\n    \"\"\"\n\nnetworkx/generators/geometric.py:275\n  /networkx/networkx/generators/geometric.py:275: DeprecationWarning: invalid escape sequence \\l\n    \"\"\"\n\nnetworkx/generators/geometric.py:764\n  /networkx/networkx/generators/geometric.py:764: DeprecationWarning: invalid escape sequence \\l\n    \"\"\"\n\nnetworkx/algorithms/centrality/current_flow_betweenness.py:325\n  /networkx/networkx/algorithms/centrality/current_flow_betweenness.py:325: DeprecationWarning: invalid escape sequence \\l\n    \"\"\"\n\nnetworkx/algorithms/cluster.py:534\n  /networkx/networkx/algorithms/cluster.py:534: DeprecationWarning: invalid escape sequence \\m\n    \"\"\"\n\nnetworkx/algorithms/reciprocity.py:47\n  /networkx/networkx/algorithms/reciprocity.py:47: DeprecationWarning: invalid escape sequence \\i\n    \"\"\"\n\nnetworkx/algorithms/shortest_paths/weighted.py:2023\n  /networkx/networkx/algorithms/shortest_paths/weighted.py:2023: DeprecationWarning: invalid escape sequence \\p\n    \"\"\"\n\nnetworkx/algorithms/connectivity/connectivity.py:302\n  /networkx/networkx/algorithms/connectivity/connectivity.py:302: DeprecationWarning: invalid escape sequence \\d\n    \"\"\"\n\nnetworkx/algorithms/flow/preflowpush.py:426\n  /networkx/networkx/algorithms/flow/preflowpush.py:426: DeprecationWarning: invalid escape sequence \\s\n    \"\"\"\n\nnetworkx/algorithms/flow/shortestaugmentingpath.py:298\n  /networkx/networkx/algorithms/flow/shortestaugmentingpath.py:298: DeprecationWarning: invalid escape sequence \\m\n    \"\"\"\n\nnetworkx/algorithms/connectivity/stoerwagner.py:94\n  /networkx/networkx/algorithms/connectivity/stoerwagner.py:94: DeprecationWarning: invalid escape sequence \\l\n    \"\"\"\n\nnetworkx/generators/lattice.py:226\n  /networkx/networkx/generators/lattice.py:226: DeprecationWarning: invalid escape sequence \\s\n    \"\"\"\n\nnetworkx/generators/line.py:113\n  /networkx/networkx/generators/line.py:113: DeprecationWarning: invalid escape sequence \\{\n    \"\"\"\n\nnetworkx/linalg/modularitymatrix.py:74\n  /networkx/networkx/linalg/modularitymatrix.py:74: DeprecationWarning: invalid escape sequence \\o\n    \"\"\"\n\n-- Docs: https://docs.pytest.org/en/stable/how-to/capture-warnings.html\n------------ generated xml file: /opt/receipts/reports/agent1-8.xml ------------\n=========================== short test summary info ============================\nFAILED networkx/classes/tests/test_special.py::test_factories - AssertionErro...\n======================== 1 failed, 19 warnings in 0.41s ========================\n","stderr_tail":"","stdout_sha256":"8693732e353944d6ff6c2abcfc8059b923a8c0f6d41e0c4a795805fdbc9387c9","log_path":"~/dev/nebius-hackathon/pilot/v2-P/networkx__networkx-3101/runs/pilot-networkx__networkx-3101-6b3707109a/logs/agent1/agent1-8.log","tree_digest":"3e0c04c191388e0a9ed1b2b8c6b66861cac5e2cbaa86c7df1990a494189b419a","tree_download_s":5.189452042104676,"started_at":"2026-10-03T17:59:42.485622Z","duration_s":0.497427,"timed_out":false,"image_before":"7d530854-0f8e-466a-b74a-e495a4176238","image_after":"d853e1a1-c76b-4dd6-8f47-fe8a44af2ee4","junit":{"passed":[],"failed":["networkx/classes/tests/test_special.py::test_factories"],"errors":[],"skipped":[],"collection_errors":[],"failure_text":{"networkx/classes/tests/test_special.py::test_factories":"AssertionError: {1: {}} is not an instance of <class 'test_special.test_factories.<locals>.mydict2'>\ndef test_factories():\n        class mydict1(dict):\n            pass\n    \n        class mydict2(dict):\n            pass\n    \n        class mydict3(dict):\n            pass\n    \n        class mydict4(dict):\n            pass\n    \n        class mydict5(dict):\n            pass\n    \n        for Graph in (nx.Graph, nx.DiGraph, nx.MultiGraph, nx.MultiDiGraph):\n            # print(\"testing class: \", Graph.__name__)\n            class MyGraph(Graph):\n                node_dict_factory = mydict1\n                adjlist_outer_dict_factory = mydict2\n                adjlist_inner_dict_factory = mydict3\n                edge_key_dict_factory = mydict4\n                edge_attr_dict_factory = mydict5\n            G = MyGraph()\n            assert_is_instance(G._node, mydict1)\n            assert_is_instance(G._adj, mydict2)\n            G.add_node(1)\n            assert_is_instance(G._adj[1], mydict3)\n            if G.is_directed():\n>               assert_is_instance(G._pred, mydict2)\n\nnetworkx/classes/tests/test_special.py:41: \n_ _ _ _ _ _ _ _ _ _ _ _ _ _ _ _ _ _ _ _ _ _ _ _ _ _ _ _ _ _ _ _ _ _ _ _ _ _ _ _ \n/usr/local/lib/python3.7/unittest/case.py:1276: in assertIsInstance\n    self.fail(self._formatMessage(msg, standardMsg))\n_ _ _ _ _ _ _ _ _ _ _ _ _ _ _ _ _ _ _ _ _ _ _ _ _ _ _ _ _ _ _ _ _ _ _ _ _ _ _ _ \n\nself = <nose.tools.trivial.Dummy testMethod=nop>\nmsg = \"{1: {}} is not an instance of <class 'test_special.test_factories.<locals>.mydict2'>\"\n\n    def fail(self, msg=None):\n        \"\"\"Fail immediately, with the given message.\"\"\"\n>       raise self.failureException(msg)\nE       AssertionError: {1: {}} is not an instance of <class 'test_special.test_factories.<locals>.mydict2'>\n\n/usr/local/lib/python3.7/unittest/case.py:693: AssertionError"}},"diff":null,"patch_sha256":null,"dropped_paths":[],"snapshot_sha":null}
{"receipt_id":"agent1-9","seq":9,"branch_id":"agent1","kind":"write","cmd":"/opt/receipts-81b8b9d898d142fc880868e8d56a7e15/bin/busybox sh -c 'mkdir -p /networkx/networkx/classes && cp /opt/receipts-81b8b9d898d142fc880868e8d56a7e15/incoming/31283c43abf82ae027625d63bcbc085d8c1885e389bbaffb74c8b466cf9e7180 /networkx/networkx/classes/digraph.py'","path":"networkx/classes/digraph.py","exit_code":0,"stdout_tail":"","stderr_tail":"","stdout_sha256":"31283c43abf82ae027625d63bcbc085d8c1885e389bbaffb74c8b466cf9e7180","log_path":"~/dev/nebius-hackathon/pilot/v2-P/networkx__networkx-3101/runs/pilot-networkx__networkx-3101-6b3707109a/logs/agent1/agent1-9.log","tree_digest":null,"tree_download_s":null,"started_at":"2026-10-03T17:59:59.369080Z","duration_s":0.004472,"timed_out":false,"image_before":"d853e1a1-c76b-4dd6-8f47-fe8a44af2ee4","image_after":"07322499-1870-46b5-877b-440856e2df17","junit":null,"diff":null,"patch_sha256":null,"dropped_paths":[],"snapshot_sha":null}
{"receipt_id":"agent1-10","seq":10,"branch_id":"agent1","kind":"command","cmd":"/opt/receipts-c581857e064a41eb8e567ed544f7e55c/bin/busybox mkdir -p /opt/receipts/reports && python -I /opt/receipts-c581857e064a41eb8e567ed544f7e55c/receipts_pytest.py networkx/classes/tests/test_special.py::test_factories -v -o junit_family=xunit1 -p no:cacheprovider -rA --continue-on-collection-errors --junitxml=/opt/receipts/reports/agent1-10.xml","path":null,"exit_code":0,"stdout_tail":"============================= test session starts ==============================\nplatform linux -- Python 3.7.17, pytest-7.4.4, pluggy-1.2.0 -- /usr/local/bin/python\nrootdir: /networkx\ncollecting ... collected 1 item\n\nnetworkx/classes/tests/test_special.py::test_factories PASSED            [100%]\n\n=============================== warnings summary ===============================\n../usr/local/lib/python3.7/site-packages/nose/plugins/manager.py:418\n  /usr/local/lib/python3.7/site-packages/nose/plugins/manager.py:418: DeprecationWarning: pkg_resources is deprecated as an API. See https://setuptools.pypa.io/en/latest/pkg_resources.html\n    import pkg_resources\n\n../usr/local/lib/python3.7/site-packages/nose/importer.py:12\n  /usr/local/lib/python3.7/site-packages/nose/importer.py:12: DeprecationWarning: the imp module is deprecated in favour of importlib; see the module's documentation for alternative uses\n    from imp import find_module, load_module, acquire_lock, release_lock\n\nnetworkx/classes/graph.py:23\n  /networkx/networkx/classes/graph.py:23: DeprecationWarning: Using or importing the ABCs from 'collections' instead of from 'collections.abc' is deprecated since Python 3.3,and in 3.9 it will stop working\n    from collections import Mapping\n\nnetworkx/classes/reportviews.py:95\nnetworkx/classes/reportviews.py:95\n  /networkx/networkx/classes/reportviews.py:95: DeprecationWarning: Using or importing the ABCs from 'collections' instead of from 'collections.abc' is deprecated since Python 3.3,and in 3.9 it will stop working\n    from collections import Mapping, Set, Iterable\n\nnetworkx/generators/expanders.py:70\n  /networkx/networkx/generators/expanders.py:70: DeprecationWarning: invalid escape sequence \\s\n    \"\"\"\n\nnetworkx/generators/geometric.py:275\n  /networkx/networkx/generators/geometric.py:275: DeprecationWarning: invalid escape sequence \\l\n    \"\"\"\n\nnetworkx/generators/geometric.py:764\n  /networkx/networkx/generators/geometric.py:764: DeprecationWarning: invalid escape sequence \\l\n    \"\"\"\n\nnetworkx/algorithms/centrality/current_flow_betweenness.py:325\n  /networkx/networkx/algorithms/centrality/current_flow_betweenness.py:325: DeprecationWarning: invalid escape sequence \\l\n    \"\"\"\n\nnetworkx/algorithms/cluster.py:534\n  /networkx/networkx/algorithms/cluster.py:534: DeprecationWarning: invalid escape sequence \\m\n    \"\"\"\n\nnetworkx/algorithms/reciprocity.py:47\n  /networkx/networkx/algorithms/reciprocity.py:47: DeprecationWarning: invalid escape sequence \\i\n    \"\"\"\n\nnetworkx/algorithms/shortest_paths/weighted.py:2023\n  /networkx/networkx/algorithms/shortest_paths/weighted.py:2023: DeprecationWarning: invalid escape sequence \\p\n    \"\"\"\n\nnetworkx/algorithms/connectivity/connectivity.py:302\n  /networkx/networkx/algorithms/connectivity/connectivity.py:302: DeprecationWarning: invalid escape sequence \\d\n    \"\"\"\n\nnetworkx/algorithms/flow/preflowpush.py:426\n  /networkx/networkx/algorithms/flow/preflowpush.py:426: DeprecationWarning: invalid escape sequence \\s\n    \"\"\"\n\nnetworkx/algorithms/flow/shortestaugmentingpath.py:298\n  /networkx/networkx/algorithms/flow/shortestaugmentingpath.py:298: DeprecationWarning: invalid escape sequence \\m\n    \"\"\"\n\nnetworkx/algorithms/connectivity/stoerwagner.py:94\n  /networkx/networkx/algorithms/connectivity/stoerwagner.py:94: DeprecationWarning: invalid escape sequence \\l\n    \"\"\"\n\nnetworkx/generators/lattice.py:226\n  /networkx/networkx/generators/lattice.py:226: DeprecationWarning: invalid escape sequence \\s\n    \"\"\"\n\nnetworkx/generators/line.py:113\n  /networkx/networkx/generators/line.py:113: DeprecationWarning: invalid escape sequence \\{\n    \"\"\"\n\nnetworkx/linalg/modularitymatrix.py:74\n  /networkx/networkx/linalg/modularitymatrix.py:74: DeprecationWarning: invalid escape sequence \\o\n    \"\"\"\n\n-- Docs: https://docs.pytest.org/en/stable/how-to/capture-warnings.html\n==================================== PASSES ====================================\n----------- generated xml file: /opt/receipts/reports/agent1-10.xml ------------\n=========================== short test summary info ============================\nPASSED networkx/classes/tests/test_special.py::test_factories\n======================== 1 passed, 19 warnings in 0.38s ========================\n","stderr_tail":"","stdout_sha256":"41731e22d5d26c264bb99422ec662044d8761fd5a25c3ded4738f0c16387e015","log_path":"~/dev/nebius-hackathon/pilot/v2-P/networkx__networkx-3101/runs/pilot-networkx__networkx-3101-6b3707109a/logs/agent1/agent1-10.log","tree_digest":"3ceae08433a84217b99823bd132d03ce399448970108e950f41275c04a19ce36","tree_download_s":3.6705618330743164,"started_at":"2026-10-03T18:00:02.262069Z","duration_s":0.470302,"timed_out":false,"image_before":"07322499-1870-46b5-877b-440856e2df17","image_after":"cf096837-411c-4143-a125-74a1d6a92eb8","junit":{"passed":["networkx/classes/tests/test_special.py::test_factories"],"failed":[],"errors":[],"skipped":[],"collection_errors":[],"failure_text":{}},"diff":null,"patch_sha256":null,"dropped_paths":[],"snapshot_sha":null}
{"receipt_id":"agent1-11","seq":11,"branch_id":"agent1","kind":"command","cmd":"/opt/receipts-fdbe05395ad34fd39fa1b55964b73f9e/bin/busybox mkdir -p /opt/receipts/reports && python -I /opt/receipts-fdbe05395ad34fd39fa1b55964b73f9e/receipts_pytest.py networkx/classes/tests/test_special.py -x -o junit_family=xunit1 -p no:cacheprovider -rA --continue-on-collection-errors --junitxml=/opt/receipts/reports/agent1-11.xml","path":null,"exit_code":1,"stdout_tail":"============================= test session starts ==============================\nplatform linux -- Python 3.7.17, pytest-7.4.4, pluggy-1.2.0\nrootdir: /networkx\ncollected 232 items\n\nnetworkx/classes/tests/test_special.py F\n\n=================================== FAILURES ===================================\n___________________________ TestGraph.test_contains ____________________________\n\nself = <test_graph.TestGraph object at 0x7ffff5e8f090>\n\n    def test_contains(self):\n>       G = self.K3\nE       AttributeError: 'TestGraph' object has no attribute 'K3'\n\nnetworkx/classes/tests/test_graph.py:41: AttributeError\n=============================== warnings summary ===============================\n../usr/local/lib/python3.7/site-packages/nose/plugins/manager.py:418\n  /usr/local/lib/python3.7/site-packages/nose/plugins/manager.py:418: DeprecationWarning: pkg_resources is deprecated as an API. See https://setuptools.pypa.io/en/latest/pkg_resources.html\n    import pkg_resources\n\n../usr/local/lib/python3.7/site-packages/nose/importer.py:12\n  /usr/local/lib/python3.7/site-packages/nose/importer.py:12: DeprecationWarning: the imp module is deprecated in favour of importlib; see the module's documentation for alternative uses\n    from imp import find_module, load_module, acquire_lock, release_lock\n\nnetworkx/classes/graph.py:23\n  /networkx/networkx/classes/graph.py:23: DeprecationWarning: Using or importing the ABCs from 'collections' instead of from 'collections.abc' is deprecated since Python 3.3,and in 3.9 it will stop working\n    from collections import Mapping\n\nnetworkx/classes/reportviews.py:95\nnetworkx/classes/reportviews.py:95\n  /networkx/networkx/classes/reportviews.py:95: DeprecationWarning: Using or importing the ABCs from 'collections' instead of from 'collections.abc' is deprecated since Python 3.3,and in 3.9 it will stop working\n    from collections import Mapping, Set, Iterable\n\nnetworkx/generators/expanders.py:70\n  /networkx/networkx/generators/expanders.py:70: DeprecationWarning: invalid escape sequence \\s\n    \"\"\"\n\nnetworkx/generators/geometric.py:275\n  /networkx/networkx/generators/geometric.py:275: DeprecationWarning: invalid escape sequence \\l\n    \"\"\"\n\nnetworkx/generators/geometric.py:764\n  /networkx/networkx/generators/geometric.py:764: DeprecationWarning: invalid escape sequence \\l\n    \"\"\"\n\nnetworkx/algorithms/centrality/current_flow_betweenness.py:325\n  /networkx/networkx/algorithms/centrality/current_flow_betweenness.py:325: DeprecationWarning: invalid escape sequence \\l\n    \"\"\"\n\nnetworkx/algorithms/cluster.py:534\n  /networkx/networkx/algorithms/cluster.py:534: DeprecationWarning: invalid escape sequence \\m\n    \"\"\"\n\nnetworkx/algorithms/reciprocity.py:47\n  /networkx/networkx/algorithms/reciprocity.py:47: DeprecationWarning: invalid escape sequence \\i\n    \"\"\"\n\nnetworkx/algorithms/shortest_paths/weighted.py:2023\n  /networkx/networkx/algorithms/shortest_paths/weighted.py:2023: DeprecationWarning: invalid escape sequence \\p\n    \"\"\"\n\nnetworkx/algorithms/connectivity/connectivity.py:302\n  /networkx/networkx/algorithms/connectivity/connectivity.py:302: DeprecationWarning: invalid escape sequence \\d\n    \"\"\"\n\nnetworkx/algorithms/flow/preflowpush.py:426\n  /networkx/networkx/algorithms/flow/preflowpush.py:426: DeprecationWarning: invalid escape sequence \\s\n    \"\"\"\n\nnetworkx/algorithms/flow/shortestaugmentingpath.py:298\n  /networkx/networkx/algorithms/flow/shortestaugmentingpath.py:298: DeprecationWarning: invalid escape sequence \\m\n    \"\"\"\n\nnetworkx/algorithms/connectivity/stoerwagner.py:94\n  /networkx/networkx/algorithms/connectivity/stoerwagner.py:94: DeprecationWarning: invalid escape sequence \\l\n    \"\"\"\n\nnetworkx/generators/lattice.py:226\n  /networkx/networkx/generators/lattice.py:226: DeprecationWarning: invalid escape sequence \\s\n    \"\"\"\n\nnetworkx/generators/line.py:113\n  /networkx/networkx/generators/line.py:113: DeprecationWarning: invalid escape sequence \\{\n    \"\"\"\n\nnetworkx/linalg/modularitymatrix.py:74\n  /networkx/networkx/linalg/modularitymatrix.py:74: DeprecationWarning: invalid escape sequence \\o\n    \"\"\"\n\n-- Docs: https://docs.pytest.org/en/stable/how-to/capture-warnings.html\n----------- generated xml file: /opt/receipts/reports/agent1-11.xml ------------\n=========================== short test summary info ============================\nFAILED networkx/classes/tests/test_special.py::TestGraph::test_contains - Att...\n!!!!!!!!!!!!!!!!!!!!!!!!!! stopping after 1 failures !!!!!!!!!!!!!!!!!!!!!!!!!!!\n======================== 1 failed, 19 warnings in 0.42s ========================\n","stderr_tail":"","stdout_sha256":"371270ace23543715ff53a33dc677c8039dbc51bf95063f73164490fb6f2f431","log_path":"~/dev/nebius-hackathon/pilot/v2-P/networkx__networkx-3101/runs/pilot-networkx__networkx-3101-6b3707109a/logs/agent1/agent1-11.log","tree_digest":"3ceae08433a84217b99823bd132d03ce399448970108e950f41275c04a19ce36","tree_download_s":3.934802166884765,"started_at":"2026-10-03T18:00:10.437215Z","duration_s":0.512562,"timed_out":false,"image_before":"cf096837-411c-4143-a125-74a1d6a92eb8","image_after":"fd3d7c6a-c806-42d9-aae5-03601fd9f782","junit":{"passed":[],"failed":["networkx/classes/tests/test_graph.py::networkx::classes::tests::test_special::TestGraph::test_contains"],"errors":[],"skipped":[],"collection_errors":[],"failure_text":{"networkx/classes/tests/test_graph.py::networkx::classes::tests::test_special::TestGraph::test_contains":"AttributeError: 'TestGraph' object has no attribute 'K3'\nself = <test_graph.TestGraph object at 0x7ffff5e8f090>\n\n    def test_contains(self):\n>       G = self.K3\nE       AttributeError: 'TestGraph' object has no attribute 'K3'\n\nnetworkx/classes/tests/test_graph.py:41: AttributeError"}},"diff":null,"patch_sha256":null,"dropped_paths":[],"snapshot_sha":null}
{"receipt_id":"agent1-12","seq":12,"branch_id":"agent1","kind":"diff","cmd":"compute patch in executor staging agent1-ec6d0b12376241d4a7a5ed78d17f6c06: /opt/homebrew/Cellar/git/2.53.0/bin/git -c core.hooksPath=/dev/null -c core.attributesFile=/dev/null -c diff.external= -c core.quotePath=false add -A && /opt/homebrew/Cellar/git/2.53.0/bin/git -c core.hooksPath=/dev/null -c core.attributesFile=/dev/null -c diff.external= -c core.quotePath=false diff --cached --binary --no-ext-diff --no-textconv --no-renames 45362677276a49d3e6a4173e505ada8b76fb6d52","path":null,"exit_code":0,"stdout_tail":"diff --git a/networkx/classes/digraph.py b/networkx/classes/digraph.py\nindex 60a202ff..1290bb8b 100644\n--- a/networkx/classes/digraph.py\n+++ b/networkx/classes/digraph.py\n@@ -300,8 +300,8 @@ class DiGraph(Graph):\n         # We store two adjacency lists:\n         # the  predecessors of node n are stored in the dict self._pred\n         # the successors of node n are stored in the dict self._succ=self._adj\n-        self._adj = ndf()  # empty adjacency dictionary\n-        self._pred = ndf()  # predecessor\n+        self._adj = self.adjlist_outer_dict_factory()  # empty adjacency dictionary\n+        self._pred = self.adjlist_outer_dict_factory()  # predecessor\n         self._succ = self._adj  # successor\n \n         # attempt to load graph with data\n","stderr_tail":"","stdout_sha256":"5a94b0a5a363ef83c1d77e0d8d91438b8ceab5f78ab08d1f6aa06b37b86f785c","log_path":null,"tree_digest":"3ceae08433a84217b99823bd132d03ce399448970108e950f41275c04a19ce36","tree_download_s":4.051267999922857,"started_at":"2026-10-03T18:00:33.377886Z","duration_s":0.06358887511305511,"timed_out":false,"image_before":"fd3d7c6a-c806-42d9-aae5-03601fd9f782","image_after":"fd3d7c6a-c806-42d9-aae5-03601fd9f782","junit":null,"diff":{"files":[{"path":"networkx/classes/digraph.py","added":2,"deleted":2,"category":"source","status":"modified"}],"patch_sha256":"5a94b0a5a363ef83c1d77e0d8d91438b8ceab5f78ab08d1f6aa06b37b86f785c","patch_path":"~/dev/nebius-hackathon/pilot/v2-P/networkx__networkx-3101/runs/pilot-networkx__networkx-3101-6b3707109a/artifacts/agent1/agent1-12.patch"},"patch_sha256":"5a94b0a5a363ef83c1d77e0d8d91438b8ceab5f78ab08d1f6aa06b37b86f785c","dropped_paths":[],"snapshot_sha":"45362677276a49d3e6a4173e505ada8b76fb6d52"}
