{"receipt_id":"agent1-1","seq":1,"branch_id":"agent1","kind":"command","cmd":"git ls-files -z","path":null,"exit_code":0,"stdout_tail":".github/ISSUE_TEMPLATE/fastcrud-feature-request.md\u0000.github/ISSUE_TEMPLATE/fastcrud-issue.md\u0000.github/PULL_REQUEST_TEMPLATE.md\u0000.github/workflows/linting.yml\u0000.github/workflows/python-versions.yml\u0000.github/workflows/tests.yml\u0000.github/workflows/type-check.yml\u0000.gitignore\u0000CODE_OF_CONDUCT.md\u0000CONTRIBUTING.md\u0000LICENSE\u0000README.md\u0000assets/fastcrud.png\u0000docs/advanced/crud.md\u0000docs/advanced/endpoint.md\u0000docs/advanced/joins.md\u0000docs/advanced/overview.md\u0000docs/api/crud_router.md\u0000docs/api/endpoint_creator.md\u0000docs/api/fastcrud.md\u0000docs/api/overview.md\u0000docs/api/paginated.md\u0000docs/assets/fastcrud.png\u0000docs/assets/logo.png\u0000docs/changelog.md\u0000docs/community/CODE_OF_CONDUCT.md\u0000docs/community/CONTRIBUTING.md\u0000docs/community/LICENSE.md\u0000docs/community/overview.md\u0000docs/index.md\u0000docs/installing.md\u0000docs/quick-start.md\u0000docs/sqlmodel.md\u0000docs/usage/crud.md\u0000docs/usage/endpoint.md\u0000docs/usage/overview.md\u0000fastcrud/__init__.py\u0000fastcrud/crud/__init__.py\u0000fastcrud/crud/fast_crud.py\u0000fastcrud/crud/helper.py\u0000fastcrud/endpoint/__init__.py\u0000fastcrud/endpoint/crud_router.py\u0000fastcrud/endpoint/endpoint_creator.py\u0000fastcrud/endpoint/helper.py\u0000fastcrud/exceptions/__init__.py\u0000fastcrud/exceptions/http_exceptions.py\u0000fastcrud/paginated/__init__.py\u0000fastcrud/paginated/helper.py\u0000fastcrud/paginated/response.py\u0000fastcrud/paginated/schemas.py\u0000fastcrud/py.typed\u0000mkdocs.yml\u0000mypy.ini\u0000pyproject.toml\u0000tests/__init__.py\u0000tests/sqlalchemy/__init__.py\u0000tests/sqlalchemy/conftest.py\u0000tests/sqlalchemy/core/__init__.py\u0000tests/sqlalchemy/core/test_parse_filters.py\u0000tests/sqlalchemy/core/test_valid_methods.py\u0000tests/sqlalchemy/crud/__init__.py\u0000tests/sqlalchemy/crud/test_apply_sorting.py\u0000tests/sqlalchemy/crud/test_count.py\u0000tests/sqlalchemy/crud/test_create.py\u0000tests/sqlalchemy/crud/test_delete.py\u0000tests/sqlalchemy/crud/test_exists.py\u0000tests/sqlalchemy/crud/test_get.py\u0000tests/sqlalchemy/crud/test_get_joined.py\u0000tests/sqlalchemy/crud/test_get_multi.py\u0000tests/sqlalchemy/crud/test_get_multi_by_cursor.py\u0000tests/sqlalchemy/crud/test_get_multi_joined.py\u0000tests/sqlalchemy/crud/test_select.py\u0000tests/sqlalchemy/crud/test_update.py\u0000tests/sqlalchemy/endpoint/__init__.py\u0000tests/sqlalchemy/endpoint/test_create_item.py\u0000tests/sqlalchemy/endpoint/test_custom_endpoint_creator.py\u0000tests/sqlalchemy/endpoint/test_custom_route.py\u0000tests/sqlalchemy/endpoint/test_delete_item.py\u0000tests/sqlalchemy/endpoint/test_deleted_methods.py\u0000tests/sqlalchemy/endpoint/test_endpoint_custom_names.py\u0000tests/sqlalchemy/endpoint/test_get_item.py\u0000tests/sqlalchemy/endpoint/test_get_items.py\u0000tests/sqlalchemy/endpoint/test_get_paginated.py\u0000tests/sqlalchemy/endpoint/test_included_methods.py\u0000tests/sqlalchemy/endpoint/test_update_item.py\u0000tests/sqlmodel/__init__.py\u0000tests/sqlmodel/conftest.py\u0000tests/sqlmodel/core/__init__.py\u0000tests/sqlmodel/core/test_parse_filters.py\u0000tests/sqlmodel/core/test_valid_methods.py\u0000tests/sqlmodel/crud/__init__.py\u0000tests/sqlmodel/crud/test_apply_sorting.py\u0000tests/sqlmodel/crud/test_count.py\u0000tests/sqlmodel/crud/test_create.py\u0000tests/sqlmodel/crud/test_delete.py\u0000tests/sqlmodel/crud/test_exists.py\u0000tests/sqlmodel/crud/test_get.py\u0000tests/sqlmodel/crud/test_get_joined.py\u0000tests/sqlmodel/crud/test_get_multi.py\u0000tests/sqlmodel/crud/test_get_multi_by_cursor.py\u0000tests/sqlmodel/crud/test_get_multi_joined.py\u0000tests/sqlmodel/crud/test_select.py\u0000tests/sqlmodel/crud/test_update.py\u0000tests/sqlmodel/endpoint/__init__.py\u0000tests/sqlmodel/endpoint/test_create_item.py\u0000tests/sqlmodel/endpoint/test_custom_endpoint_creator.py\u0000tests/sqlmodel/endpoint/test_custom_route.py\u0000tests/sqlmodel/endpoint/test_delete_item.py\u0000tests/sqlmodel/endpoint/test_deleted_methods.py\u0000tests/sqlmodel/endpoint/test_endpoint_custom_names.py\u0000tests/sqlmodel/endpoint/test_get_item.py\u0000tests/sqlmodel/endpoint/test_get_items.py\u0000tests/sqlmodel/endpoint/test_get_paginated.py\u0000tests/sqlmodel/endpoint/test_included_methods.py\u0000tests/sqlmodel/endpoint/test_update_item.py\u0000tox.ini\u0000","stderr_tail":"","stdout_sha256":"912b1711e282c17456cd15c6f7662f61303cc8a1cea02bed74fdf596e3f6a842","log_path":"~/dev/nebius-hackathon/pilot/v2-P/igorbenav__fastcrud-69/runs/pilot-igorbenav__fastcrud-69-e8d0d0ccb6/logs/agent1/agent1-1.log","tree_digest":null,"tree_download_s":null,"started_at":"2026-10-03T17:49:05.248899Z","duration_s":0.003849,"timed_out":false,"image_before":"88f5185c-90d0-473e-82a3-8ae743cb91cf","image_after":"1ac6a831-538b-4bb0-b9bd-12e72811f73d","junit":null,"diff":null,"patch_sha256":null,"dropped_paths":[],"snapshot_sha":null}
{"receipt_id":"agent1-2","seq":2,"branch_id":"agent1","kind":"command","cmd":"grep -n \"get_multi_joined\\|nest_joins\\|_collect_tableColumnsForNest\" fastcrud/crud/fast_crud.py","path":null,"exit_code":0,"stdout_tail":"74:        get_multi_joined:\n123:            orders = await order_crud.get_multi_joined(\n703:        nest_joins: bool = False,\n727:            nest_joins: If True, nested data structures will be returned where joined model data are nested under the join_prefix as a dictionary.\n879:                nest_joins=True\n946:            if nest_joins:\n953:    async def get_multi_joined(\n964:        nest_joins: bool = False,\n993:            nest_joins: If True, nested data structures will be returned where joined model data are nested under the join_prefix as a dictionary.\n1013:            users = await crud_user.get_multi_joined(\n1026:            users = get_multi_joined(\n1040:            users = get_multi_joined(\n1053:            users = await crud_user.get_multi_joined(\n1069:            users = await crud_user.get_multi_joined(\n1087:            users = await crud_user.get_multi_joined(\n1124:            result = await crud.get_multi_joined(\n1165:            projects = await crud.get_multi_joined(\n1175:            projects = await crud.get_multi_joined(\n1195:                nest_joins=True,\n1277:            if nest_joins:\n","stderr_tail":"","stdout_sha256":"7bb9ca39ad26940ea6b5c5108859466c569addfc1c915af907d42834645af87e","log_path":"~/dev/nebius-hackathon/pilot/v2-P/igorbenav__fastcrud-69/runs/pilot-igorbenav__fastcrud-69-e8d0d0ccb6/logs/agent1/agent1-2.log","tree_digest":null,"tree_download_s":null,"started_at":"2026-10-03T17:49:12.610702Z","duration_s":0.003463,"timed_out":false,"image_before":"1ac6a831-538b-4bb0-b9bd-12e72811f73d","image_after":"f24c97ef-5e52-4a70-a395-78e13dd375ee","junit":null,"diff":null,"patch_sha256":null,"dropped_paths":[],"snapshot_sha":null}
{"receipt_id":"agent1-3","seq":3,"branch_id":"agent1","kind":"command","cmd":"grep -n \"_collect_tableColumnsForNest\\|GetBaseQuery\\|get_base_query\" fastcrud/crud/fast_crud.py","path":null,"exit_code":1,"stdout_tail":"","stderr_tail":"","stdout_sha256":"e3b0c44298fc1c149afbf4c8996fb92427ae41e4649b934ca495991b7852b855","log_path":"~/dev/nebius-hackathon/pilot/v2-P/igorbenav__fastcrud-69/runs/pilot-igorbenav__fastcrud-69-e8d0d0ccb6/logs/agent1/agent1-3.log","tree_digest":null,"tree_download_s":null,"started_at":"2026-10-03T17:49:19.514454Z","duration_s":0.003426,"timed_out":false,"image_before":"f24c97ef-5e52-4a70-a395-78e13dd375ee","image_after":"edf06e95-9dee-4e02-99d6-3b1499f99986","junit":null,"diff":null,"patch_sha256":null,"dropped_paths":[],"snapshot_sha":null}
{"receipt_id":"agent1-4","seq":4,"branch_id":"agent1","kind":"command","cmd":"grep -n \"_nest_join_data\" fastcrud/crud/fast_crud.py","path":null,"exit_code":0,"stdout_tail":"18:    _nest_join_data,\n947:                data = _nest_join_data(data, join_definitions)\n1278:                row_dict = _nest_join_data(row_dict, join_definitions)\n","stderr_tail":"","stdout_sha256":"9ba4c2585bf439f379a6d58eab7a13ccaba104d6dc983ee90346f2c0a5a217f4","log_path":"~/dev/nebius-hackathon/pilot/v2-P/igorbenav__fastcrud-69/runs/pilot-igorbenav__fastcrud-69-e8d0d0ccb6/logs/agent1/agent1-4.log","tree_digest":null,"tree_download_s":null,"started_at":"2026-10-03T17:49:21.954602Z","duration_s":0.003145,"timed_out":false,"image_before":"edf06e95-9dee-4e02-99d6-3b1499f99986","image_after":"69f47879-7b1f-4cc6-972b-f4b5495edfc6","junit":null,"diff":null,"patch_sha256":null,"dropped_paths":[],"snapshot_sha":null}
{"receipt_id":"agent1-5","seq":5,"branch_id":"agent1","kind":"command","cmd":"grep -n \"join_definitions.*=\" fastcrud/crud/fast_crud.py","path":null,"exit_code":0,"stdout_tail":"899:        join_definitions = joins_config if joins_config else []\n1220:        join_definitions = joins_config if joins_config else []\n","stderr_tail":"","stdout_sha256":"42a51c6421415b5890f95cf840087cccb3462036acbdd5617e99731cd2c48fbf","log_path":"~/dev/nebius-hackathon/pilot/v2-P/igorbenav__fastcrud-69/runs/pilot-igorbenav__fastcrud-69-e8d0d0ccb6/logs/agent1/agent1-5.log","tree_digest":null,"tree_download_s":null,"started_at":"2026-10-03T17:49:25.458832Z","duration_s":0.0031139999999999996,"timed_out":false,"image_before":"69f47879-7b1f-4cc6-972b-f4b5495edfc6","image_after":"65b0912c-70b2-4269-aa9b-d6d029a418f8","junit":null,"diff":null,"patch_sha256":null,"dropped_paths":[],"snapshot_sha":null}
{"receipt_id":"agent1-6","seq":6,"branch_id":"agent1","kind":"command","cmd":"find . -name \"*helper*\" -type f","path":null,"exit_code":0,"stdout_tail":"./fastcrud/crud/helper.py\n./fastcrud/endpoint/helper.py\n./fastcrud/paginated/helper.py\n","stderr_tail":"","stdout_sha256":"adfe9b544d0d939bead9cd066da12003b63f80eddc2e36bd7473ac602d240a43","log_path":"~/dev/nebius-hackathon/pilot/v2-P/igorbenav__fastcrud-69/runs/pilot-igorbenav__fastcrud-69-e8d0d0ccb6/logs/agent1/agent1-6.log","tree_digest":null,"tree_download_s":null,"started_at":"2026-10-03T17:49:32.008634Z","duration_s":0.005484999999999999,"timed_out":false,"image_before":"65b0912c-70b2-4269-aa9b-d6d029a418f8","image_after":"7b22f073-73c2-4054-9aae-23d72477fa79","junit":null,"diff":null,"patch_sha256":null,"dropped_paths":[],"snapshot_sha":null}
{"receipt_id":"agent1-7","seq":7,"branch_id":"agent1","kind":"command","cmd":"grep -n \"test_get_multi_joined_no_prefix_nested\" tests/sqlalchemy/crud/test_get_multi_joined.py","path":null,"exit_code":0,"stdout_tail":"765:async def test_get_multi_joined_no_prefix_nested(\n","stderr_tail":"","stdout_sha256":"44a1ed684a58158f44d67f1899f1cbc86631c12a328cf5f46866a6985d18ae7e","log_path":"~/dev/nebius-hackathon/pilot/v2-P/igorbenav__fastcrud-69/runs/pilot-igorbenav__fastcrud-69-e8d0d0ccb6/logs/agent1/agent1-7.log","tree_digest":null,"tree_download_s":null,"started_at":"2026-10-03T17:49:37.154739Z","duration_s":0.003349,"timed_out":false,"image_before":"7b22f073-73c2-4054-9aae-23d72477fa79","image_after":"9150d662-2cf4-4944-8d26-53f67e1d8dc9","junit":null,"diff":null,"patch_sha256":null,"dropped_paths":[],"snapshot_sha":null}
{"receipt_id":"agent1-8","seq":8,"branch_id":"agent1","kind":"command","cmd":"grep -n \"class TierModel\" tests/sqlalchemy/conftest.py","path":null,"exit_code":0,"stdout_tail":"70:class TierModel(Base):\n","stderr_tail":"","stdout_sha256":"34485a2b42a5898189a92e7fa536de67e3d5e1156467a1f16ed2e4946471bf29","log_path":"~/dev/nebius-hackathon/pilot/v2-P/igorbenav__fastcrud-69/runs/pilot-igorbenav__fastcrud-69-e8d0d0ccb6/logs/agent1/agent1-8.log","tree_digest":null,"tree_download_s":null,"started_at":"2026-10-03T17:49:50.618873Z","duration_s":0.00333,"timed_out":false,"image_before":"9150d662-2cf4-4944-8d26-53f67e1d8dc9","image_after":"874e9537-b83d-4ea0-8da6-f85806eb3866","junit":null,"diff":null,"patch_sha256":null,"dropped_paths":[],"snapshot_sha":null}
{"receipt_id":"agent1-9","seq":9,"branch_id":"agent1","kind":"command","cmd":"grep -n \"test_data_tier\" tests/sqlalchemy/conftest.py","path":null,"exit_code":0,"stdout_tail":"217:def test_data_tier() -> list[dict]:\n","stderr_tail":"","stdout_sha256":"c3b1339a94863548f24665c630dcba744038ccad671985f28f0cdf24d0ea9c3f","log_path":"~/dev/nebius-hackathon/pilot/v2-P/igorbenav__fastcrud-69/runs/pilot-igorbenav__fastcrud-69-e8d0d0ccb6/logs/agent1/agent1-9.log","tree_digest":null,"tree_download_s":null,"started_at":"2026-10-03T17:49:54.703646Z","duration_s":0.003171,"timed_out":false,"image_before":"874e9537-b83d-4ea0-8da6-f85806eb3866","image_after":"c4d0f98e-ebe4-46eb-9e44-ea95aef52f41","junit":null,"diff":null,"patch_sha256":null,"dropped_paths":[],"snapshot_sha":null}
{"receipt_id":"agent1-10","seq":10,"branch_id":"agent1","kind":"command","cmd":"grep -n \"test_data.*=\" tests/sqlalchemy/conftest.py | head -5","path":null,"exit_code":0,"stdout_tail":"","stderr_tail":"","stdout_sha256":"e3b0c44298fc1c149afbf4c8996fb92427ae41e4649b934ca495991b7852b855","log_path":"~/dev/nebius-hackathon/pilot/v2-P/igorbenav__fastcrud-69/runs/pilot-igorbenav__fastcrud-69-e8d0d0ccb6/logs/agent1/agent1-10.log","tree_digest":null,"tree_download_s":null,"started_at":"2026-10-03T17:49:59.595894Z","duration_s":0.004782,"timed_out":false,"image_before":"c4d0f98e-ebe4-46eb-9e44-ea95aef52f41","image_after":"ace0f40b-e697-43c0-8442-e9b3ea65d6c3","junit":null,"diff":null,"patch_sha256":null,"dropped_paths":[],"snapshot_sha":null}
{"receipt_id":"agent1-11","seq":11,"branch_id":"agent1","kind":"command","cmd":"grep -n \"def test_data\" tests/sqlalchemy/conftest.py","path":null,"exit_code":0,"stdout_tail":"200:def test_data() -> list[dict]:\n217:def test_data_tier() -> list[dict]:\n222:def test_data_category() -> list[dict]:\n233:def test_data_multipk(request) -> list[dict]:\n238:def test_data_booking() -> list[dict]:\n","stderr_tail":"","stdout_sha256":"29fe58c4aff1d5d78aabc8a3a9a0bbb8f9abe6d9353f8d6f1f7082c4f782ad94","log_path":"~/dev/nebius-hackathon/pilot/v2-P/igorbenav__fastcrud-69/runs/pilot-igorbenav__fastcrud-69-e8d0d0ccb6/logs/agent1/agent1-11.log","tree_digest":null,"tree_download_s":null,"started_at":"2026-10-03T17:50:01.929948Z","duration_s":0.003401,"timed_out":false,"image_before":"ace0f40b-e697-43c0-8442-e9b3ea65d6c3","image_after":"e4a19a96-ae49-4625-8edb-41bd4bde0ffe","junit":null,"diff":null,"patch_sha256":null,"dropped_paths":[],"snapshot_sha":null}
{"receipt_id":"agent1-12","seq":12,"branch_id":"agent1","kind":"write","cmd":"/opt/receipts-c842e8744b104803bcd7363bb324c905/bin/busybox sh -c 'mkdir -p /fastcrud/fastcrud/crud && cp /opt/receipts-c842e8744b104803bcd7363bb324c905/incoming/8a76463448d29a841f5739cd6ff5c9cf6c58392fb91f35e7cdd10418b3ad52b3 /fastcrud/fastcrud/crud/helper.py'","path":"fastcrud/crud/helper.py","exit_code":0,"stdout_tail":"","stderr_tail":"","stdout_sha256":"8a76463448d29a841f5739cd6ff5c9cf6c58392fb91f35e7cdd10418b3ad52b3","log_path":"~/dev/nebius-hackathon/pilot/v2-P/igorbenav__fastcrud-69/runs/pilot-igorbenav__fastcrud-69-e8d0d0ccb6/logs/agent1/agent1-12.log","tree_digest":null,"tree_download_s":null,"started_at":"2026-10-03T17:50:13.047750Z","duration_s":0.005015,"timed_out":false,"image_before":"e4a19a96-ae49-4625-8edb-41bd4bde0ffe","image_after":"ae916d9b-7dc4-4021-9e8a-2d9afec4a9e0","junit":null,"diff":null,"patch_sha256":null,"dropped_paths":[],"snapshot_sha":null}
{"receipt_id":"agent1-13","seq":13,"branch_id":"agent1","kind":"command","cmd":"/opt/receipts-70c0eca3489e4cc494ff305ad0bc6692/bin/busybox mkdir -p /opt/receipts/reports && python -I /opt/receipts-70c0eca3489e4cc494ff305ad0bc6692/receipts_pytest.py tests/sqlalchemy/crud/test_get_multi_joined.py::test_get_multi_joined_no_prefix_nested -xvs -o junit_family=xunit1 -p no:cacheprovider -rA --continue-on-collection-errors --junitxml=/opt/receipts/reports/agent1-13.xml","path":null,"exit_code":1,"stdout_tail":"lalchemy.engine.Engine:base.py:1904 [no key 0.00006s] ()\nINFO     sqlalchemy.engine.Engine:base.py:1899 \nCREATE TABLE projects_participants_association (\n\tproject_id INTEGER NOT NULL, \n\tparticipant_id INTEGER NOT NULL, \n\tPRIMARY KEY (project_id, participant_id), \n\tFOREIGN KEY(project_id) REFERENCES projects (id), \n\tFOREIGN KEY(participant_id) REFERENCES participants (id)\n)\n\n\nINFO     sqlalchemy.engine.Engine:base.py:1904 [no key 0.00006s] ()\nINFO     sqlalchemy.engine.Engine:base.py:1899 \nCREATE TABLE multi_pk (\n\tid INTEGER NOT NULL, \n\tuuid VARCHAR(32) NOT NULL, \n\tname VARCHAR, \n\ttest_id INTEGER, \n\tPRIMARY KEY (id, uuid), \n\tUNIQUE (name), \n\tFOREIGN KEY(test_id) REFERENCES test (id)\n)\n\n\nINFO     sqlalchemy.engine.Engine:base.py:1904 [no key 0.00006s] ()\nINFO     sqlalchemy.engine.Engine:base.py:1899 \nCREATE TABLE booking (\n\tid INTEGER NOT NULL, \n\towner_id INTEGER NOT NULL, \n\tuser_id INTEGER NOT NULL, \n\tbooking_date DATETIME NOT NULL, \n\tPRIMARY KEY (id), \n\tFOREIGN KEY(owner_id) REFERENCES test (id), \n\tFOREIGN KEY(user_id) REFERENCES test (id)\n)\n\n\nINFO     sqlalchemy.engine.Engine:base.py:1904 [no key 0.00006s] ()\nINFO     sqlalchemy.engine.Engine:base.py:1143 COMMIT\n------------------------------ Captured log call -------------------------------\nINFO     sqlalchemy.engine.Engine:base.py:1094 BEGIN (implicit)\nINFO     sqlalchemy.engine.Engine:base.py:1899 INSERT INTO tier (id, name) VALUES (?, ?)\nINFO     sqlalchemy.engine.Engine:base.py:1904 [generated in 0.00013s] [(1, 'Premium'), (2, 'Basic')]\nINFO     sqlalchemy.engine.Engine:base.py:1143 COMMIT\nINFO     sqlalchemy.engine.Engine:base.py:1094 BEGIN (implicit)\nINFO     sqlalchemy.engine.Engine:base.py:1899 INSERT INTO test (id, name, tier_id, category_id, is_deleted, deleted_at) VALUES (?, ?, ?, ?, ?, ?)\nINFO     sqlalchemy.engine.Engine:base.py:1904 [generated in 0.00016s] [(1, 'Charlie', 1, 1, 0, None), (2, 'Alice', 2, 1, 0, None), (3, 'Bob', 1, 2, 0, None), (4, 'David', 2, 1, 0, None), (5, 'Eve', 1, 1, 0, None), (6, 'Frank', 2, 2, 0, None), (7, 'Grace', 1, 2, 0, None), (8, 'Hannah', 2, 1, 0, None)  ... displaying 10 of 11 total bound parameter sets ...  (10, 'Judy', 2, 2, 0, None), (11, 'Alice', 1, 1, 0, None)]\nINFO     sqlalchemy.engine.Engine:base.py:1143 COMMIT\nINFO     sqlalchemy.engine.Engine:base.py:1094 BEGIN (implicit)\nINFO     sqlalchemy.engine.Engine:base.py:1899 SELECT test.name, test.tier_id, test.category_id, tier.name AS name_1 \nFROM test LEFT OUTER JOIN tier ON test.tier_id = tier.id\n LIMIT ? OFFSET ?\nINFO     sqlalchemy.engine.Engine:base.py:1904 [generated in 0.00011s] (10, 0)\nINFO     sqlalchemy.engine.Engine:base.py:1899 SELECT count(*) AS count_1 \nFROM test\nINFO     sqlalchemy.engine.Engine:base.py:1904 [generated in 0.00010s] ()\n---------------------------- Captured log teardown -----------------------------\nINFO     sqlalchemy.engine.Engine:base.py:1126 ROLLBACK\nINFO     sqlalchemy.engine.Engine:base.py:1094 BEGIN (implicit)\nINFO     sqlalchemy.engine.Engine:base.py:1899 PRAGMA main.table_info(\"multi_pk\")\nINFO     sqlalchemy.engine.Engine:base.py:1904 [raw sql] ()\nINFO     sqlalchemy.engine.Engine:base.py:1899 PRAGMA main.table_info(\"category\")\nINFO     sqlalchemy.engine.Engine:base.py:1904 [raw sql] ()\nINFO     sqlalchemy.engine.Engine:base.py:1899 PRAGMA main.table_info(\"test\")\nINFO     sqlalchemy.engine.Engine:base.py:1904 [raw sql] ()\nINFO     sqlalchemy.engine.Engine:base.py:1899 PRAGMA main.table_info(\"model_test_with_timestamp\")\nINFO     sqlalchemy.engine.Engine:base.py:1904 [raw sql] ()\nINFO     sqlalchemy.engine.Engine:base.py:1899 PRAGMA main.table_info(\"tier\")\nINFO     sqlalchemy.engine.Engine:base.py:1904 [raw sql] ()\nINFO     sqlalchemy.engine.Engine:base.py:1899 PRAGMA main.table_info(\"booking\")\nINFO     sqlalchemy.engine.Engine:base.py:1904 [raw sql] ()\nINFO     sqlalchemy.engine.Engine:base.py:1899 PRAGMA main.table_info(\"projects\")\nINFO     sqlalchemy.engine.Engine:base.py:1904 [raw sql] ()\nINFO     sqlalchemy.engine.Engine:base.py:1899 PRAGMA main.table_info(\"participants\")\nINFO     sqlalchemy.engine.Engine:base.py:1904 [raw sql] ()\nINFO     sqlalchemy.engine.Engine:base.py:1899 PRAGMA main.table_info(\"projects_participants_association\")\nINFO     sqlalchemy.engine.Engine:base.py:1904 [raw sql] ()\nINFO     sqlalchemy.engine.Engine:base.py:1899 \nDROP TABLE booking\nINFO     sqlalchemy.engine.Engine:base.py:1904 [no key 0.00006s] ()\nINFO     sqlalchemy.engine.Engine:base.py:1899 \nDROP TABLE multi_pk\nINFO     sqlalchemy.engine.Engine:base.py:1904 [no key 0.00006s] ()\nINFO     sqlalchemy.engine.Engine:base.py:1899 \nDROP TABLE projects_participants_association\nINFO     sqlalchemy.engine.Engine:base.py:1904 [no key 0.00005s] ()\nINFO     sqlalchemy.engine.Engine:base.py:1899 \nDROP TABLE model_test_with_timestamp\nINFO     sqlalchemy.engine.Engine:base.py:1904 [no key 0.00005s] ()\nINFO     sqlalchemy.engine.Engine:base.py:1899 \nDROP TABLE test\nINFO     sqlalchemy.engine.Engine:base.py:1904 [no key 0.00005s] ()\nINFO     sqlalchemy.engine.Engine:base.py:1899 \nDROP TABLE participants\nINFO     sqlalchemy.engine.Engine:base.py:1904 [no key 0.00005s] ()\nINFO     sqlalchemy.engine.Engine:base.py:1899 \nDROP TABLE projects\nINFO     sqlalchemy.engine.Engine:base.py:1904 [no key 0.00005s] ()\nINFO     sqlalchemy.engine.Engine:base.py:1899 \nDROP TABLE tier\nINFO     sqlalchemy.engine.Engine:base.py:1904 [no key 0.00005s] ()\nINFO     sqlalchemy.engine.Engine:base.py:1899 \nDROP TABLE category\nINFO     sqlalchemy.engine.Engine:base.py:1904 [no key 0.00005s] ()\nINFO     sqlalchemy.engine.Engine:base.py:1143 COMMIT\n----------- generated xml file: /opt/receipts/reports/agent1-13.xml ------------\n=========================== short test summary info ============================\nFAILED tests/sqlalchemy/crud/test_get_multi_joined.py::test_get_multi_joined_no_prefix_nested\n!!!!!!!!!!!!!!!!!!!!!!!!!! stopping after 1 failures !!!!!!!!!!!!!!!!!!!!!!!!!!!\n============================== 1 failed in 0.13s ===============================\n","stderr_tail":"","stdout_sha256":"3f3905c607e609727ea7aec2c413581ef908dec556326a37749a5fa2c467a73c","log_path":"~/dev/nebius-hackathon/pilot/v2-P/igorbenav__fastcrud-69/runs/pilot-igorbenav__fastcrud-69-e8d0d0ccb6/logs/agent1/agent1-13.log","tree_digest":"16e06d183b15a9f5ac9329111f79a8d40c71e3684f887df43222f882382cd5e7","tree_download_s":2.385948416078463,"started_at":"2026-10-03T17:50:15.255480Z","duration_s":1.824235,"timed_out":false,"image_before":"ae916d9b-7dc4-4021-9e8a-2d9afec4a9e0","image_after":"04b8d573-9232-4548-b8c3-d37d2061d346","junit":{"passed":[],"failed":["tests/sqlalchemy/crud/test_get_multi_joined.py::test_get_multi_joined_no_prefix_nested"],"errors":[],"skipped":[],"collection_errors":[],"failure_text":{"tests/sqlalchemy/crud/test_get_multi_joined.py::test_get_multi_joined_no_prefix_nested":"AssertionError: Expected 'name' field inside nested 'tier' dictionary.\nassert 'name' in {'id': 1}\nasync_session = <sqlalchemy.orm.session.AsyncSession object at 0x7ffff3db8730>\ntest_data = [{'category_id': 1, 'id': 1, 'name': 'Charlie', 'tier_id': 1}, {'category_id': 1, 'id': 2, 'name': 'Alice', 'tier_id':...ategory_id': 1, 'id': 5, 'name': 'Eve', 'tier_id': 1}, {'category_id': 2, 'id': 6, 'name': 'Frank', 'tier_id': 2}, ...]\ntest_data_tier = [{'id': 1, 'name': 'Premium'}, {'id': 2, 'name': 'Basic'}]\n\n    @pytest.mark.asyncio\n    async def test_get_multi_joined_no_prefix_nested(\n        async_session, test_data, test_data_tier\n    ):\n        for tier_item in test_data_tier:\n            async_session.add(TierModel(**tier_item))\n        await async_session.commit()\n    \n        for user_item in test_data:\n            async_session.add(ModelTest(**user_item))\n        await async_session.commit()\n    \n        crud = FastCRUD(ModelTest)\n    \n        result = await crud.get_multi_joined(\n            db=async_session,\n            join_model=TierModel,\n            schema_to_select=CreateSchemaTest,\n            join_schema_to_select=TierSchemaTest,\n            nest_joins=True,\n            limit=10,\n        )\n    \n        assert result and result[\"data\"], \"Expected data in the result.\"\n        for item in result[\"data\"]:\n            assert \"name\" in item, \"Expected user name in each item.\"\n            assert (\n                TierModel.__tablename__ in item\n            ), f\"Expected nested '{TierModel.__tablename__}' key in each item.\"\n>           assert (\n                \"name\" in item[TierModel.__tablename__]\n            ), f\"Expected 'name' field inside nested '{TierModel.__tablename__}' dictionary.\"\nE           AssertionError: Expected 'name' field inside nested 'tier' dictionary.\nE           assert 'name' in {'id': 1}\n\ntests/sqlalchemy/crud/test_get_multi_joined.py:793: AssertionError"}},"diff":null,"patch_sha256":null,"dropped_paths":[],"snapshot_sha":null}
{"receipt_id":"agent1-14","seq":14,"branch_id":"agent1","kind":"write","cmd":"/opt/receipts-6bf40a2fc5c1428eb6aaa6e66f9a7743/bin/busybox sh -c 'mkdir -p /tmp && cp /opt/receipts-6bf40a2fc5c1428eb6aaa6e66f9a7743/incoming/169f35806b1f2fda14708c70418964ff9e1ae69c2b377d46d776c542891fd367 /tmp/debug_test.py'","path":"/tmp/debug_test.py","exit_code":0,"stdout_tail":"","stderr_tail":"","stdout_sha256":"169f35806b1f2fda14708c70418964ff9e1ae69c2b377d46d776c542891fd367","log_path":"~/dev/nebius-hackathon/pilot/v2-P/igorbenav__fastcrud-69/runs/pilot-igorbenav__fastcrud-69-e8d0d0ccb6/logs/agent1/agent1-14.log","tree_digest":null,"tree_download_s":null,"started_at":"2026-10-03T17:50:28.631223Z","duration_s":0.005327999999999999,"timed_out":false,"image_before":"04b8d573-9232-4548-b8c3-d37d2061d346","image_after":"617d940b-a3e8-47f4-b08e-4795fdfaa579","junit":null,"diff":null,"patch_sha256":null,"dropped_paths":[],"snapshot_sha":null}
{"receipt_id":"agent1-15","seq":15,"branch_id":"agent1","kind":"command","cmd":"python /tmp/debug_test.py","path":null,"exit_code":1,"stdout_tail":"","stderr_tail":"Traceback (most recent call last):\n  File \"/usr/local/lib/python3.10/site-packages/sqlalchemy/orm/mapper.py\", line 2531, in get_property\n    return self._props[key]\nKeyError: 'tests'\n\nThe above exception was the direct cause of the following exception:\n\nTraceback (most recent call last):\n  File \"/tmp/debug_test.py\", line 75, in <module>\n    asyncio.run(test_nesting())\n  File \"/usr/local/lib/python3.10/asyncio/runners.py\", line 44, in run\n    return loop.run_until_complete(main)\n  File \"/usr/local/lib/python3.10/asyncio/base_events.py\", line 649, in run_until_complete\n    return future.result()\n  File \"/tmp/debug_test.py\", line 47, in test_nesting\n    await init_db()\n  File \"/tmp/debug_test.py\", line 38, in init_db\n    tiers = [TierModel(id=1, name=\"Premium\"), TierModel(id=2, name=\"Basic\")]\n  File \"<string>\", line 4, in __init__\n  File \"/usr/local/lib/python3.10/site-packages/sqlalchemy/orm/state.py\", line 591, in _initialize_instance\n    manager.dispatch.init(self, args, kwargs)\n  File \"/usr/local/lib/python3.10/site-packages/sqlalchemy/event/attr.py\", line 515, in __call__\n    fn(*args, **kw)\n  File \"/usr/local/lib/python3.10/site-packages/sqlalchemy/orm/mapper.py\", line 4419, in _event_on_init\n    instrumenting_mapper._check_configure()\n  File \"/usr/local/lib/python3.10/site-packages/sqlalchemy/orm/mapper.py\", line 2410, in _check_configure\n    _configure_registries({self.registry}, cascade=True)\n  File \"/usr/local/lib/python3.10/site-packages/sqlalchemy/orm/mapper.py\", line 4227, in _configure_registries\n    _do_configure_registries(registries, cascade)\n  File \"/usr/local/lib/python3.10/site-packages/sqlalchemy/orm/mapper.py\", line 4268, in _do_configure_registries\n    mapper._post_configure_properties()\n  File \"/usr/local/lib/python3.10/site-packages/sqlalchemy/orm/mapper.py\", line 2427, in _post_configure_properties\n    prop.init()\n  File \"/usr/local/lib/python3.10/site-packages/sqlalchemy/orm/interfaces.py\", line 595, in init\n    self.do_init()\n  File \"/usr/local/lib/python3.10/site-packages/sqlalchemy/orm/relationships.py\", line 1660, in do_init\n    self._generate_backref()\n  File \"/usr/local/lib/python3.10/site-packages/sqlalchemy/orm/relationships.py\", line 2144, in _generate_backref\n    self._add_reverse_property(self.back_populates)\n  File \"/usr/local/lib/python3.10/site-packages/sqlalchemy/orm/relationships.py\", line 1591, in _add_reverse_property\n    other = self.mapper.get_property(key, _configure_mappers=False)\n  File \"/usr/local/lib/python3.10/site-packages/sqlalchemy/orm/mapper.py\", line 2533, in get_property\n    raise sa_exc.InvalidRequestError(\nsqlalchemy.exc.InvalidRequestError: Mapper 'Mapper[TierModel(tier)]' has no property 'tests'.  If this property was indicated from other mappers or configure events, ensure registry.configure() has been called.\n","stdout_sha256":"451ba623fc9957a96e115a5896bb2aca97b52955038dcc65356e7c28756072c5","log_path":"~/dev/nebius-hackathon/pilot/v2-P/igorbenav__fastcrud-69/runs/pilot-igorbenav__fastcrud-69-e8d0d0ccb6/logs/agent1/agent1-15.log","tree_digest":null,"tree_download_s":null,"started_at":"2026-10-03T17:50:31.097501Z","duration_s":0.455505,"timed_out":false,"image_before":"617d940b-a3e8-47f4-b08e-4795fdfaa579","image_after":"f061f0a6-4fc1-4e9a-b786-5ac356ddfd8b","junit":null,"diff":null,"patch_sha256":null,"dropped_paths":[],"snapshot_sha":null}
{"receipt_id":"agent1-16","seq":16,"branch_id":"agent1","kind":"write","cmd":"/opt/receipts-5f7b19a9866542f787313ba899e04079/bin/busybox sh -c 'mkdir -p /tmp && cp /opt/receipts-5f7b19a9866542f787313ba899e04079/incoming/11e37a61ddb2aba05d66360478bf95ab9116fe9bc9a058100572ba22d61b5d5c /tmp/debug_test.py'","path":"/tmp/debug_test.py","exit_code":0,"stdout_tail":"","stderr_tail":"","stdout_sha256":"11e37a61ddb2aba05d66360478bf95ab9116fe9bc9a058100572ba22d61b5d5c","log_path":"~/dev/nebius-hackathon/pilot/v2-P/igorbenav__fastcrud-69/runs/pilot-igorbenav__fastcrud-69-e8d0d0ccb6/logs/agent1/agent1-16.log","tree_digest":null,"tree_download_s":null,"started_at":"2026-10-03T17:50:38.069789Z","duration_s":0.005101,"timed_out":false,"image_before":"f061f0a6-4fc1-4e9a-b786-5ac356ddfd8b","image_after":"0eb068a4-125b-43f0-8cb1-ab17e2e565d0","junit":null,"diff":null,"patch_sha256":null,"dropped_paths":[],"snapshot_sha":null}
{"receipt_id":"agent1-17","seq":17,"branch_id":"agent1","kind":"command","cmd":"python /tmp/debug_test.py","path":null,"exit_code":1,"stdout_tail":"","stderr_tail":"emany\n    await self._execute(self._cursor.executemany, sql, parameters)\n  File \"/usr/local/lib/python3.10/site-packages/aiosqlite/cursor.py\", line 32, in _execute\n    return await self._conn._execute(fn, *args, **kwargs)\n  File \"/usr/local/lib/python3.10/site-packages/aiosqlite/core.py\", line 160, in _execute\n    return await future\n  File \"/usr/local/lib/python3.10/site-packages/aiosqlite/core.py\", line 63, in _connection_worker_thread\n    result = function()\nsqlite3.OperationalError: no such table: tier\n\nThe above exception was the direct cause of the following exception:\n\nTraceback (most recent call last):\n  File \"/tmp/debug_test.py\", line 76, in <module>\n    asyncio.run(test_nesting())\n  File \"/usr/local/lib/python3.10/asyncio/runners.py\", line 44, in run\n    return loop.run_until_complete(main)\n  File \"/usr/local/lib/python3.10/asyncio/base_events.py\", line 649, in run_until_complete\n    return future.result()\n  File \"/tmp/debug_test.py\", line 48, in test_nesting\n    await init_db()\n  File \"/tmp/debug_test.py\", line 45, in init_db\n    await session.commit()\n  File \"/usr/local/lib/python3.10/site-packages/sqlalchemy/ext/asyncio/session.py\", line 1000, in commit\n    await greenlet_spawn(self.sync_session.commit)\n  File \"/usr/local/lib/python3.10/site-packages/sqlalchemy/util/_concurrency_py3k.py\", line 203, in greenlet_spawn\n    result = context.switch(value)\n  File \"/usr/local/lib/python3.10/site-packages/sqlalchemy/orm/session.py\", line 2030, in commit\n    trans.commit(_to_root=True)\n  File \"<string>\", line 2, in commit\n  File \"/usr/local/lib/python3.10/site-packages/sqlalchemy/orm/state_changes.py\", line 137, in _go\n    ret_value = fn(self, *arg, **kw)\n  File \"/usr/local/lib/python3.10/site-packages/sqlalchemy/orm/session.py\", line 1311, in commit\n    self._prepare_impl()\n  File \"<string>\", line 2, in _prepare_impl\n  File \"/usr/local/lib/python3.10/site-packages/sqlalchemy/orm/state_changes.py\", line 137, in _go\n    ret_value = fn(self, *arg, **kw)\n  File \"/usr/local/lib/python3.10/site-packages/sqlalchemy/orm/session.py\", line 1286, in _prepare_impl\n    self.session.flush()\n  File \"/usr/local/lib/python3.10/site-packages/sqlalchemy/orm/session.py\", line 4331, in flush\n    self._flush(objects)\n  File \"/usr/local/lib/python3.10/site-packages/sqlalchemy/orm/session.py\", line 4466, in _flush\n    with util.safe_reraise():\n  File \"/usr/local/lib/python3.10/site-packages/sqlalchemy/util/langhelpers.py\", line 224, in __exit__\n    raise exc_value.with_traceback(exc_tb)\n  File \"/usr/local/lib/python3.10/site-packages/sqlalchemy/orm/session.py\", line 4427, in _flush\n    flush_context.execute()\n  File \"/usr/local/lib/python3.10/site-packages/sqlalchemy/orm/unitofwork.py\", line 466, in execute\n    rec.execute(self)\n  File \"/usr/local/lib/python3.10/site-packages/sqlalchemy/orm/unitofwork.py\", line 642, in execute\n    util.preloaded.orm_persistence.save_obj(\n  File \"/usr/local/lib/python3.10/site-packages/sqlalchemy/orm/persistence.py\", line 93, in save_obj\n    _emit_insert_statements(\n  File \"/usr/local/lib/python3.10/site-packages/sqlalchemy/orm/persistence.py\", line 1048, in _emit_insert_statements\n    result = connection.execute(\n  File \"/usr/local/lib/python3.10/site-packages/sqlalchemy/engine/base.py\", line 1419, in execute\n    return meth(\n  File \"/usr/local/lib/python3.10/site-packages/sqlalchemy/sql/elements.py\", line 527, in _execute_on_connection\n    return connection._execute_clauseelement(\n  File \"/usr/local/lib/python3.10/site-packages/sqlalchemy/engine/base.py\", line 1641, in _execute_clauseelement\n    ret = self._execute_context(\n  File \"/usr/local/lib/python3.10/site-packages/sqlalchemy/engine/base.py\", line 1846, in _execute_context\n    return self._exec_single_context(\n  File \"/usr/local/lib/python3.10/site-packages/sqlalchemy/engine/base.py\", line 1986, in _exec_single_context\n    self._handle_dbapi_exception(\n  File \"/usr/local/lib/python3.10/site-packages/sqlalchemy/engine/base.py\", line 2363, in _handle_dbapi_exception\n    raise sqlalchemy_exception.with_traceback(exc_info[2]) from e\n  File \"/usr/local/lib/python3.10/site-packages/sqlalchemy/engine/base.py\", line 1936, in _exec_single_context\n    self.dialect.do_executemany(\n  File \"/usr/local/lib/python3.10/site-packages/sqlalchemy/engine/default.py\", line 949, in do_executemany\n    cursor.executemany(statement, parameters)\n  File \"/usr/local/lib/python3.10/site-packages/sqlalchemy/dialects/sqlite/aiosqlite.py\", line 197, in executemany\n    self._adapt_connection._handle_exception(error)\n  File \"/usr/local/lib/python3.10/site-packages/sqlalchemy/dialects/sqlite/aiosqlite.py\", line 342, in _handle_exception\n    raise error\n  File \"/usr/local/lib/python3.10/site-packages/sqlalchemy/dialects/sqlite/aiosqlite.py\", line 191, in executemany\n    self.await_(_cursor.executemany(operation, seq_of_parameters))\n  File \"/usr/local/lib/python3.10/site-packages/sqlalchemy/util/_concurrency_py3k.py\", line 132, in await_only\n    return current.parent.switch(awaitable)  # type: ignore[no-any-return,attr-defined] # noqa: E501\n  File \"/usr/local/lib/python3.10/site-packages/sqlalchemy/util/_concurrency_py3k.py\", line 196, in greenlet_spawn\n    value = await result\n  File \"/usr/local/lib/python3.10/site-packages/aiosqlite/cursor.py\", line 47, in executemany\n    await self._execute(self._cursor.executemany, sql, parameters)\n  File \"/usr/local/lib/python3.10/site-packages/aiosqlite/cursor.py\", line 32, in _execute\n    return await self._conn._execute(fn, *args, **kwargs)\n  File \"/usr/local/lib/python3.10/site-packages/aiosqlite/core.py\", line 160, in _execute\n    return await future\n  File \"/usr/local/lib/python3.10/site-packages/aiosqlite/core.py\", line 63, in _connection_worker_thread\n    result = function()\nsqlalchemy.exc.OperationalError: (sqlite3.OperationalError) no such table: tier\n[SQL: INSERT INTO tier (id, name) VALUES (?, ?)]\n[parameters: [(1, 'Premium'), (2, 'Basic')]]\n(Background on this error at: https://sqlalche.me/e/20/e3q8)\n","stdout_sha256":"88b5f82d66afdd0dba8f9beefe8e699ad6e103f088e3a3a739fe9f22d806f827","log_path":"~/dev/nebius-hackathon/pilot/v2-P/igorbenav__fastcrud-69/runs/pilot-igorbenav__fastcrud-69-e8d0d0ccb6/logs/agent1/agent1-17.log","tree_digest":null,"tree_download_s":null,"started_at":"2026-10-03T17:50:40.772257Z","duration_s":0.444613,"timed_out":false,"image_before":"0eb068a4-125b-43f0-8cb1-ab17e2e565d0","image_after":"8a4c263e-4760-482e-8082-06179af4f82f","junit":null,"diff":null,"patch_sha256":null,"dropped_paths":[],"snapshot_sha":null}
{"receipt_id":"agent1-18","seq":18,"branch_id":"agent1","kind":"command","cmd":"/opt/receipts-be0fad3e8ff34b90816bab8f2b7d6e23/bin/busybox mkdir -p /opt/receipts/reports && python -I /opt/receipts-be0fad3e8ff34b90816bab8f2b7d6e23/receipts_pytest.py tests/sqlalchemy/crud/test_get_multi_joined.py::test_get_multi_joined_no_prefix_nested -xvs --tb=short -o junit_family=xunit1 -p no:cacheprovider -rA --continue-on-collection-errors --junitxml=/opt/receipts/reports/agent1-18.xml","path":null,"exit_code":1,"stdout_tail":"lalchemy.engine.Engine:base.py:1904 [no key 0.00006s] ()\nINFO     sqlalchemy.engine.Engine:base.py:1899 \nCREATE TABLE projects_participants_association (\n\tproject_id INTEGER NOT NULL, \n\tparticipant_id INTEGER NOT NULL, \n\tPRIMARY KEY (project_id, participant_id), \n\tFOREIGN KEY(project_id) REFERENCES projects (id), \n\tFOREIGN KEY(participant_id) REFERENCES participants (id)\n)\n\n\nINFO     sqlalchemy.engine.Engine:base.py:1904 [no key 0.00007s] ()\nINFO     sqlalchemy.engine.Engine:base.py:1899 \nCREATE TABLE multi_pk (\n\tid INTEGER NOT NULL, \n\tuuid VARCHAR(32) NOT NULL, \n\tname VARCHAR, \n\ttest_id INTEGER, \n\tPRIMARY KEY (id, uuid), \n\tUNIQUE (name), \n\tFOREIGN KEY(test_id) REFERENCES test (id)\n)\n\n\nINFO     sqlalchemy.engine.Engine:base.py:1904 [no key 0.00007s] ()\nINFO     sqlalchemy.engine.Engine:base.py:1899 \nCREATE TABLE booking (\n\tid INTEGER NOT NULL, \n\towner_id INTEGER NOT NULL, \n\tuser_id INTEGER NOT NULL, \n\tbooking_date DATETIME NOT NULL, \n\tPRIMARY KEY (id), \n\tFOREIGN KEY(owner_id) REFERENCES test (id), \n\tFOREIGN KEY(user_id) REFERENCES test (id)\n)\n\n\nINFO     sqlalchemy.engine.Engine:base.py:1904 [no key 0.00008s] ()\nINFO     sqlalchemy.engine.Engine:base.py:1143 COMMIT\n------------------------------ Captured log call -------------------------------\nINFO     sqlalchemy.engine.Engine:base.py:1094 BEGIN (implicit)\nINFO     sqlalchemy.engine.Engine:base.py:1899 INSERT INTO tier (id, name) VALUES (?, ?)\nINFO     sqlalchemy.engine.Engine:base.py:1904 [generated in 0.00014s] [(1, 'Premium'), (2, 'Basic')]\nINFO     sqlalchemy.engine.Engine:base.py:1143 COMMIT\nINFO     sqlalchemy.engine.Engine:base.py:1094 BEGIN (implicit)\nINFO     sqlalchemy.engine.Engine:base.py:1899 INSERT INTO test (id, name, tier_id, category_id, is_deleted, deleted_at) VALUES (?, ?, ?, ?, ?, ?)\nINFO     sqlalchemy.engine.Engine:base.py:1904 [generated in 0.00017s] [(1, 'Charlie', 1, 1, 0, None), (2, 'Alice', 2, 1, 0, None), (3, 'Bob', 1, 2, 0, None), (4, 'David', 2, 1, 0, None), (5, 'Eve', 1, 1, 0, None), (6, 'Frank', 2, 2, 0, None), (7, 'Grace', 1, 2, 0, None), (8, 'Hannah', 2, 1, 0, None)  ... displaying 10 of 11 total bound parameter sets ...  (10, 'Judy', 2, 2, 0, None), (11, 'Alice', 1, 1, 0, None)]\nINFO     sqlalchemy.engine.Engine:base.py:1143 COMMIT\nINFO     sqlalchemy.engine.Engine:base.py:1094 BEGIN (implicit)\nINFO     sqlalchemy.engine.Engine:base.py:1899 SELECT test.name, test.tier_id, test.category_id, tier.name AS name_1 \nFROM test LEFT OUTER JOIN tier ON test.tier_id = tier.id\n LIMIT ? OFFSET ?\nINFO     sqlalchemy.engine.Engine:base.py:1904 [generated in 0.00014s] (10, 0)\nINFO     sqlalchemy.engine.Engine:base.py:1899 SELECT count(*) AS count_1 \nFROM test\nINFO     sqlalchemy.engine.Engine:base.py:1904 [generated in 0.00012s] ()\n---------------------------- Captured log teardown -----------------------------\nINFO     sqlalchemy.engine.Engine:base.py:1126 ROLLBACK\nINFO     sqlalchemy.engine.Engine:base.py:1094 BEGIN (implicit)\nINFO     sqlalchemy.engine.Engine:base.py:1899 PRAGMA main.table_info(\"multi_pk\")\nINFO     sqlalchemy.engine.Engine:base.py:1904 [raw sql] ()\nINFO     sqlalchemy.engine.Engine:base.py:1899 PRAGMA main.table_info(\"category\")\nINFO     sqlalchemy.engine.Engine:base.py:1904 [raw sql] ()\nINFO     sqlalchemy.engine.Engine:base.py:1899 PRAGMA main.table_info(\"test\")\nINFO     sqlalchemy.engine.Engine:base.py:1904 [raw sql] ()\nINFO     sqlalchemy.engine.Engine:base.py:1899 PRAGMA main.table_info(\"model_test_with_timestamp\")\nINFO     sqlalchemy.engine.Engine:base.py:1904 [raw sql] ()\nINFO     sqlalchemy.engine.Engine:base.py:1899 PRAGMA main.table_info(\"tier\")\nINFO     sqlalchemy.engine.Engine:base.py:1904 [raw sql] ()\nINFO     sqlalchemy.engine.Engine:base.py:1899 PRAGMA main.table_info(\"booking\")\nINFO     sqlalchemy.engine.Engine:base.py:1904 [raw sql] ()\nINFO     sqlalchemy.engine.Engine:base.py:1899 PRAGMA main.table_info(\"projects\")\nINFO     sqlalchemy.engine.Engine:base.py:1904 [raw sql] ()\nINFO     sqlalchemy.engine.Engine:base.py:1899 PRAGMA main.table_info(\"participants\")\nINFO     sqlalchemy.engine.Engine:base.py:1904 [raw sql] ()\nINFO     sqlalchemy.engine.Engine:base.py:1899 PRAGMA main.table_info(\"projects_participants_association\")\nINFO     sqlalchemy.engine.Engine:base.py:1904 [raw sql] ()\nINFO     sqlalchemy.engine.Engine:base.py:1899 \nDROP TABLE booking\nINFO     sqlalchemy.engine.Engine:base.py:1904 [no key 0.00008s] ()\nINFO     sqlalchemy.engine.Engine:base.py:1899 \nDROP TABLE multi_pk\nINFO     sqlalchemy.engine.Engine:base.py:1904 [no key 0.00009s] ()\nINFO     sqlalchemy.engine.Engine:base.py:1899 \nDROP TABLE projects_participants_association\nINFO     sqlalchemy.engine.Engine:base.py:1904 [no key 0.00007s] ()\nINFO     sqlalchemy.engine.Engine:base.py:1899 \nDROP TABLE model_test_with_timestamp\nINFO     sqlalchemy.engine.Engine:base.py:1904 [no key 0.00007s] ()\nINFO     sqlalchemy.engine.Engine:base.py:1899 \nDROP TABLE test\nINFO     sqlalchemy.engine.Engine:base.py:1904 [no key 0.00006s] ()\nINFO     sqlalchemy.engine.Engine:base.py:1899 \nDROP TABLE participants\nINFO     sqlalchemy.engine.Engine:base.py:1904 [no key 0.00007s] ()\nINFO     sqlalchemy.engine.Engine:base.py:1899 \nDROP TABLE projects\nINFO     sqlalchemy.engine.Engine:base.py:1904 [no key 0.00007s] ()\nINFO     sqlalchemy.engine.Engine:base.py:1899 \nDROP TABLE tier\nINFO     sqlalchemy.engine.Engine:base.py:1904 [no key 0.00006s] ()\nINFO     sqlalchemy.engine.Engine:base.py:1899 \nDROP TABLE category\nINFO     sqlalchemy.engine.Engine:base.py:1904 [no key 0.00006s] ()\nINFO     sqlalchemy.engine.Engine:base.py:1143 COMMIT\n----------- generated xml file: /opt/receipts/reports/agent1-18.xml ------------\n=========================== short test summary info ============================\nFAILED tests/sqlalchemy/crud/test_get_multi_joined.py::test_get_multi_joined_no_prefix_nested\n!!!!!!!!!!!!!!!!!!!!!!!!!! stopping after 1 failures !!!!!!!!!!!!!!!!!!!!!!!!!!!\n============================== 1 failed in 0.13s ===============================\n","stderr_tail":"","stdout_sha256":"562d1211fe7221f6b7ad5cf958093d29d2dce634daa28762e8b233c5d61f0ed7","log_path":"~/dev/nebius-hackathon/pilot/v2-P/igorbenav__fastcrud-69/runs/pilot-igorbenav__fastcrud-69-e8d0d0ccb6/logs/agent1/agent1-18.log","tree_digest":"16e06d183b15a9f5ac9329111f79a8d40c71e3684f887df43222f882382cd5e7","tree_download_s":2.386612500064075,"started_at":"2026-10-03T17:50:43.873268Z","duration_s":1.7962820000000002,"timed_out":false,"image_before":"8a4c263e-4760-482e-8082-06179af4f82f","image_after":"9a10d00b-bdfd-4bcc-910b-13281f1949da","junit":{"passed":[],"failed":["tests/sqlalchemy/crud/test_get_multi_joined.py::test_get_multi_joined_no_prefix_nested"],"errors":[],"skipped":[],"collection_errors":[],"failure_text":{"tests/sqlalchemy/crud/test_get_multi_joined.py::test_get_multi_joined_no_prefix_nested":"AssertionError: Expected 'name' field inside nested 'tier' dictionary.\nassert 'name' in {'id': 1}\ntests/sqlalchemy/crud/test_get_multi_joined.py:793: in test_get_multi_joined_no_prefix_nested\n    assert (\nE   AssertionError: Expected 'name' field inside nested 'tier' dictionary.\nE   assert 'name' in {'id': 1}"}},"diff":null,"patch_sha256":null,"dropped_paths":[],"snapshot_sha":null}
{"receipt_id":"agent1-19","seq":19,"branch_id":"agent1","kind":"command","cmd":"grep -n \"CreateSchemaTest\\|TierSchemaTest\" tests/sqlalchemy/conftest.py","path":null,"exit_code":0,"stdout_tail":"117:class CreateSchemaTest(BaseModel):\n139:class TierSchemaTest(BaseModel):\n267:    return CreateSchemaTest\n277:    return TierSchemaTest\n374:        create_schema=CreateSchemaTest,\n","stderr_tail":"","stdout_sha256":"2fe5dba132386bffa62dec1bf459603767ea31597ad267ed1827807cadf74236","log_path":"~/dev/nebius-hackathon/pilot/v2-P/igorbenav__fastcrud-69/runs/pilot-igorbenav__fastcrud-69-e8d0d0ccb6/logs/agent1/agent1-19.log","tree_digest":null,"tree_download_s":null,"started_at":"2026-10-03T17:50:55.785478Z","duration_s":0.0030210000000000002,"timed_out":false,"image_before":"9a10d00b-bdfd-4bcc-910b-13281f1949da","image_after":"ce8bf256-b308-4b08-87eb-d415576315c9","junit":null,"diff":null,"patch_sha256":null,"dropped_paths":[],"snapshot_sha":null}
{"receipt_id":"agent1-20","seq":20,"branch_id":"agent1","kind":"write","cmd":"/opt/receipts-c4fd523030e04ed19700cefc8626875c/bin/busybox sh -c 'mkdir -p /fastcrud/fastcrud/crud && cp /opt/receipts-c4fd523030e04ed19700cefc8626875c/incoming/16df25e4eb55772b500c29c11842daddc620fba08d2f7f6e9dfea909c78bbb7a /fastcrud/fastcrud/crud/fast_crud.py'","path":"fastcrud/crud/fast_crud.py","exit_code":0,"stdout_tail":"","stderr_tail":"","stdout_sha256":"16df25e4eb55772b500c29c11842daddc620fba08d2f7f6e9dfea909c78bbb7a","log_path":"~/dev/nebius-hackathon/pilot/v2-P/igorbenav__fastcrud-69/runs/pilot-igorbenav__fastcrud-69-e8d0d0ccb6/logs/agent1/agent1-20.log","tree_digest":null,"tree_download_s":null,"started_at":"2026-10-03T17:51:27.495848Z","duration_s":0.005232,"timed_out":false,"image_before":"ce8bf256-b308-4b08-87eb-d415576315c9","image_after":"ff016971-05c1-44ce-9b27-a9813b3f6f0f","junit":null,"diff":null,"patch_sha256":null,"dropped_paths":[],"snapshot_sha":null}
{"receipt_id":"agent1-21","seq":21,"branch_id":"agent1","kind":"command","cmd":"/opt/receipts-36166c4681b544a19774e138b34c14ae/bin/busybox mkdir -p /opt/receipts/reports && python -I /opt/receipts-36166c4681b544a19774e138b34c14ae/receipts_pytest.py tests/sqlalchemy/crud/test_get_multi_joined.py::test_get_multi_joined_no_prefix_nested -xvs -o junit_family=xunit1 -p no:cacheprovider -rA --continue-on-collection-errors --junitxml=/opt/receipts/reports/agent1-21.xml","path":null,"exit_code":0,"stdout_tail":"tier (id), \n\tFOREIGN KEY(category_id) REFERENCES category (id)\n)\n\n\nINFO     sqlalchemy.engine.Engine:base.py:1904 [no key 0.00010s] ()\nINFO     sqlalchemy.engine.Engine:base.py:1899 \nCREATE TABLE projects_participants_association (\n\tproject_id INTEGER NOT NULL, \n\tparticipant_id INTEGER NOT NULL, \n\tPRIMARY KEY (project_id, participant_id), \n\tFOREIGN KEY(project_id) REFERENCES projects (id), \n\tFOREIGN KEY(participant_id) REFERENCES participants (id)\n)\n\n\nINFO     sqlalchemy.engine.Engine:base.py:1904 [no key 0.00006s] ()\nINFO     sqlalchemy.engine.Engine:base.py:1899 \nCREATE TABLE multi_pk (\n\tid INTEGER NOT NULL, \n\tuuid VARCHAR(32) NOT NULL, \n\tname VARCHAR, \n\ttest_id INTEGER, \n\tPRIMARY KEY (id, uuid), \n\tUNIQUE (name), \n\tFOREIGN KEY(test_id) REFERENCES test (id)\n)\n\n\nINFO     sqlalchemy.engine.Engine:base.py:1904 [no key 0.00008s] ()\nINFO     sqlalchemy.engine.Engine:base.py:1899 \nCREATE TABLE booking (\n\tid INTEGER NOT NULL, \n\towner_id INTEGER NOT NULL, \n\tuser_id INTEGER NOT NULL, \n\tbooking_date DATETIME NOT NULL, \n\tPRIMARY KEY (id), \n\tFOREIGN KEY(owner_id) REFERENCES test (id), \n\tFOREIGN KEY(user_id) REFERENCES test (id)\n)\n\n\nINFO     sqlalchemy.engine.Engine:base.py:1904 [no key 0.00009s] ()\nINFO     sqlalchemy.engine.Engine:base.py:1143 COMMIT\n------------------------------ Captured log call -------------------------------\nINFO     sqlalchemy.engine.Engine:base.py:1094 BEGIN (implicit)\nINFO     sqlalchemy.engine.Engine:base.py:1899 INSERT INTO tier (id, name) VALUES (?, ?)\nINFO     sqlalchemy.engine.Engine:base.py:1904 [generated in 0.00015s] [(1, 'Premium'), (2, 'Basic')]\nINFO     sqlalchemy.engine.Engine:base.py:1143 COMMIT\nINFO     sqlalchemy.engine.Engine:base.py:1094 BEGIN (implicit)\nINFO     sqlalchemy.engine.Engine:base.py:1899 INSERT INTO test (id, name, tier_id, category_id, is_deleted, deleted_at) VALUES (?, ?, ?, ?, ?, ?)\nINFO     sqlalchemy.engine.Engine:base.py:1904 [generated in 0.00017s] [(1, 'Charlie', 1, 1, 0, None), (2, 'Alice', 2, 1, 0, None), (3, 'Bob', 1, 2, 0, None), (4, 'David', 2, 1, 0, None), (5, 'Eve', 1, 1, 0, None), (6, 'Frank', 2, 2, 0, None), (7, 'Grace', 1, 2, 0, None), (8, 'Hannah', 2, 1, 0, None)  ... displaying 10 of 11 total bound parameter sets ...  (10, 'Judy', 2, 2, 0, None), (11, 'Alice', 1, 1, 0, None)]\nINFO     sqlalchemy.engine.Engine:base.py:1143 COMMIT\nINFO     sqlalchemy.engine.Engine:base.py:1094 BEGIN (implicit)\nINFO     sqlalchemy.engine.Engine:base.py:1899 SELECT test.name, test.tier_id, test.category_id, tier.name AS tier_name \nFROM test LEFT OUTER JOIN tier ON test.tier_id = tier.id\n LIMIT ? OFFSET ?\nINFO     sqlalchemy.engine.Engine:base.py:1904 [generated in 0.00013s] (10, 0)\nINFO     sqlalchemy.engine.Engine:base.py:1899 SELECT count(*) AS count_1 \nFROM test\nINFO     sqlalchemy.engine.Engine:base.py:1904 [generated in 0.00012s] ()\n---------------------------- Captured log teardown -----------------------------\nINFO     sqlalchemy.engine.Engine:base.py:1126 ROLLBACK\nINFO     sqlalchemy.engine.Engine:base.py:1094 BEGIN (implicit)\nINFO     sqlalchemy.engine.Engine:base.py:1899 PRAGMA main.table_info(\"multi_pk\")\nINFO     sqlalchemy.engine.Engine:base.py:1904 [raw sql] ()\nINFO     sqlalchemy.engine.Engine:base.py:1899 PRAGMA main.table_info(\"category\")\nINFO     sqlalchemy.engine.Engine:base.py:1904 [raw sql] ()\nINFO     sqlalchemy.engine.Engine:base.py:1899 PRAGMA main.table_info(\"test\")\nINFO     sqlalchemy.engine.Engine:base.py:1904 [raw sql] ()\nINFO     sqlalchemy.engine.Engine:base.py:1899 PRAGMA main.table_info(\"model_test_with_timestamp\")\nINFO     sqlalchemy.engine.Engine:base.py:1904 [raw sql] ()\nINFO     sqlalchemy.engine.Engine:base.py:1899 PRAGMA main.table_info(\"tier\")\nINFO     sqlalchemy.engine.Engine:base.py:1904 [raw sql] ()\nINFO     sqlalchemy.engine.Engine:base.py:1899 PRAGMA main.table_info(\"booking\")\nINFO     sqlalchemy.engine.Engine:base.py:1904 [raw sql] ()\nINFO     sqlalchemy.engine.Engine:base.py:1899 PRAGMA main.table_info(\"projects\")\nINFO     sqlalchemy.engine.Engine:base.py:1904 [raw sql] ()\nINFO     sqlalchemy.engine.Engine:base.py:1899 PRAGMA main.table_info(\"participants\")\nINFO     sqlalchemy.engine.Engine:base.py:1904 [raw sql] ()\nINFO     sqlalchemy.engine.Engine:base.py:1899 PRAGMA main.table_info(\"projects_participants_association\")\nINFO     sqlalchemy.engine.Engine:base.py:1904 [raw sql] ()\nINFO     sqlalchemy.engine.Engine:base.py:1899 \nDROP TABLE booking\nINFO     sqlalchemy.engine.Engine:base.py:1904 [no key 0.00008s] ()\nINFO     sqlalchemy.engine.Engine:base.py:1899 \nDROP TABLE multi_pk\nINFO     sqlalchemy.engine.Engine:base.py:1904 [no key 0.00007s] ()\nINFO     sqlalchemy.engine.Engine:base.py:1899 \nDROP TABLE projects_participants_association\nINFO     sqlalchemy.engine.Engine:base.py:1904 [no key 0.00011s] ()\nINFO     sqlalchemy.engine.Engine:base.py:1899 \nDROP TABLE model_test_with_timestamp\nINFO     sqlalchemy.engine.Engine:base.py:1904 [no key 0.00007s] ()\nINFO     sqlalchemy.engine.Engine:base.py:1899 \nDROP TABLE test\nINFO     sqlalchemy.engine.Engine:base.py:1904 [no key 0.00005s] ()\nINFO     sqlalchemy.engine.Engine:base.py:1899 \nDROP TABLE participants\nINFO     sqlalchemy.engine.Engine:base.py:1904 [no key 0.00007s] ()\nINFO     sqlalchemy.engine.Engine:base.py:1899 \nDROP TABLE projects\nINFO     sqlalchemy.engine.Engine:base.py:1904 [no key 0.00006s] ()\nINFO     sqlalchemy.engine.Engine:base.py:1899 \nDROP TABLE tier\nINFO     sqlalchemy.engine.Engine:base.py:1904 [no key 0.00006s] ()\nINFO     sqlalchemy.engine.Engine:base.py:1899 \nDROP TABLE category\nINFO     sqlalchemy.engine.Engine:base.py:1904 [no key 0.00007s] ()\nINFO     sqlalchemy.engine.Engine:base.py:1143 COMMIT\n----------- generated xml file: /opt/receipts/reports/agent1-21.xml ------------\n=========================== short test summary info ============================\nPASSED tests/sqlalchemy/crud/test_get_multi_joined.py::test_get_multi_joined_no_prefix_nested\n============================== 1 passed in 0.09s ===============================\n","stderr_tail":"","stdout_sha256":"677812f272a4722360c97f43e1d7b2735bc1df3e5caa2e7ec317c6464d675a4c","log_path":"~/dev/nebius-hackathon/pilot/v2-P/igorbenav__fastcrud-69/runs/pilot-igorbenav__fastcrud-69-e8d0d0ccb6/logs/agent1/agent1-21.log","tree_digest":"c2f66a500a79921cb7827d0a7f8c4537f192578b87d5b5e68dc1def0608b230a","tree_download_s":3.1421860000118613,"started_at":"2026-10-03T17:51:35.741777Z","duration_s":1.750833,"timed_out":false,"image_before":"ff016971-05c1-44ce-9b27-a9813b3f6f0f","image_after":"56257efe-3f5c-4883-b159-e59bd8cabebc","junit":{"passed":["tests/sqlalchemy/crud/test_get_multi_joined.py::test_get_multi_joined_no_prefix_nested"],"failed":[],"errors":[],"skipped":[],"collection_errors":[],"failure_text":{}},"diff":null,"patch_sha256":null,"dropped_paths":[],"snapshot_sha":null}
{"receipt_id":"agent1-22","seq":22,"branch_id":"agent1","kind":"write","cmd":"/opt/receipts-2ea25fb916a343dd97a4672c3eed806a/bin/busybox sh -c 'mkdir -p /fastcrud/fastcrud/crud && cp /opt/receipts-2ea25fb916a343dd97a4672c3eed806a/incoming/637b08d697e57dce69918a7e457b91c97e538777e088276457f05c97eab6b62c /fastcrud/fastcrud/crud/helper.py'","path":"fastcrud/crud/helper.py","exit_code":0,"stdout_tail":"","stderr_tail":"","stdout_sha256":"637b08d697e57dce69918a7e457b91c97e538777e088276457f05c97eab6b62c","log_path":"~/dev/nebius-hackathon/pilot/v2-P/igorbenav__fastcrud-69/runs/pilot-igorbenav__fastcrud-69-e8d0d0ccb6/logs/agent1/agent1-22.log","tree_digest":null,"tree_download_s":null,"started_at":"2026-10-03T17:51:48.866643Z","duration_s":0.005039,"timed_out":false,"image_before":"56257efe-3f5c-4883-b159-e59bd8cabebc","image_after":"000bd56d-a82b-4fa6-a1e0-a927e5097462","junit":null,"diff":null,"patch_sha256":null,"dropped_paths":[],"snapshot_sha":null}
{"receipt_id":"agent1-23","seq":23,"branch_id":"agent1","kind":"write","cmd":"/opt/receipts-ee3083dc35bc401eadeda64423d95334/bin/busybox sh -c 'mkdir -p /fastcrud/fastcrud/crud && cp /opt/receipts-ee3083dc35bc401eadeda64423d95334/incoming/53f99aa2ee828d023d814b493f430345ab8491837a267d6f291da818dac86f71 /fastcrud/fastcrud/crud/helper.py'","path":"fastcrud/crud/helper.py","exit_code":0,"stdout_tail":"","stderr_tail":"","stdout_sha256":"53f99aa2ee828d023d814b493f430345ab8491837a267d6f291da818dac86f71","log_path":"~/dev/nebius-hackathon/pilot/v2-P/igorbenav__fastcrud-69/runs/pilot-igorbenav__fastcrud-69-e8d0d0ccb6/logs/agent1/agent1-23.log","tree_digest":null,"tree_download_s":null,"started_at":"2026-10-03T17:51:54.612877Z","duration_s":0.004878,"timed_out":false,"image_before":"000bd56d-a82b-4fa6-a1e0-a927e5097462","image_after":"26095506-3a12-4996-a63f-c62376220da1","junit":null,"diff":null,"patch_sha256":null,"dropped_paths":[],"snapshot_sha":null}
{"receipt_id":"agent1-24","seq":24,"branch_id":"agent1","kind":"command","cmd":"/opt/receipts-c331d256047e42c4ba2b130252df6e97/bin/busybox mkdir -p /opt/receipts/reports && python -I /opt/receipts-c331d256047e42c4ba2b130252df6e97/receipts_pytest.py tests/sqlalchemy/crud/test_get_multi_joined.py::test_get_multi_joined_no_prefix_nested -xvs -o junit_family=xunit1 -p no:cacheprovider -rA --continue-on-collection-errors --junitxml=/opt/receipts/reports/agent1-24.xml","path":null,"exit_code":0,"stdout_tail":"tier (id), \n\tFOREIGN KEY(category_id) REFERENCES category (id)\n)\n\n\nINFO     sqlalchemy.engine.Engine:base.py:1904 [no key 0.00006s] ()\nINFO     sqlalchemy.engine.Engine:base.py:1899 \nCREATE TABLE projects_participants_association (\n\tproject_id INTEGER NOT NULL, \n\tparticipant_id INTEGER NOT NULL, \n\tPRIMARY KEY (project_id, participant_id), \n\tFOREIGN KEY(project_id) REFERENCES projects (id), \n\tFOREIGN KEY(participant_id) REFERENCES participants (id)\n)\n\n\nINFO     sqlalchemy.engine.Engine:base.py:1904 [no key 0.00005s] ()\nINFO     sqlalchemy.engine.Engine:base.py:1899 \nCREATE TABLE multi_pk (\n\tid INTEGER NOT NULL, \n\tuuid VARCHAR(32) NOT NULL, \n\tname VARCHAR, \n\ttest_id INTEGER, \n\tPRIMARY KEY (id, uuid), \n\tUNIQUE (name), \n\tFOREIGN KEY(test_id) REFERENCES test (id)\n)\n\n\nINFO     sqlalchemy.engine.Engine:base.py:1904 [no key 0.00006s] ()\nINFO     sqlalchemy.engine.Engine:base.py:1899 \nCREATE TABLE booking (\n\tid INTEGER NOT NULL, \n\towner_id INTEGER NOT NULL, \n\tuser_id INTEGER NOT NULL, \n\tbooking_date DATETIME NOT NULL, \n\tPRIMARY KEY (id), \n\tFOREIGN KEY(owner_id) REFERENCES test (id), \n\tFOREIGN KEY(user_id) REFERENCES test (id)\n)\n\n\nINFO     sqlalchemy.engine.Engine:base.py:1904 [no key 0.00006s] ()\nINFO     sqlalchemy.engine.Engine:base.py:1143 COMMIT\n------------------------------ Captured log call -------------------------------\nINFO     sqlalchemy.engine.Engine:base.py:1094 BEGIN (implicit)\nINFO     sqlalchemy.engine.Engine:base.py:1899 INSERT INTO tier (id, name) VALUES (?, ?)\nINFO     sqlalchemy.engine.Engine:base.py:1904 [generated in 0.00012s] [(1, 'Premium'), (2, 'Basic')]\nINFO     sqlalchemy.engine.Engine:base.py:1143 COMMIT\nINFO     sqlalchemy.engine.Engine:base.py:1094 BEGIN (implicit)\nINFO     sqlalchemy.engine.Engine:base.py:1899 INSERT INTO test (id, name, tier_id, category_id, is_deleted, deleted_at) VALUES (?, ?, ?, ?, ?, ?)\nINFO     sqlalchemy.engine.Engine:base.py:1904 [generated in 0.00015s] [(1, 'Charlie', 1, 1, 0, None), (2, 'Alice', 2, 1, 0, None), (3, 'Bob', 1, 2, 0, None), (4, 'David', 2, 1, 0, None), (5, 'Eve', 1, 1, 0, None), (6, 'Frank', 2, 2, 0, None), (7, 'Grace', 1, 2, 0, None), (8, 'Hannah', 2, 1, 0, None)  ... displaying 10 of 11 total bound parameter sets ...  (10, 'Judy', 2, 2, 0, None), (11, 'Alice', 1, 1, 0, None)]\nINFO     sqlalchemy.engine.Engine:base.py:1143 COMMIT\nINFO     sqlalchemy.engine.Engine:base.py:1094 BEGIN (implicit)\nINFO     sqlalchemy.engine.Engine:base.py:1899 SELECT test.name, test.tier_id, test.category_id, tier.name AS tier_name \nFROM test LEFT OUTER JOIN tier ON test.tier_id = tier.id\n LIMIT ? OFFSET ?\nINFO     sqlalchemy.engine.Engine:base.py:1904 [generated in 0.00011s] (10, 0)\nINFO     sqlalchemy.engine.Engine:base.py:1899 SELECT count(*) AS count_1 \nFROM test\nINFO     sqlalchemy.engine.Engine:base.py:1904 [generated in 0.00009s] ()\n---------------------------- Captured log teardown -----------------------------\nINFO     sqlalchemy.engine.Engine:base.py:1126 ROLLBACK\nINFO     sqlalchemy.engine.Engine:base.py:1094 BEGIN (implicit)\nINFO     sqlalchemy.engine.Engine:base.py:1899 PRAGMA main.table_info(\"multi_pk\")\nINFO     sqlalchemy.engine.Engine:base.py:1904 [raw sql] ()\nINFO     sqlalchemy.engine.Engine:base.py:1899 PRAGMA main.table_info(\"category\")\nINFO     sqlalchemy.engine.Engine:base.py:1904 [raw sql] ()\nINFO     sqlalchemy.engine.Engine:base.py:1899 PRAGMA main.table_info(\"test\")\nINFO     sqlalchemy.engine.Engine:base.py:1904 [raw sql] ()\nINFO     sqlalchemy.engine.Engine:base.py:1899 PRAGMA main.table_info(\"model_test_with_timestamp\")\nINFO     sqlalchemy.engine.Engine:base.py:1904 [raw sql] ()\nINFO     sqlalchemy.engine.Engine:base.py:1899 PRAGMA main.table_info(\"tier\")\nINFO     sqlalchemy.engine.Engine:base.py:1904 [raw sql] ()\nINFO     sqlalchemy.engine.Engine:base.py:1899 PRAGMA main.table_info(\"booking\")\nINFO     sqlalchemy.engine.Engine:base.py:1904 [raw sql] ()\nINFO     sqlalchemy.engine.Engine:base.py:1899 PRAGMA main.table_info(\"projects\")\nINFO     sqlalchemy.engine.Engine:base.py:1904 [raw sql] ()\nINFO     sqlalchemy.engine.Engine:base.py:1899 PRAGMA main.table_info(\"participants\")\nINFO     sqlalchemy.engine.Engine:base.py:1904 [raw sql] ()\nINFO     sqlalchemy.engine.Engine:base.py:1899 PRAGMA main.table_info(\"projects_participants_association\")\nINFO     sqlalchemy.engine.Engine:base.py:1904 [raw sql] ()\nINFO     sqlalchemy.engine.Engine:base.py:1899 \nDROP TABLE booking\nINFO     sqlalchemy.engine.Engine:base.py:1904 [no key 0.00006s] ()\nINFO     sqlalchemy.engine.Engine:base.py:1899 \nDROP TABLE multi_pk\nINFO     sqlalchemy.engine.Engine:base.py:1904 [no key 0.00005s] ()\nINFO     sqlalchemy.engine.Engine:base.py:1899 \nDROP TABLE projects_participants_association\nINFO     sqlalchemy.engine.Engine:base.py:1904 [no key 0.00005s] ()\nINFO     sqlalchemy.engine.Engine:base.py:1899 \nDROP TABLE model_test_with_timestamp\nINFO     sqlalchemy.engine.Engine:base.py:1904 [no key 0.00005s] ()\nINFO     sqlalchemy.engine.Engine:base.py:1899 \nDROP TABLE test\nINFO     sqlalchemy.engine.Engine:base.py:1904 [no key 0.00005s] ()\nINFO     sqlalchemy.engine.Engine:base.py:1899 \nDROP TABLE participants\nINFO     sqlalchemy.engine.Engine:base.py:1904 [no key 0.00005s] ()\nINFO     sqlalchemy.engine.Engine:base.py:1899 \nDROP TABLE projects\nINFO     sqlalchemy.engine.Engine:base.py:1904 [no key 0.00005s] ()\nINFO     sqlalchemy.engine.Engine:base.py:1899 \nDROP TABLE tier\nINFO     sqlalchemy.engine.Engine:base.py:1904 [no key 0.00005s] ()\nINFO     sqlalchemy.engine.Engine:base.py:1899 \nDROP TABLE category\nINFO     sqlalchemy.engine.Engine:base.py:1904 [no key 0.00005s] ()\nINFO     sqlalchemy.engine.Engine:base.py:1143 COMMIT\n----------- generated xml file: /opt/receipts/reports/agent1-24.xml ------------\n=========================== short test summary info ============================\nPASSED tests/sqlalchemy/crud/test_get_multi_joined.py::test_get_multi_joined_no_prefix_nested\n============================== 1 passed in 0.08s ===============================\n","stderr_tail":"","stdout_sha256":"a3d89b87e146659f59aaf72c90f39f839a8d052dc6671c42475bb490da34f29e","log_path":"~/dev/nebius-hackathon/pilot/v2-P/igorbenav__fastcrud-69/runs/pilot-igorbenav__fastcrud-69-e8d0d0ccb6/logs/agent1/agent1-24.log","tree_digest":"e6b7a7c009f59eacbd3550ce36480efa9bf2f4b959ea42584e7e8972baeb9350","tree_download_s":2.5032882909290493,"started_at":"2026-10-03T17:51:57.490049Z","duration_s":1.762475,"timed_out":false,"image_before":"26095506-3a12-4996-a63f-c62376220da1","image_after":"a2f5741f-85bb-4955-afb1-0ae4a1aeb205","junit":{"passed":["tests/sqlalchemy/crud/test_get_multi_joined.py::test_get_multi_joined_no_prefix_nested"],"failed":[],"errors":[],"skipped":[],"collection_errors":[],"failure_text":{}},"diff":null,"patch_sha256":null,"dropped_paths":[],"snapshot_sha":null}
{"receipt_id":"agent1-25","seq":25,"branch_id":"agent1","kind":"command","cmd":"/opt/receipts-a0c94e1665624cad9ee0162bedaeb566/bin/busybox mkdir -p /opt/receipts/reports && python -I /opt/receipts-a0c94e1665624cad9ee0162bedaeb566/receipts_pytest.py tests/sqlalchemy/crud/test_get_joined.py::test_get_joined_nested_no_prefix_provided -xvs -o junit_family=xunit1 -p no:cacheprovider -rA --continue-on-collection-errors --junitxml=/opt/receipts/reports/agent1-25.xml","path":null,"exit_code":1,"stdout_tail":"deleted_at DATETIME, \n\tupdated_at DATETIME NOT NULL, \n\tPRIMARY KEY (id), \n\tFOREIGN KEY(tier_id) REFERENCES tier (id), \n\tFOREIGN KEY(category_id) REFERENCES category (id)\n)\n\n\nINFO     sqlalchemy.engine.Engine:base.py:1904 [no key 0.00006s] ()\nINFO     sqlalchemy.engine.Engine:base.py:1899 \nCREATE TABLE projects_participants_association (\n\tproject_id INTEGER NOT NULL, \n\tparticipant_id INTEGER NOT NULL, \n\tPRIMARY KEY (project_id, participant_id), \n\tFOREIGN KEY(project_id) REFERENCES projects (id), \n\tFOREIGN KEY(participant_id) REFERENCES participants (id)\n)\n\n\nINFO     sqlalchemy.engine.Engine:base.py:1904 [no key 0.00006s] ()\nINFO     sqlalchemy.engine.Engine:base.py:1899 \nCREATE TABLE multi_pk (\n\tid INTEGER NOT NULL, \n\tuuid VARCHAR(32) NOT NULL, \n\tname VARCHAR, \n\ttest_id INTEGER, \n\tPRIMARY KEY (id, uuid), \n\tUNIQUE (name), \n\tFOREIGN KEY(test_id) REFERENCES test (id)\n)\n\n\nINFO     sqlalchemy.engine.Engine:base.py:1904 [no key 0.00005s] ()\nINFO     sqlalchemy.engine.Engine:base.py:1899 \nCREATE TABLE booking (\n\tid INTEGER NOT NULL, \n\towner_id INTEGER NOT NULL, \n\tuser_id INTEGER NOT NULL, \n\tbooking_date DATETIME NOT NULL, \n\tPRIMARY KEY (id), \n\tFOREIGN KEY(owner_id) REFERENCES test (id), \n\tFOREIGN KEY(user_id) REFERENCES test (id)\n)\n\n\nINFO     sqlalchemy.engine.Engine:base.py:1904 [no key 0.00006s] ()\nINFO     sqlalchemy.engine.Engine:base.py:1143 COMMIT\n------------------------------ Captured log call -------------------------------\nINFO     sqlalchemy.engine.Engine:base.py:1094 BEGIN (implicit)\nINFO     sqlalchemy.engine.Engine:base.py:1899 INSERT INTO tier (id, name) VALUES (?, ?)\nINFO     sqlalchemy.engine.Engine:base.py:1904 [generated in 0.00012s] [(1, 'Premium'), (2, 'Basic')]\nINFO     sqlalchemy.engine.Engine:base.py:1143 COMMIT\nINFO     sqlalchemy.engine.Engine:base.py:1094 BEGIN (implicit)\nINFO     sqlalchemy.engine.Engine:base.py:1899 INSERT INTO test (id, name, tier_id, category_id, is_deleted, deleted_at) VALUES (?, ?, ?, ?, ?, ?)\nINFO     sqlalchemy.engine.Engine:base.py:1904 [generated in 0.00015s] [(1, 'Charlie', 1, 1, 0, None), (2, 'Alice', 2, 1, 0, None), (3, 'Bob', 1, 2, 0, None), (4, 'David', 2, 1, 0, None), (5, 'Eve', 1, 1, 0, None), (6, 'Frank', 2, 2, 0, None), (7, 'Grace', 1, 2, 0, None), (8, 'Hannah', 2, 1, 0, None)  ... displaying 10 of 11 total bound parameter sets ...  (10, 'Judy', 2, 2, 0, None), (11, 'Alice', 1, 1, 0, None)]\nINFO     sqlalchemy.engine.Engine:base.py:1143 COMMIT\nINFO     sqlalchemy.engine.Engine:base.py:1094 BEGIN (implicit)\nINFO     sqlalchemy.engine.Engine:base.py:1899 SELECT test.name, test.tier_id, test.category_id, tier.name AS name_1 \nFROM test LEFT OUTER JOIN tier ON tier.id = test.tier_id\nINFO     sqlalchemy.engine.Engine:base.py:1904 [generated in 0.00009s] ()\n---------------------------- Captured log teardown -----------------------------\nINFO     sqlalchemy.engine.Engine:base.py:1126 ROLLBACK\nINFO     sqlalchemy.engine.Engine:base.py:1094 BEGIN (implicit)\nINFO     sqlalchemy.engine.Engine:base.py:1899 PRAGMA main.table_info(\"multi_pk\")\nINFO     sqlalchemy.engine.Engine:base.py:1904 [raw sql] ()\nINFO     sqlalchemy.engine.Engine:base.py:1899 PRAGMA main.table_info(\"category\")\nINFO     sqlalchemy.engine.Engine:base.py:1904 [raw sql] ()\nINFO     sqlalchemy.engine.Engine:base.py:1899 PRAGMA main.table_info(\"test\")\nINFO     sqlalchemy.engine.Engine:base.py:1904 [raw sql] ()\nINFO     sqlalchemy.engine.Engine:base.py:1899 PRAGMA main.table_info(\"model_test_with_timestamp\")\nINFO     sqlalchemy.engine.Engine:base.py:1904 [raw sql] ()\nINFO     sqlalchemy.engine.Engine:base.py:1899 PRAGMA main.table_info(\"tier\")\nINFO     sqlalchemy.engine.Engine:base.py:1904 [raw sql] ()\nINFO     sqlalchemy.engine.Engine:base.py:1899 PRAGMA main.table_info(\"booking\")\nINFO     sqlalchemy.engine.Engine:base.py:1904 [raw sql] ()\nINFO     sqlalchemy.engine.Engine:base.py:1899 PRAGMA main.table_info(\"projects\")\nINFO     sqlalchemy.engine.Engine:base.py:1904 [raw sql] ()\nINFO     sqlalchemy.engine.Engine:base.py:1899 PRAGMA main.table_info(\"participants\")\nINFO     sqlalchemy.engine.Engine:base.py:1904 [raw sql] ()\nINFO     sqlalchemy.engine.Engine:base.py:1899 PRAGMA main.table_info(\"projects_participants_association\")\nINFO     sqlalchemy.engine.Engine:base.py:1904 [raw sql] ()\nINFO     sqlalchemy.engine.Engine:base.py:1899 \nDROP TABLE booking\nINFO     sqlalchemy.engine.Engine:base.py:1904 [no key 0.00006s] ()\nINFO     sqlalchemy.engine.Engine:base.py:1899 \nDROP TABLE multi_pk\nINFO     sqlalchemy.engine.Engine:base.py:1904 [no key 0.00006s] ()\nINFO     sqlalchemy.engine.Engine:base.py:1899 \nDROP TABLE projects_participants_association\nINFO     sqlalchemy.engine.Engine:base.py:1904 [no key 0.00005s] ()\nINFO     sqlalchemy.engine.Engine:base.py:1899 \nDROP TABLE model_test_with_timestamp\nINFO     sqlalchemy.engine.Engine:base.py:1904 [no key 0.00005s] ()\nINFO     sqlalchemy.engine.Engine:base.py:1899 \nDROP TABLE test\nINFO     sqlalchemy.engine.Engine:base.py:1904 [no key 0.00006s] ()\nINFO     sqlalchemy.engine.Engine:base.py:1899 \nDROP TABLE participants\nINFO     sqlalchemy.engine.Engine:base.py:1904 [no key 0.00005s] ()\nINFO     sqlalchemy.engine.Engine:base.py:1899 \nDROP TABLE projects\nINFO     sqlalchemy.engine.Engine:base.py:1904 [no key 0.00005s] ()\nINFO     sqlalchemy.engine.Engine:base.py:1899 \nDROP TABLE tier\nINFO     sqlalchemy.engine.Engine:base.py:1904 [no key 0.00005s] ()\nINFO     sqlalchemy.engine.Engine:base.py:1899 \nDROP TABLE category\nINFO     sqlalchemy.engine.Engine:base.py:1904 [no key 0.00005s] ()\nINFO     sqlalchemy.engine.Engine:base.py:1143 COMMIT\n----------- generated xml file: /opt/receipts/reports/agent1-25.xml ------------\n=========================== short test summary info ============================\nFAILED tests/sqlalchemy/crud/test_get_joined.py::test_get_joined_nested_no_prefix_provided\n!!!!!!!!!!!!!!!!!!!!!!!!!! stopping after 1 failures !!!!!!!!!!!!!!!!!!!!!!!!!!!\n============================== 1 failed in 0.11s ===============================\n","stderr_tail":"","stdout_sha256":"6ca7f4a1bc82b4007704e44e451eb97bd6d50505a55677d6f63a06ea0a73b0c4","log_path":"~/dev/nebius-hackathon/pilot/v2-P/igorbenav__fastcrud-69/runs/pilot-igorbenav__fastcrud-69-e8d0d0ccb6/logs/agent1/agent1-25.log","tree_digest":"e6b7a7c009f59eacbd3550ce36480efa9bf2f4b959ea42584e7e8972baeb9350","tree_download_s":2.388580792117864,"started_at":"2026-10-03T17:52:07.768459Z","duration_s":1.777327,"timed_out":false,"image_before":"a2f5741f-85bb-4955-afb1-0ae4a1aeb205","image_after":"bf710354-84ae-4964-a512-76d9881dc69a","junit":{"passed":[],"failed":["tests/sqlalchemy/crud/test_get_joined.py::test_get_joined_nested_no_prefix_provided"],"errors":[],"skipped":[],"collection_errors":[],"failure_text":{"tests/sqlalchemy/crud/test_get_joined.py::test_get_joined_nested_no_prefix_provided":"AssertionError: Expected 'name' field inside nested 'tier' dictionary.\nassert 'name' in {'id': 1}\nasync_session = <sqlalchemy.orm.session.AsyncSession object at 0x7ffff433c7f0>\ntest_data = [{'category_id': 1, 'id': 1, 'name': 'Charlie', 'tier_id': 1}, {'category_id': 1, 'id': 2, 'name': 'Alice', 'tier_id':...ategory_id': 1, 'id': 5, 'name': 'Eve', 'tier_id': 1}, {'category_id': 2, 'id': 6, 'name': 'Frank', 'tier_id': 2}, ...]\ntest_data_tier = [{'id': 1, 'name': 'Premium'}, {'id': 2, 'name': 'Basic'}]\n\n    @pytest.mark.asyncio\n    async def test_get_joined_nested_no_prefix_provided(\n        async_session, test_data, test_data_tier\n    ):\n        for tier_item in test_data_tier:\n            async_session.add(TierModel(**tier_item))\n        await async_session.commit()\n    \n        for user_item in test_data:\n            async_session.add(ModelTest(**user_item))\n        await async_session.commit()\n    \n        crud = FastCRUD(ModelTest)\n        result = await crud.get_joined(\n            db=async_session,\n            join_model=TierModel,\n            schema_to_select=CreateSchemaTest,\n            join_schema_to_select=TierSchemaTest,\n            nest_joins=True,\n        )\n    \n        assert result is not None, \"No result returned, expected a nested join result.\"\n        assert \"name\" in result, \"Expected primary model field 'name' in result.\"\n>       assert (\n            \"name\" in result[TierModel.__tablename__]\n        ), f\"Expected 'name' field inside nested '{TierModel.__tablename__}' dictionary.\"\nE       AssertionError: Expected 'name' field inside nested 'tier' dictionary.\nE       assert 'name' in {'id': 1}\n\ntests/sqlalchemy/crud/test_get_joined.py:493: AssertionError"}},"diff":null,"patch_sha256":null,"dropped_paths":[],"snapshot_sha":null}
{"receipt_id":"agent1-26","seq":26,"branch_id":"agent1","kind":"command","cmd":"grep -n \"def get_joined\" fastcrud/crud/fast_crud.py","path":null,"exit_code":0,"stdout_tail":"691:    async def get_joined(\n","stderr_tail":"","stdout_sha256":"f0cefad0664f07f7c64543c8b414ca747b534f7548dd444e4ff61c50cd460814","log_path":"~/dev/nebius-hackathon/pilot/v2-P/igorbenav__fastcrud-69/runs/pilot-igorbenav__fastcrud-69-e8d0d0ccb6/logs/agent1/agent1-26.log","tree_digest":null,"tree_download_s":null,"started_at":"2026-10-03T17:52:17.869910Z","duration_s":0.0032430000000000002,"timed_out":false,"image_before":"bf710354-84ae-4964-a512-76d9881dc69a","image_after":"bfbf3c7d-17e5-4ae9-831a-c93a552a55a3","junit":null,"diff":null,"patch_sha256":null,"dropped_paths":[],"snapshot_sha":null}
{"receipt_id":"agent1-27","seq":27,"branch_id":"agent1","kind":"write","cmd":"/opt/receipts-246808e5345040fcb42fa5302970ab8a/bin/busybox sh -c 'mkdir -p /fastcrud/fastcrud/crud && cp /opt/receipts-246808e5345040fcb42fa5302970ab8a/incoming/19d547048c921e205c9fa16b89a81e9c223b40cc2e4b55aa41a84a501ea0ebe0 /fastcrud/fastcrud/crud/fast_crud.py'","path":"fastcrud/crud/fast_crud.py","exit_code":0,"stdout_tail":"","stderr_tail":"","stdout_sha256":"19d547048c921e205c9fa16b89a81e9c223b40cc2e4b55aa41a84a501ea0ebe0","log_path":"~/dev/nebius-hackathon/pilot/v2-P/igorbenav__fastcrud-69/runs/pilot-igorbenav__fastcrud-69-e8d0d0ccb6/logs/agent1/agent1-27.log","tree_digest":null,"tree_download_s":null,"started_at":"2026-10-03T17:52:28.317181Z","duration_s":0.00564,"timed_out":false,"image_before":"bfbf3c7d-17e5-4ae9-831a-c93a552a55a3","image_after":"4e835ce8-6999-41a9-a528-356319aa6bbf","junit":null,"diff":null,"patch_sha256":null,"dropped_paths":[],"snapshot_sha":null}
{"receipt_id":"agent1-28","seq":28,"branch_id":"agent1","kind":"diff","cmd":"compute patch in executor staging agent1-53d142e5e74440f692cacd66f87c4f39: /opt/homebrew/Cellar/git/2.53.0/bin/git -c core.hooksPath=/dev/null -c core.attributesFile=/dev/null -c diff.external= -c core.quotePath=false add -A && /opt/homebrew/Cellar/git/2.53.0/bin/git -c core.hooksPath=/dev/null -c core.attributesFile=/dev/null -c diff.external= -c core.quotePath=false diff --cached --binary --no-ext-diff --no-textconv --no-renames eb5d8bdbf3757f6219fbabe9f9af778ad39458bb","path":null,"exit_code":0,"stdout_tail":"diff --git a/fastcrud/crud/fast_crud.py b/fastcrud/crud/fast_crud.py\nindex f813407..c6d7063 100644\n--- a/fastcrud/crud/fast_crud.py\n+++ b/fastcrud/crud/fast_crud.py\n@@ -921,7 +921,7 @@ class FastCRUD(\n             join_select = _extract_matching_columns_from_schema(\n                 model=join.model,\n                 schema=join.schema_to_select,\n-                prefix=join.join_prefix,\n+                prefix=effective_prefix,\n                 alias=join.alias,\n             )\n \n@@ -1240,10 +1240,16 @@ class FastCRUD(\n                 else None\n             )\n \n+            # Determine effective prefix for column selection to avoid conflicts\n+            # If no explicit prefix provided, use table name + \"_\" to ensure uniqueness\n+            effective_prefix = join.join_prefix\n+            if effective_prefix is None:\n+                effective_prefix = join.model.__tablename__ + \"_\"\n+            \n             join_select = _extract_matching_columns_from_schema(\n                 model=join.model,\n                 schema=join.schema_to_select,\n-                prefix=join.join_prefix,\n+                prefix=effective_prefix,\n                 alias=join.alias,\n             )\n \ndiff --git a/fastcrud/crud/helper.py b/fastcrud/crud/helper.py\nindex ad25fbf..c8f0449 100644\n--- a/fastcrud/crud/helper.py\n+++ b/fastcrud/crud/helper.py\n@@ -108,9 +108,18 @@ def _nest_join_data(\n     for key, value in data.items():\n         nested = False\n         for join in join_definitions:\n-            if join.join_prefix and key.startswith(join.join_prefix):\n-                nested_key = join.join_prefix.rstrip(\"_\")\n-                nested_field = key[len(join.join_prefix) :]\n+            # Determine what prefix was used for this join during column selection\n+            if join.join_prefix is not None:\n+                # Explicit prefix was provided\n+                prefix_to_check = join.join_prefix\n+                nested_key = join.join_prefix.rstrip(\"_\") if join.join_prefix else join.model.__tablename__\n+            else:\n+                # No explicit prefix, we used table_name + \"_\" as effective prefix\n+                prefix_to_check = join.model.__tablename__ + \"_\"\n+                nested_key = join.model.__tablename__\n+                \n+            if prefix_to_check and key.startswith(prefix_to_check):\n+                nested_field = key[len(prefix_to_check) :]\n                 if nested_key not in nested_data:\n                     nested_data[nested_key] = {}\n                 nested_data[nested_key][nested_field] = value\n","stderr_tail":"","stdout_sha256":"3d6f4e440c970686a22ca3578115002ae68eaee3c9b6be3e12b7ea72b1cabbb7","log_path":null,"tree_digest":"5432e05bd82aa7e2a87bcf7d51e7fbffab5367dc30626e5ba54797c19d808c11","tree_download_s":1.624304125085473,"started_at":"2026-10-03T17:52:45.438097Z","duration_s":0.02827487513422966,"timed_out":false,"image_before":"4e835ce8-6999-41a9-a528-356319aa6bbf","image_after":"4e835ce8-6999-41a9-a528-356319aa6bbf","junit":null,"diff":{"files":[{"path":"fastcrud/crud/fast_crud.py","added":8,"deleted":2,"category":"source","status":"modified"},{"path":"fastcrud/crud/helper.py","added":12,"deleted":3,"category":"source","status":"modified"}],"patch_sha256":"3d6f4e440c970686a22ca3578115002ae68eaee3c9b6be3e12b7ea72b1cabbb7","patch_path":"~/dev/nebius-hackathon/pilot/v2-P/igorbenav__fastcrud-69/runs/pilot-igorbenav__fastcrud-69-e8d0d0ccb6/artifacts/agent1/agent1-28.patch"},"patch_sha256":"3d6f4e440c970686a22ca3578115002ae68eaee3c9b6be3e12b7ea72b1cabbb7","dropped_paths":[],"snapshot_sha":"eb5d8bdbf3757f6219fbabe9f9af778ad39458bb"}
{"receipt_id":"agent1-29","seq":29,"branch_id":"agent1","kind":"write","cmd":"/opt/receipts-d64fa09f75c243c5b6d9a161dd8ac386/bin/busybox sh -c 'mkdir -p /fastcrud/fastcrud/crud && cp /opt/receipts-d64fa09f75c243c5b6d9a161dd8ac386/incoming/7d312c082e14a9888cb77e73c7332fab02007a20592f4a8fdd4e9d04b02ca0c6 /fastcrud/fastcrud/crud/fast_crud.py'","path":"fastcrud/crud/fast_crud.py","exit_code":0,"stdout_tail":"","stderr_tail":"","stdout_sha256":"7d312c082e14a9888cb77e73c7332fab02007a20592f4a8fdd4e9d04b02ca0c6","log_path":"~/dev/nebius-hackathon/pilot/v2-P/igorbenav__fastcrud-69/runs/pilot-igorbenav__fastcrud-69-e8d0d0ccb6/logs/agent1/agent1-29.log","tree_digest":null,"tree_download_s":null,"started_at":"2026-10-03T17:53:11.234271Z","duration_s":0.004784999999999999,"timed_out":false,"image_before":"4e835ce8-6999-41a9-a528-356319aa6bbf","image_after":"0042ea5e-b7a4-43f5-8e19-aa7505837f18","junit":null,"diff":null,"patch_sha256":null,"dropped_paths":[],"snapshot_sha":null}
{"receipt_id":"agent1-30","seq":30,"branch_id":"agent1","kind":"command","cmd":"/opt/receipts-cbc915eea03e4cf3b89632c4620a3bee/bin/busybox mkdir -p /opt/receipts/reports && python -I /opt/receipts-cbc915eea03e4cf3b89632c4620a3bee/receipts_pytest.py tests/sqlalchemy/crud/test_get_joined.py::test_get_joined_nested_no_prefix_provided -xvs -o junit_family=xunit1 -p no:cacheprovider -rA --continue-on-collection-errors --junitxml=/opt/receipts/reports/agent1-30.xml","path":null,"exit_code":0,"stdout_tail":"me VARCHAR, \n\ttier_id INTEGER, \n\tcategory_id INTEGER, \n\tis_deleted BOOLEAN, \n\tdeleted_at DATETIME, \n\tupdated_at DATETIME NOT NULL, \n\tPRIMARY KEY (id), \n\tFOREIGN KEY(tier_id) REFERENCES tier (id), \n\tFOREIGN KEY(category_id) REFERENCES category (id)\n)\n\n\nINFO     sqlalchemy.engine.Engine:base.py:1904 [no key 0.00007s] ()\nINFO     sqlalchemy.engine.Engine:base.py:1899 \nCREATE TABLE projects_participants_association (\n\tproject_id INTEGER NOT NULL, \n\tparticipant_id INTEGER NOT NULL, \n\tPRIMARY KEY (project_id, participant_id), \n\tFOREIGN KEY(project_id) REFERENCES projects (id), \n\tFOREIGN KEY(participant_id) REFERENCES participants (id)\n)\n\n\nINFO     sqlalchemy.engine.Engine:base.py:1904 [no key 0.00007s] ()\nINFO     sqlalchemy.engine.Engine:base.py:1899 \nCREATE TABLE multi_pk (\n\tid INTEGER NOT NULL, \n\tuuid VARCHAR(32) NOT NULL, \n\tname VARCHAR, \n\ttest_id INTEGER, \n\tPRIMARY KEY (id, uuid), \n\tUNIQUE (name), \n\tFOREIGN KEY(test_id) REFERENCES test (id)\n)\n\n\nINFO     sqlalchemy.engine.Engine:base.py:1904 [no key 0.00007s] ()\nINFO     sqlalchemy.engine.Engine:base.py:1899 \nCREATE TABLE booking (\n\tid INTEGER NOT NULL, \n\towner_id INTEGER NOT NULL, \n\tuser_id INTEGER NOT NULL, \n\tbooking_date DATETIME NOT NULL, \n\tPRIMARY KEY (id), \n\tFOREIGN KEY(owner_id) REFERENCES test (id), \n\tFOREIGN KEY(user_id) REFERENCES test (id)\n)\n\n\nINFO     sqlalchemy.engine.Engine:base.py:1904 [no key 0.00008s] ()\nINFO     sqlalchemy.engine.Engine:base.py:1143 COMMIT\n------------------------------ Captured log call -------------------------------\nINFO     sqlalchemy.engine.Engine:base.py:1094 BEGIN (implicit)\nINFO     sqlalchemy.engine.Engine:base.py:1899 INSERT INTO tier (id, name) VALUES (?, ?)\nINFO     sqlalchemy.engine.Engine:base.py:1904 [generated in 0.00014s] [(1, 'Premium'), (2, 'Basic')]\nINFO     sqlalchemy.engine.Engine:base.py:1143 COMMIT\nINFO     sqlalchemy.engine.Engine:base.py:1094 BEGIN (implicit)\nINFO     sqlalchemy.engine.Engine:base.py:1899 INSERT INTO test (id, name, tier_id, category_id, is_deleted, deleted_at) VALUES (?, ?, ?, ?, ?, ?)\nINFO     sqlalchemy.engine.Engine:base.py:1904 [generated in 0.00018s] [(1, 'Charlie', 1, 1, 0, None), (2, 'Alice', 2, 1, 0, None), (3, 'Bob', 1, 2, 0, None), (4, 'David', 2, 1, 0, None), (5, 'Eve', 1, 1, 0, None), (6, 'Frank', 2, 2, 0, None), (7, 'Grace', 1, 2, 0, None), (8, 'Hannah', 2, 1, 0, None)  ... displaying 10 of 11 total bound parameter sets ...  (10, 'Judy', 2, 2, 0, None), (11, 'Alice', 1, 1, 0, None)]\nINFO     sqlalchemy.engine.Engine:base.py:1143 COMMIT\nINFO     sqlalchemy.engine.Engine:base.py:1094 BEGIN (implicit)\nINFO     sqlalchemy.engine.Engine:base.py:1899 SELECT test.name, test.tier_id, test.category_id, tier.name AS tier_name \nFROM test LEFT OUTER JOIN tier ON tier.id = test.tier_id\nINFO     sqlalchemy.engine.Engine:base.py:1904 [generated in 0.00011s] ()\n---------------------------- Captured log teardown -----------------------------\nINFO     sqlalchemy.engine.Engine:base.py:1126 ROLLBACK\nINFO     sqlalchemy.engine.Engine:base.py:1094 BEGIN (implicit)\nINFO     sqlalchemy.engine.Engine:base.py:1899 PRAGMA main.table_info(\"multi_pk\")\nINFO     sqlalchemy.engine.Engine:base.py:1904 [raw sql] ()\nINFO     sqlalchemy.engine.Engine:base.py:1899 PRAGMA main.table_info(\"category\")\nINFO     sqlalchemy.engine.Engine:base.py:1904 [raw sql] ()\nINFO     sqlalchemy.engine.Engine:base.py:1899 PRAGMA main.table_info(\"test\")\nINFO     sqlalchemy.engine.Engine:base.py:1904 [raw sql] ()\nINFO     sqlalchemy.engine.Engine:base.py:1899 PRAGMA main.table_info(\"model_test_with_timestamp\")\nINFO     sqlalchemy.engine.Engine:base.py:1904 [raw sql] ()\nINFO     sqlalchemy.engine.Engine:base.py:1899 PRAGMA main.table_info(\"tier\")\nINFO     sqlalchemy.engine.Engine:base.py:1904 [raw sql] ()\nINFO     sqlalchemy.engine.Engine:base.py:1899 PRAGMA main.table_info(\"booking\")\nINFO     sqlalchemy.engine.Engine:base.py:1904 [raw sql] ()\nINFO     sqlalchemy.engine.Engine:base.py:1899 PRAGMA main.table_info(\"projects\")\nINFO     sqlalchemy.engine.Engine:base.py:1904 [raw sql] ()\nINFO     sqlalchemy.engine.Engine:base.py:1899 PRAGMA main.table_info(\"participants\")\nINFO     sqlalchemy.engine.Engine:base.py:1904 [raw sql] ()\nINFO     sqlalchemy.engine.Engine:base.py:1899 PRAGMA main.table_info(\"projects_participants_association\")\nINFO     sqlalchemy.engine.Engine:base.py:1904 [raw sql] ()\nINFO     sqlalchemy.engine.Engine:base.py:1899 \nDROP TABLE booking\nINFO     sqlalchemy.engine.Engine:base.py:1904 [no key 0.00008s] ()\nINFO     sqlalchemy.engine.Engine:base.py:1899 \nDROP TABLE multi_pk\nINFO     sqlalchemy.engine.Engine:base.py:1904 [no key 0.00006s] ()\nINFO     sqlalchemy.engine.Engine:base.py:1899 \nDROP TABLE projects_participants_association\nINFO     sqlalchemy.engine.Engine:base.py:1904 [no key 0.00007s] ()\nINFO     sqlalchemy.engine.Engine:base.py:1899 \nDROP TABLE model_test_with_timestamp\nINFO     sqlalchemy.engine.Engine:base.py:1904 [no key 0.00006s] ()\nINFO     sqlalchemy.engine.Engine:base.py:1899 \nDROP TABLE test\nINFO     sqlalchemy.engine.Engine:base.py:1904 [no key 0.00007s] ()\nINFO     sqlalchemy.engine.Engine:base.py:1899 \nDROP TABLE participants\nINFO     sqlalchemy.engine.Engine:base.py:1904 [no key 0.00008s] ()\nINFO     sqlalchemy.engine.Engine:base.py:1899 \nDROP TABLE projects\nINFO     sqlalchemy.engine.Engine:base.py:1904 [no key 0.00006s] ()\nINFO     sqlalchemy.engine.Engine:base.py:1899 \nDROP TABLE tier\nINFO     sqlalchemy.engine.Engine:base.py:1904 [no key 0.00006s] ()\nINFO     sqlalchemy.engine.Engine:base.py:1899 \nDROP TABLE category\nINFO     sqlalchemy.engine.Engine:base.py:1904 [no key 0.00006s] ()\nINFO     sqlalchemy.engine.Engine:base.py:1143 COMMIT\n----------- generated xml file: /opt/receipts/reports/agent1-30.xml ------------\n=========================== short test summary info ============================\nPASSED tests/sqlalchemy/crud/test_get_joined.py::test_get_joined_nested_no_prefix_provided\n============================== 1 passed in 0.07s ===============================\n","stderr_tail":"","stdout_sha256":"5c6f36fa28356d57f27ca7214c3dc415922626d6c34aeb072d634034440e0dff","log_path":"~/dev/nebius-hackathon/pilot/v2-P/igorbenav__fastcrud-69/runs/pilot-igorbenav__fastcrud-69-e8d0d0ccb6/logs/agent1/agent1-30.log","tree_digest":"0dc7451e4a87b959b7c36d52e44af5609db304c2ec5a51ff6b0e054c2f71cd22","tree_download_s":2.3812100421637297,"started_at":"2026-10-03T17:53:14.335916Z","duration_s":1.71892,"timed_out":false,"image_before":"0042ea5e-b7a4-43f5-8e19-aa7505837f18","image_after":"d91a6534-0642-483d-9abe-469051cac088","junit":{"passed":["tests/sqlalchemy/crud/test_get_joined.py::test_get_joined_nested_no_prefix_provided"],"failed":[],"errors":[],"skipped":[],"collection_errors":[],"failure_text":{}},"diff":null,"patch_sha256":null,"dropped_paths":[],"snapshot_sha":null}
{"receipt_id":"agent1-31","seq":31,"branch_id":"agent1","kind":"command","cmd":"/opt/receipts-3ff00185588a4617b73c9ee162d7ec50/bin/busybox mkdir -p /opt/receipts/reports && python -I /opt/receipts-3ff00185588a4617b73c9ee162d7ec50/receipts_pytest.py tests/sqlmodel/crud/test_get_multi_joined.py::test_get_multi_joined_no_prefix_nested -xvs -o junit_family=xunit1 -p no:cacheprovider -rA --continue-on-collection-errors --junitxml=/opt/receipts/reports/agent1-31.xml","path":null,"exit_code":0,"stdout_tail":"NFO     sqlalchemy.engine.Engine:base.py:1899 \nCREATE TABLE projects_participants_association (\n\tproject_id INTEGER NOT NULL, \n\tparticipant_id INTEGER NOT NULL, \n\tPRIMARY KEY (project_id, participant_id), \n\tFOREIGN KEY(project_id) REFERENCES projects (id), \n\tFOREIGN KEY(participant_id) REFERENCES participants (id)\n)\n\n\nINFO     sqlalchemy.engine.Engine:base.py:1904 [no key 0.00005s] ()\nINFO     sqlalchemy.engine.Engine:base.py:1899 \nCREATE TABLE multi_pk (\n\tid INTEGER NOT NULL, \n\tuuid VARCHAR(25) NOT NULL, \n\tname VARCHAR NOT NULL, \n\ttest_id INTEGER, \n\tPRIMARY KEY (id, uuid), \n\tFOREIGN KEY(test_id) REFERENCES test (id)\n)\n\n\nINFO     sqlalchemy.engine.Engine:base.py:1904 [no key 0.00006s] ()\nINFO     sqlalchemy.engine.Engine:base.py:1899 CREATE INDEX ix_multi_pk_name ON multi_pk (name)\nINFO     sqlalchemy.engine.Engine:base.py:1904 [no key 0.00005s] ()\nINFO     sqlalchemy.engine.Engine:base.py:1899 \nCREATE TABLE booking (\n\tid INTEGER NOT NULL, \n\towner_id INTEGER NOT NULL, \n\tuser_id INTEGER NOT NULL, \n\tbooking_date DATETIME NOT NULL, \n\tPRIMARY KEY (id), \n\tFOREIGN KEY(owner_id) REFERENCES test (id), \n\tFOREIGN KEY(user_id) REFERENCES test (id)\n)\n\n\nINFO     sqlalchemy.engine.Engine:base.py:1904 [no key 0.00006s] ()\nINFO     sqlalchemy.engine.Engine:base.py:1143 COMMIT\n------------------------------ Captured log call -------------------------------\nINFO     sqlalchemy.engine.Engine:base.py:1094 BEGIN (implicit)\nINFO     sqlalchemy.engine.Engine:base.py:1899 INSERT INTO tier (id, name) VALUES (?, ?)\nINFO     sqlalchemy.engine.Engine:base.py:1904 [generated in 0.00021s] [(1, 'Premium'), (2, 'Basic')]\nINFO     sqlalchemy.engine.Engine:base.py:1143 COMMIT\nINFO     sqlalchemy.engine.Engine:base.py:1094 BEGIN (implicit)\nINFO     sqlalchemy.engine.Engine:base.py:1899 INSERT INTO test (id, name, tier_id, category_id, is_deleted, deleted_at) VALUES (?, ?, ?, ?, ?, ?)\nINFO     sqlalchemy.engine.Engine:base.py:1904 [generated in 0.00013s] [(1, 'Charlie', 1, 1, 0, None), (2, 'Alice', 2, 1, 0, None), (3, 'Bob', 1, 2, 0, None), (4, 'David', 2, 1, 0, None), (5, 'Eve', 1, 1, 0, None), (6, 'Frank', 2, 2, 0, None), (7, 'Grace', 1, 2, 0, None), (8, 'Hannah', 2, 1, 0, None)  ... displaying 10 of 11 total bound parameter sets ...  (10, 'Judy', 2, 2, 0, None), (11, 'Alice', 1, 1, 0, None)]\nINFO     sqlalchemy.engine.Engine:base.py:1143 COMMIT\nINFO     sqlalchemy.engine.Engine:base.py:1094 BEGIN (implicit)\nINFO     sqlalchemy.engine.Engine:base.py:1899 SELECT test.name, test.tier_id, tier.name AS tier_name \nFROM test LEFT OUTER JOIN tier ON test.tier_id = tier.id\n LIMIT ? OFFSET ?\nINFO     sqlalchemy.engine.Engine:base.py:1904 [generated in 0.00011s] (10, 0)\nINFO     sqlalchemy.engine.Engine:base.py:1899 SELECT count(*) AS count_1 \nFROM test\nINFO     sqlalchemy.engine.Engine:base.py:1904 [generated in 0.00009s] ()\n---------------------------- Captured log teardown -----------------------------\nINFO     sqlalchemy.engine.Engine:base.py:1126 ROLLBACK\nINFO     sqlalchemy.engine.Engine:base.py:1094 BEGIN (implicit)\nINFO     sqlalchemy.engine.Engine:base.py:1899 PRAGMA main.table_info(\"multi_pk\")\nINFO     sqlalchemy.engine.Engine:base.py:1904 [raw sql] ()\nINFO     sqlalchemy.engine.Engine:base.py:1899 PRAGMA main.table_info(\"category\")\nINFO     sqlalchemy.engine.Engine:base.py:1904 [raw sql] ()\nINFO     sqlalchemy.engine.Engine:base.py:1899 PRAGMA main.table_info(\"test\")\nINFO     sqlalchemy.engine.Engine:base.py:1904 [raw sql] ()\nINFO     sqlalchemy.engine.Engine:base.py:1899 PRAGMA main.table_info(\"model_test_with_timestamp\")\nINFO     sqlalchemy.engine.Engine:base.py:1904 [raw sql] ()\nINFO     sqlalchemy.engine.Engine:base.py:1899 PRAGMA main.table_info(\"tier\")\nINFO     sqlalchemy.engine.Engine:base.py:1904 [raw sql] ()\nINFO     sqlalchemy.engine.Engine:base.py:1899 PRAGMA main.table_info(\"projects_participants_association\")\nINFO     sqlalchemy.engine.Engine:base.py:1904 [raw sql] ()\nINFO     sqlalchemy.engine.Engine:base.py:1899 PRAGMA main.table_info(\"projects\")\nINFO     sqlalchemy.engine.Engine:base.py:1904 [raw sql] ()\nINFO     sqlalchemy.engine.Engine:base.py:1899 PRAGMA main.table_info(\"participants\")\nINFO     sqlalchemy.engine.Engine:base.py:1904 [raw sql] ()\nINFO     sqlalchemy.engine.Engine:base.py:1899 PRAGMA main.table_info(\"booking\")\nINFO     sqlalchemy.engine.Engine:base.py:1904 [raw sql] ()\nINFO     sqlalchemy.engine.Engine:base.py:1899 \nDROP TABLE booking\nINFO     sqlalchemy.engine.Engine:base.py:1904 [no key 0.00006s] ()\nINFO     sqlalchemy.engine.Engine:base.py:1899 \nDROP TABLE multi_pk\nINFO     sqlalchemy.engine.Engine:base.py:1904 [no key 0.00006s] ()\nINFO     sqlalchemy.engine.Engine:base.py:1899 \nDROP TABLE projects_participants_association\nINFO     sqlalchemy.engine.Engine:base.py:1904 [no key 0.00005s] ()\nINFO     sqlalchemy.engine.Engine:base.py:1899 \nDROP TABLE model_test_with_timestamp\nINFO     sqlalchemy.engine.Engine:base.py:1904 [no key 0.00005s] ()\nINFO     sqlalchemy.engine.Engine:base.py:1899 \nDROP TABLE test\nINFO     sqlalchemy.engine.Engine:base.py:1904 [no key 0.00005s] ()\nINFO     sqlalchemy.engine.Engine:base.py:1899 \nDROP TABLE participants\nINFO     sqlalchemy.engine.Engine:base.py:1904 [no key 0.00005s] ()\nINFO     sqlalchemy.engine.Engine:base.py:1899 \nDROP TABLE projects\nINFO     sqlalchemy.engine.Engine:base.py:1904 [no key 0.00005s] ()\nINFO     sqlalchemy.engine.Engine:base.py:1899 \nDROP TABLE tier\nINFO     sqlalchemy.engine.Engine:base.py:1904 [no key 0.00005s] ()\nINFO     sqlalchemy.engine.Engine:base.py:1899 \nDROP TABLE category\nINFO     sqlalchemy.engine.Engine:base.py:1904 [no key 0.00005s] ()\nINFO     sqlalchemy.engine.Engine:base.py:1143 COMMIT\n----------- generated xml file: /opt/receipts/reports/agent1-31.xml ------------\n=========================== short test summary info ============================\nPASSED tests/sqlmodel/crud/test_get_multi_joined.py::test_get_multi_joined_no_prefix_nested\n============================== 1 passed in 0.09s ===============================\n","stderr_tail":"","stdout_sha256":"aa8dd67a79ea2e4bdccea4b52c1deddbd88185ee995445ed15e8f2f4dae02769","log_path":"~/dev/nebius-hackathon/pilot/v2-P/igorbenav__fastcrud-69/runs/pilot-igorbenav__fastcrud-69-e8d0d0ccb6/logs/agent1/agent1-31.log","tree_digest":"0dc7451e4a87b959b7c36d52e44af5609db304c2ec5a51ff6b0e054c2f71cd22","tree_download_s":2.291993541875854,"started_at":"2026-10-03T17:53:25.095020Z","duration_s":1.800589,"timed_out":false,"image_before":"d91a6534-0642-483d-9abe-469051cac088","image_after":"2455310a-5175-4348-8525-f916a080d87c","junit":{"passed":["tests/sqlmodel/crud/test_get_multi_joined.py::test_get_multi_joined_no_prefix_nested"],"failed":[],"errors":[],"skipped":[],"collection_errors":[],"failure_text":{}},"diff":null,"patch_sha256":null,"dropped_paths":[],"snapshot_sha":null}
{"receipt_id":"agent1-32","seq":32,"branch_id":"agent1","kind":"command","cmd":"/opt/receipts-4b17cfbaaaee456aa006e4a73adbed95/bin/busybox mkdir -p /opt/receipts/reports && python -I /opt/receipts-4b17cfbaaaee456aa006e4a73adbed95/receipts_pytest.py tests/sqlalchemy/crud/test_get_joined.py::test_get_joined_nested_no_prefix_provided tests/sqlalchemy/crud/test_get_multi_joined.py::test_get_multi_joined_no_prefix_nested tests/sqlmodel/crud/test_get_multi_joined.py::test_get_multi_joined_no_prefix_nested -v -o junit_family=xunit1 -p no:cacheprovider -rA --continue-on-collection-errors --junitxml=/opt/receipts/reports/agent1-32.xml","path":null,"exit_code":0,"stdout_tail":"ry\")\n2026-10-03 17:53:38,681 INFO sqlalchemy.engine.Engine [raw sql] ()\n2026-10-03 17:53:38,681 INFO sqlalchemy.engine.Engine PRAGMA main.table_info(\"test\")\n2026-10-03 17:53:38,681 INFO sqlalchemy.engine.Engine [raw sql] ()\n2026-10-03 17:53:38,682 INFO sqlalchemy.engine.Engine PRAGMA main.table_info(\"model_test_with_timestamp\")\n2026-10-03 17:53:38,682 INFO sqlalchemy.engine.Engine [raw sql] ()\n2026-10-03 17:53:38,682 INFO sqlalchemy.engine.Engine PRAGMA main.table_info(\"tier\")\n2026-10-03 17:53:38,682 INFO sqlalchemy.engine.Engine [raw sql] ()\n2026-10-03 17:53:38,682 INFO sqlalchemy.engine.Engine PRAGMA main.table_info(\"projects_participants_association\")\n2026-10-03 17:53:38,683 INFO sqlalchemy.engine.Engine [raw sql] ()\n2026-10-03 17:53:38,683 INFO sqlalchemy.engine.Engine PRAGMA main.table_info(\"projects\")\n2026-10-03 17:53:38,683 INFO sqlalchemy.engine.Engine [raw sql] ()\n2026-10-03 17:53:38,683 INFO sqlalchemy.engine.Engine PRAGMA main.table_info(\"participants\")\n2026-10-03 17:53:38,683 INFO sqlalchemy.engine.Engine [raw sql] ()\n2026-10-03 17:53:38,684 INFO sqlalchemy.engine.Engine PRAGMA main.table_info(\"booking\")\n2026-10-03 17:53:38,684 INFO sqlalchemy.engine.Engine [raw sql] ()\n2026-10-03 17:53:38,684 INFO sqlalchemy.engine.Engine \nDROP TABLE booking\n2026-10-03 17:53:38,684 INFO sqlalchemy.engine.Engine [no key 0.00010s] ()\n2026-10-03 17:53:38,685 INFO sqlalchemy.engine.Engine \nDROP TABLE multi_pk\n2026-10-03 17:53:38,685 INFO sqlalchemy.engine.Engine [no key 0.00009s] ()\n2026-10-03 17:53:38,685 INFO sqlalchemy.engine.Engine \nDROP TABLE projects_participants_association\n2026-10-03 17:53:38,685 INFO sqlalchemy.engine.Engine [no key 0.00009s] ()\n2026-10-03 17:53:38,685 INFO sqlalchemy.engine.Engine \nDROP TABLE model_test_with_timestamp\n2026-10-03 17:53:38,685 INFO sqlalchemy.engine.Engine [no key 0.00009s] ()\n2026-10-03 17:53:38,686 INFO sqlalchemy.engine.Engine \nDROP TABLE test\n2026-10-03 17:53:38,686 INFO sqlalchemy.engine.Engine [no key 0.00009s] ()\n2026-10-03 17:53:38,686 INFO sqlalchemy.engine.Engine \nDROP TABLE participants\n2026-10-03 17:53:38,686 INFO sqlalchemy.engine.Engine [no key 0.00008s] ()\n2026-10-03 17:53:38,686 INFO sqlalchemy.engine.Engine \nDROP TABLE projects\n2026-10-03 17:53:38,686 INFO sqlalchemy.engine.Engine [no key 0.00009s] ()\n2026-10-03 17:53:38,687 INFO sqlalchemy.engine.Engine \nDROP TABLE tier\n2026-10-03 17:53:38,687 INFO sqlalchemy.engine.Engine [no key 0.00008s] ()\n2026-10-03 17:53:38,687 INFO sqlalchemy.engine.Engine \nDROP TABLE category\n2026-10-03 17:53:38,687 INFO sqlalchemy.engine.Engine [no key 0.00008s] ()\n2026-10-03 17:53:38,687 INFO sqlalchemy.engine.Engine COMMIT\n---------------------------- Captured log teardown -----------------------------\nINFO     sqlalchemy.engine.Engine:base.py:1126 ROLLBACK\nINFO     sqlalchemy.engine.Engine:base.py:1094 BEGIN (implicit)\nINFO     sqlalchemy.engine.Engine:base.py:1899 PRAGMA main.table_info(\"multi_pk\")\nINFO     sqlalchemy.engine.Engine:base.py:1904 [raw sql] ()\nINFO     sqlalchemy.engine.Engine:base.py:1899 PRAGMA main.table_info(\"category\")\nINFO     sqlalchemy.engine.Engine:base.py:1904 [raw sql] ()\nINFO     sqlalchemy.engine.Engine:base.py:1899 PRAGMA main.table_info(\"test\")\nINFO     sqlalchemy.engine.Engine:base.py:1904 [raw sql] ()\nINFO     sqlalchemy.engine.Engine:base.py:1899 PRAGMA main.table_info(\"model_test_with_timestamp\")\nINFO     sqlalchemy.engine.Engine:base.py:1904 [raw sql] ()\nINFO     sqlalchemy.engine.Engine:base.py:1899 PRAGMA main.table_info(\"tier\")\nINFO     sqlalchemy.engine.Engine:base.py:1904 [raw sql] ()\nINFO     sqlalchemy.engine.Engine:base.py:1899 PRAGMA main.table_info(\"projects_participants_association\")\nINFO     sqlalchemy.engine.Engine:base.py:1904 [raw sql] ()\nINFO     sqlalchemy.engine.Engine:base.py:1899 PRAGMA main.table_info(\"projects\")\nINFO     sqlalchemy.engine.Engine:base.py:1904 [raw sql] ()\nINFO     sqlalchemy.engine.Engine:base.py:1899 PRAGMA main.table_info(\"participants\")\nINFO     sqlalchemy.engine.Engine:base.py:1904 [raw sql] ()\nINFO     sqlalchemy.engine.Engine:base.py:1899 PRAGMA main.table_info(\"booking\")\nINFO     sqlalchemy.engine.Engine:base.py:1904 [raw sql] ()\nINFO     sqlalchemy.engine.Engine:base.py:1899 \nDROP TABLE booking\nINFO     sqlalchemy.engine.Engine:base.py:1904 [no key 0.00010s] ()\nINFO     sqlalchemy.engine.Engine:base.py:1899 \nDROP TABLE multi_pk\nINFO     sqlalchemy.engine.Engine:base.py:1904 [no key 0.00009s] ()\nINFO     sqlalchemy.engine.Engine:base.py:1899 \nDROP TABLE projects_participants_association\nINFO     sqlalchemy.engine.Engine:base.py:1904 [no key 0.00009s] ()\nINFO     sqlalchemy.engine.Engine:base.py:1899 \nDROP TABLE model_test_with_timestamp\nINFO     sqlalchemy.engine.Engine:base.py:1904 [no key 0.00009s] ()\nINFO     sqlalchemy.engine.Engine:base.py:1899 \nDROP TABLE test\nINFO     sqlalchemy.engine.Engine:base.py:1904 [no key 0.00009s] ()\nINFO     sqlalchemy.engine.Engine:base.py:1899 \nDROP TABLE participants\nINFO     sqlalchemy.engine.Engine:base.py:1904 [no key 0.00008s] ()\nINFO     sqlalchemy.engine.Engine:base.py:1899 \nDROP TABLE projects\nINFO     sqlalchemy.engine.Engine:base.py:1904 [no key 0.00009s] ()\nINFO     sqlalchemy.engine.Engine:base.py:1899 \nDROP TABLE tier\nINFO     sqlalchemy.engine.Engine:base.py:1904 [no key 0.00008s] ()\nINFO     sqlalchemy.engine.Engine:base.py:1899 \nDROP TABLE category\nINFO     sqlalchemy.engine.Engine:base.py:1904 [no key 0.00008s] ()\nINFO     sqlalchemy.engine.Engine:base.py:1143 COMMIT\n----------- generated xml file: /opt/receipts/reports/agent1-32.xml ------------\n=========================== short test summary info ============================\nPASSED tests/sqlalchemy/crud/test_get_joined.py::test_get_joined_nested_no_prefix_provided\nPASSED tests/sqlalchemy/crud/test_get_multi_joined.py::test_get_multi_joined_no_prefix_nested\nPASSED tests/sqlmodel/crud/test_get_multi_joined.py::test_get_multi_joined_no_prefix_nested\n============================== 3 passed in 0.21s ===============================\n","stderr_tail":"","stdout_sha256":"ea63ab0b549e44f77a64e8840f9503c9206a8ccd79385858af0aa35df55f6b28","log_path":"~/dev/nebius-hackathon/pilot/v2-P/igorbenav__fastcrud-69/runs/pilot-igorbenav__fastcrud-69-e8d0d0ccb6/logs/agent1/agent1-32.log","tree_digest":"0dc7451e4a87b959b7c36d52e44af5609db304c2ec5a51ff6b0e054c2f71cd22","tree_download_s":2.2945268750190735,"started_at":"2026-10-03T17:53:36.079070Z","duration_s":1.890697,"timed_out":false,"image_before":"2455310a-5175-4348-8525-f916a080d87c","image_after":"9d0886af-d0c4-4728-b1d0-7648e7cb38bb","junit":{"passed":["tests/sqlalchemy/crud/test_get_joined.py::test_get_joined_nested_no_prefix_provided","tests/sqlalchemy/crud/test_get_multi_joined.py::test_get_multi_joined_no_prefix_nested","tests/sqlmodel/crud/test_get_multi_joined.py::test_get_multi_joined_no_prefix_nested"],"failed":[],"errors":[],"skipped":[],"collection_errors":[],"failure_text":{}},"diff":null,"patch_sha256":null,"dropped_paths":[],"snapshot_sha":null}
{"receipt_id":"agent1-33","seq":33,"branch_id":"agent1","kind":"command","cmd":"/opt/receipts-cd347e3fd9614a8c86ed9a4a4e6fd640/bin/busybox mkdir -p /opt/receipts/reports && python -I /opt/receipts-cd347e3fd9614a8c86ed9a4a4e6fd640/receipts_pytest.py --no-header -rA --tb=line --color=no -p no:cacheprovider -W ignore::DeprecationWarning tests/sqlalchemy/crud/test_get_joined.py tests/sqlalchemy/crud/test_get_multi.py tests/sqlalchemy/crud/test_get_multi_joined.py tests/sqlmodel/crud/test_get_joined.py tests/sqlmodel/crud/test_get_multi.py tests/sqlmodel/crud/test_get_multi_joined.py -x -o junit_family=xunit1 -p no:cacheprovider -rA --continue-on-collection-errors --junitxml=/opt/receipts/reports/agent1-33.xml","path":null,"exit_code":1,"stdout_tail":"LE multi_pk\n2026-10-03 17:53:48,933 INFO sqlalchemy.engine.Engine [no key 0.00009s] ()\n2026-10-03 17:53:48,933 INFO sqlalchemy.engine.Engine \nDROP TABLE projects_participants_association\n2026-10-03 17:53:48,933 INFO sqlalchemy.engine.Engine [no key 0.00008s] ()\n2026-10-03 17:53:48,933 INFO sqlalchemy.engine.Engine \nDROP TABLE model_test_with_timestamp\n2026-10-03 17:53:48,933 INFO sqlalchemy.engine.Engine [no key 0.00008s] ()\n2026-10-03 17:53:48,934 INFO sqlalchemy.engine.Engine \nDROP TABLE test\n2026-10-03 17:53:48,934 INFO sqlalchemy.engine.Engine [no key 0.00008s] ()\n2026-10-03 17:53:48,934 INFO sqlalchemy.engine.Engine \nDROP TABLE participants\n2026-10-03 17:53:48,934 INFO sqlalchemy.engine.Engine [no key 0.00008s] ()\n2026-10-03 17:53:48,934 INFO sqlalchemy.engine.Engine \nDROP TABLE projects\n2026-10-03 17:53:48,934 INFO sqlalchemy.engine.Engine [no key 0.00008s] ()\n2026-10-03 17:53:48,935 INFO sqlalchemy.engine.Engine \nDROP TABLE tier\n2026-10-03 17:53:48,935 INFO sqlalchemy.engine.Engine [no key 0.00009s] ()\n2026-10-03 17:53:48,935 INFO sqlalchemy.engine.Engine \nDROP TABLE category\n2026-10-03 17:53:48,935 INFO sqlalchemy.engine.Engine [no key 0.00008s] ()\n2026-10-03 17:53:48,935 INFO sqlalchemy.engine.Engine COMMIT\n---------------------------- Captured log teardown -----------------------------\nINFO     sqlalchemy.engine.Engine:base.py:1126 ROLLBACK\nINFO     sqlalchemy.engine.Engine:base.py:1094 BEGIN (implicit)\nINFO     sqlalchemy.engine.Engine:base.py:1899 PRAGMA main.table_info(\"multi_pk\")\nINFO     sqlalchemy.engine.Engine:base.py:1904 [raw sql] ()\nINFO     sqlalchemy.engine.Engine:base.py:1899 PRAGMA main.table_info(\"category\")\nINFO     sqlalchemy.engine.Engine:base.py:1904 [raw sql] ()\nINFO     sqlalchemy.engine.Engine:base.py:1899 PRAGMA main.table_info(\"test\")\nINFO     sqlalchemy.engine.Engine:base.py:1904 [raw sql] ()\nINFO     sqlalchemy.engine.Engine:base.py:1899 PRAGMA main.table_info(\"model_test_with_timestamp\")\nINFO     sqlalchemy.engine.Engine:base.py:1904 [raw sql] ()\nINFO     sqlalchemy.engine.Engine:base.py:1899 PRAGMA main.table_info(\"tier\")\nINFO     sqlalchemy.engine.Engine:base.py:1904 [raw sql] ()\nINFO     sqlalchemy.engine.Engine:base.py:1899 PRAGMA main.table_info(\"booking\")\nINFO     sqlalchemy.engine.Engine:base.py:1904 [raw sql] ()\nINFO     sqlalchemy.engine.Engine:base.py:1899 PRAGMA main.table_info(\"projects\")\nINFO     sqlalchemy.engine.Engine:base.py:1904 [raw sql] ()\nINFO     sqlalchemy.engine.Engine:base.py:1899 PRAGMA main.table_info(\"participants\")\nINFO     sqlalchemy.engine.Engine:base.py:1904 [raw sql] ()\nINFO     sqlalchemy.engine.Engine:base.py:1899 PRAGMA main.table_info(\"projects_participants_association\")\nINFO     sqlalchemy.engine.Engine:base.py:1904 [raw sql] ()\nINFO     sqlalchemy.engine.Engine:base.py:1899 \nDROP TABLE booking\nINFO     sqlalchemy.engine.Engine:base.py:1904 [no key 0.00010s] ()\nINFO     sqlalchemy.engine.Engine:base.py:1899 \nDROP TABLE multi_pk\nINFO     sqlalchemy.engine.Engine:base.py:1904 [no key 0.00009s] ()\nINFO     sqlalchemy.engine.Engine:base.py:1899 \nDROP TABLE projects_participants_association\nINFO     sqlalchemy.engine.Engine:base.py:1904 [no key 0.00008s] ()\nINFO     sqlalchemy.engine.Engine:base.py:1899 \nDROP TABLE model_test_with_timestamp\nINFO     sqlalchemy.engine.Engine:base.py:1904 [no key 0.00008s] ()\nINFO     sqlalchemy.engine.Engine:base.py:1899 \nDROP TABLE test\nINFO     sqlalchemy.engine.Engine:base.py:1904 [no key 0.00008s] ()\nINFO     sqlalchemy.engine.Engine:base.py:1899 \nDROP TABLE participants\nINFO     sqlalchemy.engine.Engine:base.py:1904 [no key 0.00008s] ()\nINFO     sqlalchemy.engine.Engine:base.py:1899 \nDROP TABLE projects\nINFO     sqlalchemy.engine.Engine:base.py:1904 [no key 0.00008s] ()\nINFO     sqlalchemy.engine.Engine:base.py:1899 \nDROP TABLE tier\nINFO     sqlalchemy.engine.Engine:base.py:1904 [no key 0.00009s] ()\nINFO     sqlalchemy.engine.Engine:base.py:1899 \nDROP TABLE category\nINFO     sqlalchemy.engine.Engine:base.py:1904 [no key 0.00008s] ()\nINFO     sqlalchemy.engine.Engine:base.py:1143 COMMIT\n----------- generated xml file: /opt/receipts/reports/agent1-33.xml ------------\n=========================== short test summary info ============================\nPASSED tests/sqlalchemy/crud/test_get_joined.py::test_get_joined_basic\nPASSED tests/sqlalchemy/crud/test_get_joined.py::test_get_joined_custom_condition\nPASSED tests/sqlalchemy/crud/test_get_joined.py::test_get_joined_with_prefix\nPASSED tests/sqlalchemy/crud/test_get_joined.py::test_get_joined_different_join_types\nPASSED tests/sqlalchemy/crud/test_get_joined.py::test_get_joined_with_filters\nPASSED tests/sqlalchemy/crud/test_get_joined.py::test_update_multiple_records_allow_multiple\nPASSED tests/sqlalchemy/crud/test_get_joined.py::test_count_with_advanced_filters\nPASSED tests/sqlalchemy/crud/test_get_joined.py::test_get_joined_multiple_models\nPASSED tests/sqlalchemy/crud/test_get_joined.py::test_get_joined_with_aliases\nPASSED tests/sqlalchemy/crud/test_get_joined.py::test_get_joined_with_aliases_no_schema\nPASSED tests/sqlalchemy/crud/test_get_joined.py::test_get_joined_with_both_single_and_joins_config_raises_value_error\nPASSED tests/sqlalchemy/crud/test_get_joined.py::test_get_joined_without_join_model_or_joins_config_raises_value_error\nPASSED tests/sqlalchemy/crud/test_get_joined.py::test_get_joined_with_unsupported_join_type_raises_value_error\nPASSED tests/sqlalchemy/crud/test_get_joined.py::test_get_joined_returns_none_when_no_record_matches\nPASSED tests/sqlalchemy/crud/test_get_joined.py::test_get_joined_with_joined_model_filters\nPASSED tests/sqlalchemy/crud/test_get_joined.py::test_get_joined_nest_joins\nPASSED tests/sqlalchemy/crud/test_get_joined.py::test_get_joined_nested_no_prefix_provided\nFAILED tests/sqlalchemy/crud/test_get_joined.py::test_get_joined_no_prefix_no_nesting\n!!!!!!!!!!!!!!!!!!!!!!!!!! stopping after 1 failures !!!!!!!!!!!!!!!!!!!!!!!!!!!\n========================= 1 failed, 17 passed in 0.67s =========================\n","stderr_tail":"","stdout_sha256":"ea6a3d04de9204a13bafcae23d18107d555a034cfad5cebec87ee56482ce7555","log_path":"~/dev/nebius-hackathon/pilot/v2-P/igorbenav__fastcrud-69/runs/pilot-igorbenav__fastcrud-69-e8d0d0ccb6/logs/agent1/agent1-33.log","tree_digest":"0dc7451e4a87b959b7c36d52e44af5609db304c2ec5a51ff6b0e054c2f71cd22","tree_download_s":2.155385499820113,"started_at":"2026-10-03T17:53:45.870087Z","duration_s":2.305216,"timed_out":false,"image_before":"9d0886af-d0c4-4728-b1d0-7648e7cb38bb","image_after":"9053d39d-0725-484f-9ed0-f87f73b6b549","junit":{"passed":["tests/sqlalchemy/crud/test_get_joined.py::test_get_joined_basic","tests/sqlalchemy/crud/test_get_joined.py::test_get_joined_custom_condition","tests/sqlalchemy/crud/test_get_joined.py::test_get_joined_with_prefix","tests/sqlalchemy/crud/test_get_joined.py::test_get_joined_different_join_types","tests/sqlalchemy/crud/test_get_joined.py::test_get_joined_with_filters","tests/sqlalchemy/crud/test_get_joined.py::test_update_multiple_records_allow_multiple","tests/sqlalchemy/crud/test_get_joined.py::test_count_with_advanced_filters","tests/sqlalchemy/crud/test_get_joined.py::test_get_joined_multiple_models","tests/sqlalchemy/crud/test_get_joined.py::test_get_joined_with_aliases","tests/sqlalchemy/crud/test_get_joined.py::test_get_joined_with_aliases_no_schema","tests/sqlalchemy/crud/test_get_joined.py::test_get_joined_with_both_single_and_joins_config_raises_value_error","tests/sqlalchemy/crud/test_get_joined.py::test_get_joined_without_join_model_or_joins_config_raises_value_error","tests/sqlalchemy/crud/test_get_joined.py::test_get_joined_with_unsupported_join_type_raises_value_error","tests/sqlalchemy/crud/test_get_joined.py::test_get_joined_returns_none_when_no_record_matches","tests/sqlalchemy/crud/test_get_joined.py::test_get_joined_with_joined_model_filters","tests/sqlalchemy/crud/test_get_joined.py::test_get_joined_nest_joins","tests/sqlalchemy/crud/test_get_joined.py::test_get_joined_nested_no_prefix_provided"],"failed":["tests/sqlalchemy/crud/test_get_joined.py::test_get_joined_no_prefix_no_nesting"],"errors":[],"skipped":[],"collection_errors":[],"failure_text":{"tests/sqlalchemy/crud/test_get_joined.py::test_get_joined_no_prefix_no_nesting":"AssertionError: Field 'tier_name' should not exist unless specifically prefixed or nested.\nassert 'tier_name' not in {'category_id': 1, 'name': 'Charlie', 'tier_id': 1, 'tier_name': 'Premium'}\nE   AssertionError: Field 'tier_name' should not exist unless specifically prefixed or nested.\n    assert 'tier_name' not in {'category_id': 1, 'name': 'Charlie', 'tier_id': 1, 'tier_name': 'Premium'}"}},"diff":null,"patch_sha256":null,"dropped_paths":[],"snapshot_sha":null}
{"receipt_id":"agent1-34","seq":34,"branch_id":"agent1","kind":"command","cmd":"grep -n \"test_get_joined_no_prefix_no_nesting\" tests/sqlalchemy/crud/test_get_joined.py","path":null,"exit_code":0,"stdout_tail":"499:async def test_get_joined_no_prefix_no_nesting(\n","stderr_tail":"","stdout_sha256":"6c4134aeeea6e5f8dd20ee84d7b7c287d07d932d6f465cab9d188959371ddff9","log_path":"~/dev/nebius-hackathon/pilot/v2-P/igorbenav__fastcrud-69/runs/pilot-igorbenav__fastcrud-69-e8d0d0ccb6/logs/agent1/agent1-34.log","tree_digest":null,"tree_download_s":null,"started_at":"2026-10-03T17:53:55.466408Z","duration_s":0.003059,"timed_out":false,"image_before":"9053d39d-0725-484f-9ed0-f87f73b6b549","image_after":"64581d26-47d0-4a2c-9eae-2a7523895e8c","junit":null,"diff":null,"patch_sha256":null,"dropped_paths":[],"snapshot_sha":null}
{"receipt_id":"agent1-35","seq":35,"branch_id":"agent1","kind":"command","cmd":"/opt/receipts-dc05b4d79bb14c788450e6a8c8f22aab/bin/busybox mkdir -p /opt/receipts/reports && python -I /opt/receipts-dc05b4d79bb14c788450e6a8c8f22aab/receipts_pytest.py tests/sqlalchemy/crud/test_get_joined.py::test_get_joined_no_prefix_no_nesting -xvs -o junit_family=xunit1 -p no:cacheprovider -rA --continue-on-collection-errors --junitxml=/opt/receipts/reports/agent1-35.xml","path":null,"exit_code":1,"stdout_tail":"\n\tdeleted_at DATETIME, \n\tupdated_at DATETIME NOT NULL, \n\tPRIMARY KEY (id), \n\tFOREIGN KEY(tier_id) REFERENCES tier (id), \n\tFOREIGN KEY(category_id) REFERENCES category (id)\n)\n\n\nINFO     sqlalchemy.engine.Engine:base.py:1904 [no key 0.00005s] ()\nINFO     sqlalchemy.engine.Engine:base.py:1899 \nCREATE TABLE projects_participants_association (\n\tproject_id INTEGER NOT NULL, \n\tparticipant_id INTEGER NOT NULL, \n\tPRIMARY KEY (project_id, participant_id), \n\tFOREIGN KEY(project_id) REFERENCES projects (id), \n\tFOREIGN KEY(participant_id) REFERENCES participants (id)\n)\n\n\nINFO     sqlalchemy.engine.Engine:base.py:1904 [no key 0.00005s] ()\nINFO     sqlalchemy.engine.Engine:base.py:1899 \nCREATE TABLE multi_pk (\n\tid INTEGER NOT NULL, \n\tuuid VARCHAR(32) NOT NULL, \n\tname VARCHAR, \n\ttest_id INTEGER, \n\tPRIMARY KEY (id, uuid), \n\tUNIQUE (name), \n\tFOREIGN KEY(test_id) REFERENCES test (id)\n)\n\n\nINFO     sqlalchemy.engine.Engine:base.py:1904 [no key 0.00005s] ()\nINFO     sqlalchemy.engine.Engine:base.py:1899 \nCREATE TABLE booking (\n\tid INTEGER NOT NULL, \n\towner_id INTEGER NOT NULL, \n\tuser_id INTEGER NOT NULL, \n\tbooking_date DATETIME NOT NULL, \n\tPRIMARY KEY (id), \n\tFOREIGN KEY(owner_id) REFERENCES test (id), \n\tFOREIGN KEY(user_id) REFERENCES test (id)\n)\n\n\nINFO     sqlalchemy.engine.Engine:base.py:1904 [no key 0.00006s] ()\nINFO     sqlalchemy.engine.Engine:base.py:1143 COMMIT\n------------------------------ Captured log call -------------------------------\nINFO     sqlalchemy.engine.Engine:base.py:1094 BEGIN (implicit)\nINFO     sqlalchemy.engine.Engine:base.py:1899 INSERT INTO tier (id, name) VALUES (?, ?)\nINFO     sqlalchemy.engine.Engine:base.py:1904 [generated in 0.00012s] [(1, 'Premium'), (2, 'Basic')]\nINFO     sqlalchemy.engine.Engine:base.py:1143 COMMIT\nINFO     sqlalchemy.engine.Engine:base.py:1094 BEGIN (implicit)\nINFO     sqlalchemy.engine.Engine:base.py:1899 INSERT INTO test (id, name, tier_id, category_id, is_deleted, deleted_at) VALUES (?, ?, ?, ?, ?, ?)\nINFO     sqlalchemy.engine.Engine:base.py:1904 [generated in 0.00015s] [(1, 'Charlie', 1, 1, 0, None), (2, 'Alice', 2, 1, 0, None), (3, 'Bob', 1, 2, 0, None), (4, 'David', 2, 1, 0, None), (5, 'Eve', 1, 1, 0, None), (6, 'Frank', 2, 2, 0, None), (7, 'Grace', 1, 2, 0, None), (8, 'Hannah', 2, 1, 0, None)  ... displaying 10 of 11 total bound parameter sets ...  (10, 'Judy', 2, 2, 0, None), (11, 'Alice', 1, 1, 0, None)]\nINFO     sqlalchemy.engine.Engine:base.py:1143 COMMIT\nINFO     sqlalchemy.engine.Engine:base.py:1094 BEGIN (implicit)\nINFO     sqlalchemy.engine.Engine:base.py:1899 SELECT test.name, test.tier_id, test.category_id, tier.name AS tier_name \nFROM test LEFT OUTER JOIN tier ON tier.id = test.tier_id\nINFO     sqlalchemy.engine.Engine:base.py:1904 [generated in 0.00011s] ()\n---------------------------- Captured log teardown -----------------------------\nINFO     sqlalchemy.engine.Engine:base.py:1126 ROLLBACK\nINFO     sqlalchemy.engine.Engine:base.py:1094 BEGIN (implicit)\nINFO     sqlalchemy.engine.Engine:base.py:1899 PRAGMA main.table_info(\"multi_pk\")\nINFO     sqlalchemy.engine.Engine:base.py:1904 [raw sql] ()\nINFO     sqlalchemy.engine.Engine:base.py:1899 PRAGMA main.table_info(\"category\")\nINFO     sqlalchemy.engine.Engine:base.py:1904 [raw sql] ()\nINFO     sqlalchemy.engine.Engine:base.py:1899 PRAGMA main.table_info(\"test\")\nINFO     sqlalchemy.engine.Engine:base.py:1904 [raw sql] ()\nINFO     sqlalchemy.engine.Engine:base.py:1899 PRAGMA main.table_info(\"model_test_with_timestamp\")\nINFO     sqlalchemy.engine.Engine:base.py:1904 [raw sql] ()\nINFO     sqlalchemy.engine.Engine:base.py:1899 PRAGMA main.table_info(\"tier\")\nINFO     sqlalchemy.engine.Engine:base.py:1904 [raw sql] ()\nINFO     sqlalchemy.engine.Engine:base.py:1899 PRAGMA main.table_info(\"booking\")\nINFO     sqlalchemy.engine.Engine:base.py:1904 [raw sql] ()\nINFO     sqlalchemy.engine.Engine:base.py:1899 PRAGMA main.table_info(\"projects\")\nINFO     sqlalchemy.engine.Engine:base.py:1904 [raw sql] ()\nINFO     sqlalchemy.engine.Engine:base.py:1899 PRAGMA main.table_info(\"participants\")\nINFO     sqlalchemy.engine.Engine:base.py:1904 [raw sql] ()\nINFO     sqlalchemy.engine.Engine:base.py:1899 PRAGMA main.table_info(\"projects_participants_association\")\nINFO     sqlalchemy.engine.Engine:base.py:1904 [raw sql] ()\nINFO     sqlalchemy.engine.Engine:base.py:1899 \nDROP TABLE booking\nINFO     sqlalchemy.engine.Engine:base.py:1904 [no key 0.00006s] ()\nINFO     sqlalchemy.engine.Engine:base.py:1899 \nDROP TABLE multi_pk\nINFO     sqlalchemy.engine.Engine:base.py:1904 [no key 0.00005s] ()\nINFO     sqlalchemy.engine.Engine:base.py:1899 \nDROP TABLE projects_participants_association\nINFO     sqlalchemy.engine.Engine:base.py:1904 [no key 0.00005s] ()\nINFO     sqlalchemy.engine.Engine:base.py:1899 \nDROP TABLE model_test_with_timestamp\nINFO     sqlalchemy.engine.Engine:base.py:1904 [no key 0.00005s] ()\nINFO     sqlalchemy.engine.Engine:base.py:1899 \nDROP TABLE test\nINFO     sqlalchemy.engine.Engine:base.py:1904 [no key 0.00005s] ()\nINFO     sqlalchemy.engine.Engine:base.py:1899 \nDROP TABLE participants\nINFO     sqlalchemy.engine.Engine:base.py:1904 [no key 0.00005s] ()\nINFO     sqlalchemy.engine.Engine:base.py:1899 \nDROP TABLE projects\nINFO     sqlalchemy.engine.Engine:base.py:1904 [no key 0.00005s] ()\nINFO     sqlalchemy.engine.Engine:base.py:1899 \nDROP TABLE tier\nINFO     sqlalchemy.engine.Engine:base.py:1904 [no key 0.00005s] ()\nINFO     sqlalchemy.engine.Engine:base.py:1899 \nDROP TABLE category\nINFO     sqlalchemy.engine.Engine:base.py:1904 [no key 0.00005s] ()\nINFO     sqlalchemy.engine.Engine:base.py:1143 COMMIT\n----------- generated xml file: /opt/receipts/reports/agent1-35.xml ------------\n=========================== short test summary info ============================\nFAILED tests/sqlalchemy/crud/test_get_joined.py::test_get_joined_no_prefix_no_nesting\n!!!!!!!!!!!!!!!!!!!!!!!!!! stopping after 1 failures !!!!!!!!!!!!!!!!!!!!!!!!!!!\n============================== 1 failed in 0.11s ===============================\n","stderr_tail":"","stdout_sha256":"ac0ae60a4254f8cc4f379c0fe36077da12a5e34813b0d9a5a41f746ce70ff6c8","log_path":"~/dev/nebius-hackathon/pilot/v2-P/igorbenav__fastcrud-69/runs/pilot-igorbenav__fastcrud-69-e8d0d0ccb6/logs/agent1/agent1-35.log","tree_digest":"0dc7451e4a87b959b7c36d52e44af5609db304c2ec5a51ff6b0e054c2f71cd22","tree_download_s":2.9607009580358863,"started_at":"2026-10-03T17:54:06.579934Z","duration_s":1.742644,"timed_out":false,"image_before":"64581d26-47d0-4a2c-9eae-2a7523895e8c","image_after":"20c4568c-80ce-4377-8847-2818e5b03c05","junit":{"passed":[],"failed":["tests/sqlalchemy/crud/test_get_joined.py::test_get_joined_no_prefix_no_nesting"],"errors":[],"skipped":[],"collection_errors":[],"failure_text":{"tests/sqlalchemy/crud/test_get_joined.py::test_get_joined_no_prefix_no_nesting":"AssertionError: Field 'tier_name' should not exist unless specifically prefixed or nested.\nassert 'tier_name' not in {'category_id': 1, 'name': 'Charlie', 'tier_id': 1, 'tier_name': 'Premium'}\nasync_session = <sqlalchemy.orm.session.AsyncSession object at 0x7ffff441ea70>\ntest_data = [{'category_id': 1, 'id': 1, 'name': 'Charlie', 'tier_id': 1}, {'category_id': 1, 'id': 2, 'name': 'Alice', 'tier_id':...ategory_id': 1, 'id': 5, 'name': 'Eve', 'tier_id': 1}, {'category_id': 2, 'id': 6, 'name': 'Frank', 'tier_id': 2}, ...]\ntest_data_tier = [{'id': 1, 'name': 'Premium'}, {'id': 2, 'name': 'Basic'}]\n\n    @pytest.mark.asyncio\n    async def test_get_joined_no_prefix_no_nesting(\n        async_session, test_data, test_data_tier\n    ):\n        for tier_item in test_data_tier:\n            async_session.add(TierModel(**tier_item))\n        await async_session.commit()\n    \n        for user_item in test_data:\n            async_session.add(ModelTest(**user_item))\n        await async_session.commit()\n    \n        crud = FastCRUD(ModelTest)\n    \n        result = await crud.get_joined(\n            db=async_session,\n            join_model=TierModel,\n            schema_to_select=CreateSchemaTest,\n            join_schema_to_select=TierSchemaTest,\n        )\n    \n        assert result is not None, \"Expected to retrieve a result from joined query.\"\n        assert (\n            \"name\" in result\n        ), \"Expected 'name' field from the primary model in the result.\"\n        assert \"tier_id\" in result, \"Expected 'tier_id' (foreign key) in the result.\"\n>       assert (\n            \"tier_name\" not in result\n        ), \"Field 'tier_name' should not exist unless specifically prefixed or nested.\"\nE       AssertionError: Field 'tier_name' should not exist unless specifically prefixed or nested.\nE       assert 'tier_name' not in {'category_id': 1, 'name': 'Charlie', 'tier_id': 1, 'tier_name': 'Premium'}\n\ntests/sqlalchemy/crud/test_get_joined.py:524: AssertionError"}},"diff":null,"patch_sha256":null,"dropped_paths":[],"snapshot_sha":null}
{"receipt_id":"agent1-36","seq":36,"branch_id":"agent1","kind":"command","cmd":"grep -n \"effective_prefix = join.model.__tableway+_\" fastcrud/crud/fast_crud.py","path":null,"exit_code":1,"stdout_tail":"","stderr_tail":"","stdout_sha256":"e3b0c44298fc1c149afbf4c8996fb92427ae41e4649b934ca495991b7852b855","log_path":"~/dev/nebius-hackathon/pilot/v2-P/igorbenav__fastcrud-69/runs/pilot-igorbenav__fastcrud-69-e8d0d0ccb6/logs/agent1/agent1-36.log","tree_digest":null,"tree_download_s":null,"started_at":"2026-10-03T17:55:21.751940Z","duration_s":0.003321,"timed_out":false,"image_before":"20c4568c-80ce-4377-8847-2818e5b03c05","image_after":"ad803003-0d4a-4a1b-9242-5c4978ea39ac","junit":null,"diff":null,"patch_sha256":null,"dropped_paths":[],"snapshot_sha":null}
{"receipt_id":"agent1-37","seq":37,"branch_id":"agent1","kind":"command","cmd":"grep -n \"effective_prefix = join.model.__tablename__ + _\" fastcrud/crud/fast_crud.py","path":null,"exit_code":1,"stdout_tail":"","stderr_tail":"","stdout_sha256":"e3b0c44298fc1c149afbf4c8996fb92427ae41e4649b934ca495991b7852b855","log_path":"~/dev/nebius-hackathon/pilot/v2-P/igorbenav__fastcrud-69/runs/pilot-igorbenav__fastcrud-69-e8d0d0ccb6/logs/agent1/agent1-37.log","tree_digest":null,"tree_download_s":null,"started_at":"2026-10-03T17:55:25.484037Z","duration_s":0.003286,"timed_out":false,"image_before":"ad803003-0d4a-4a1b-9242-5c4978ea39ac","image_after":"ee78b4d4-1a48-456e-9611-4ca8bd74dd2d","junit":null,"diff":null,"patch_sha256":null,"dropped_paths":[],"snapshot_sha":null}
{"receipt_id":"agent1-38","seq":38,"branch_id":"agent1","kind":"command","cmd":"grep -n \"effective_prefix is None\" fastcrud/crud/fast_crud.py","path":null,"exit_code":0,"stdout_tail":"924:            if effective_prefix is None:\n1252:            if effective_prefix is None:\n","stderr_tail":"","stdout_sha256":"34b4d2175122d48e5f3192f0356929930fa7e9b842762409ca94a206a6830d1b","log_path":"~/dev/nebius-hackathon/pilot/v2-P/igorbenav__fastcrud-69/runs/pilot-igorbenav__fastcrud-69-e8d0d0ccb6/logs/agent1/agent1-38.log","tree_digest":null,"tree_download_s":null,"started_at":"2026-10-03T17:55:29.688001Z","duration_s":0.003106,"timed_out":false,"image_before":"ee78b4d4-1a48-456e-9611-4ca8bd74dd2d","image_after":"406c1b72-98ba-41ad-9271-e64a78fd5618","junit":null,"diff":null,"patch_sha256":null,"dropped_paths":[],"snapshot_sha":null}
{"receipt_id":"agent1-39","seq":39,"branch_id":"agent1","kind":"command","cmd":"git diff fastcrud/crud/fast_crud.py","path":null,"exit_code":0,"stdout_tail":"diff --git a/fastcrud/crud/fast_crud.py b/fastcrud/crud/fast_crud.py\nindex f813407..e2cc37b 100644\n--- a/fastcrud/crud/fast_crud.py\n+++ b/fastcrud/crud/fast_crud.py\n@@ -918,10 +918,16 @@ class FastCRUD(\n                 else None\n             )\n \n+            # Determine effective prefix for column selection to avoid conflicts\n+            # If no explicit prefix provided, use table name + \"_\" to ensure uniqueness\n+            effective_prefix = join.join_prefix\n+            if effective_prefix is None:\n+                effective_prefix = join.model.__tablename__ + \"_\"\n+            \n             join_select = _extract_matching_columns_from_schema(\n                 model=join.model,\n                 schema=join.schema_to_select,\n-                prefix=join.join_prefix,\n+                prefix=effective_prefix,\n                 alias=join.alias,\n             )\n \n@@ -1240,10 +1246,16 @@ class FastCRUD(\n                 else None\n             )\n \n+            # Determine effective prefix for column selection to avoid conflicts\n+            # If no explicit prefix provided, use table name + \"_\" to ensure uniqueness\n+            effective_prefix = join.join_prefix\n+            if effective_prefix is None:\n+                effective_prefix = join.model.__tablename__ + \"_\"\n+            \n             join_select = _extract_matching_columns_from_schema(\n                 model=join.model,\n                 schema=join.schema_to_select,\n-                prefix=join.join_prefix,\n+                prefix=effective_prefix,\n                 alias=join.alias,\n             )\n \n","stderr_tail":"","stdout_sha256":"94047e2ded7fb8494f5d662ce22d37c7845cdab48930e597ee8c8fd93aae6ae5","log_path":"~/dev/nebius-hackathon/pilot/v2-P/igorbenav__fastcrud-69/runs/pilot-igorbenav__fastcrud-69-e8d0d0ccb6/logs/agent1/agent1-39.log","tree_digest":null,"tree_download_s":null,"started_at":"2026-10-03T17:55:44.275104Z","duration_s":0.005312,"timed_out":false,"image_before":"406c1b72-98ba-41ad-9271-e64a78fd5618","image_after":"f62e32bc-4ebf-4378-84a3-f7620a3a072f","junit":null,"diff":null,"patch_sha256":null,"dropped_paths":[],"snapshot_sha":null}
{"receipt_id":"agent1-40","seq":40,"branch_id":"agent1","kind":"command","cmd":"grep -n \"effective_prefix is None:\" fastcrud/crud/fast_crud.py","path":null,"exit_code":0,"stdout_tail":"924:            if effective_prefix is None:\n1252:            if effective_prefix is None:\n","stderr_tail":"","stdout_sha256":"34b4d2175122d48e5f3192f0356929930fa7e9b842762409ca94a206a6830d1b","log_path":"~/dev/nebius-hackathon/pilot/v2-P/igorbenav__fastcrud-69/runs/pilot-igorbenav__fastcrud-69-e8d0d0ccb6/logs/agent1/agent1-40.log","tree_digest":null,"tree_download_s":null,"started_at":"2026-10-03T17:55:59.644746Z","duration_s":0.003406,"timed_out":false,"image_before":"f62e32bc-4ebf-4378-84a3-f7620a3a072f","image_after":"6a9aeb2f-38da-416e-8093-374c098752c4","junit":null,"diff":null,"patch_sha256":null,"dropped_paths":[],"snapshot_sha":null}
{"receipt_id":"agent1-41","seq":41,"branch_id":"agent1","kind":"command","cmd":"/opt/receipts-95a1eb5f3a844c53bca98fa5eb80f09a/bin/busybox mkdir -p /opt/receipts/reports && python -I /opt/receipts-95a1eb5f3a844c53bca98fa5eb80f09a/receipts_pytest.py tests/sqlalchemy/crud/test_get_joined.py::test_get_joined_nested_no_prefix_provided tests/sqlalchemy/crud/test_get_multi_joined.py::test_get_multi_joined_no_prefix_nested tests/sqlmodel/crud/test_get_multi_joined.py::test_get_multi_joined_no_prefix_nested -v -o junit_family=xunit1 -p no:cacheprovider -rA --continue-on-collection-errors --junitxml=/opt/receipts/reports/agent1-41.xml","path":null,"exit_code":0,"stdout_tail":"ry\")\n2026-10-03 17:56:14,097 INFO sqlalchemy.engine.Engine [raw sql] ()\n2026-10-03 17:56:14,097 INFO sqlalchemy.engine.Engine PRAGMA main.table_info(\"test\")\n2026-10-03 17:56:14,097 INFO sqlalchemy.engine.Engine [raw sql] ()\n2026-10-03 17:56:14,098 INFO sqlalchemy.engine.Engine PRAGMA main.table_info(\"model_test_with_timestamp\")\n2026-10-03 17:56:14,098 INFO sqlalchemy.engine.Engine [raw sql] ()\n2026-10-03 17:56:14,098 INFO sqlalchemy.engine.Engine PRAGMA main.table_info(\"tier\")\n2026-10-03 17:56:14,098 INFO sqlalchemy.engine.Engine [raw sql] ()\n2026-10-03 17:56:14,099 INFO sqlalchemy.engine.Engine PRAGMA main.table_info(\"projects_participants_association\")\n2026-10-03 17:56:14,099 INFO sqlalchemy.engine.Engine [raw sql] ()\n2026-10-03 17:56:14,099 INFO sqlalchemy.engine.Engine PRAGMA main.table_info(\"projects\")\n2026-10-03 17:56:14,099 INFO sqlalchemy.engine.Engine [raw sql] ()\n2026-10-03 17:56:14,099 INFO sqlalchemy.engine.Engine PRAGMA main.table_info(\"participants\")\n2026-10-03 17:56:14,099 INFO sqlalchemy.engine.Engine [raw sql] ()\n2026-10-03 17:56:14,100 INFO sqlalchemy.engine.Engine PRAGMA main.table_info(\"booking\")\n2026-10-03 17:56:14,100 INFO sqlalchemy.engine.Engine [raw sql] ()\n2026-10-03 17:56:14,100 INFO sqlalchemy.engine.Engine \nDROP TABLE booking\n2026-10-03 17:56:14,100 INFO sqlalchemy.engine.Engine [no key 0.00010s] ()\n2026-10-03 17:56:14,101 INFO sqlalchemy.engine.Engine \nDROP TABLE multi_pk\n2026-10-03 17:56:14,101 INFO sqlalchemy.engine.Engine [no key 0.00011s] ()\n2026-10-03 17:56:14,101 INFO sqlalchemy.engine.Engine \nDROP TABLE projects_participants_association\n2026-10-03 17:56:14,101 INFO sqlalchemy.engine.Engine [no key 0.00010s] ()\n2026-10-03 17:56:14,102 INFO sqlalchemy.engine.Engine \nDROP TABLE model_test_with_timestamp\n2026-10-03 17:56:14,102 INFO sqlalchemy.engine.Engine [no key 0.00009s] ()\n2026-10-03 17:56:14,102 INFO sqlalchemy.engine.Engine \nDROP TABLE test\n2026-10-03 17:56:14,102 INFO sqlalchemy.engine.Engine [no key 0.00009s] ()\n2026-10-03 17:56:14,102 INFO sqlalchemy.engine.Engine \nDROP TABLE participants\n2026-10-03 17:56:14,103 INFO sqlalchemy.engine.Engine [no key 0.00009s] ()\n2026-10-03 17:56:14,103 INFO sqlalchemy.engine.Engine \nDROP TABLE projects\n2026-10-03 17:56:14,103 INFO sqlalchemy.engine.Engine [no key 0.00010s] ()\n2026-10-03 17:56:14,103 INFO sqlalchemy.engine.Engine \nDROP TABLE tier\n2026-10-03 17:56:14,103 INFO sqlalchemy.engine.Engine [no key 0.00009s] ()\n2026-10-03 17:56:14,104 INFO sqlalchemy.engine.Engine \nDROP TABLE category\n2026-10-03 17:56:14,104 INFO sqlalchemy.engine.Engine [no key 0.00010s] ()\n2026-10-03 17:56:14,104 INFO sqlalchemy.engine.Engine COMMIT\n---------------------------- Captured log teardown -----------------------------\nINFO     sqlalchemy.engine.Engine:base.py:1126 ROLLBACK\nINFO     sqlalchemy.engine.Engine:base.py:1094 BEGIN (implicit)\nINFO     sqlalchemy.engine.Engine:base.py:1899 PRAGMA main.table_info(\"multi_pk\")\nINFO     sqlalchemy.engine.Engine:base.py:1904 [raw sql] ()\nINFO     sqlalchemy.engine.Engine:base.py:1899 PRAGMA main.table_info(\"category\")\nINFO     sqlalchemy.engine.Engine:base.py:1904 [raw sql] ()\nINFO     sqlalchemy.engine.Engine:base.py:1899 PRAGMA main.table_info(\"test\")\nINFO     sqlalchemy.engine.Engine:base.py:1904 [raw sql] ()\nINFO     sqlalchemy.engine.Engine:base.py:1899 PRAGMA main.table_info(\"model_test_with_timestamp\")\nINFO     sqlalchemy.engine.Engine:base.py:1904 [raw sql] ()\nINFO     sqlalchemy.engine.Engine:base.py:1899 PRAGMA main.table_info(\"tier\")\nINFO     sqlalchemy.engine.Engine:base.py:1904 [raw sql] ()\nINFO     sqlalchemy.engine.Engine:base.py:1899 PRAGMA main.table_info(\"projects_participants_association\")\nINFO     sqlalchemy.engine.Engine:base.py:1904 [raw sql] ()\nINFO     sqlalchemy.engine.Engine:base.py:1899 PRAGMA main.table_info(\"projects\")\nINFO     sqlalchemy.engine.Engine:base.py:1904 [raw sql] ()\nINFO     sqlalchemy.engine.Engine:base.py:1899 PRAGMA main.table_info(\"participants\")\nINFO     sqlalchemy.engine.Engine:base.py:1904 [raw sql] ()\nINFO     sqlalchemy.engine.Engine:base.py:1899 PRAGMA main.table_info(\"booking\")\nINFO     sqlalchemy.engine.Engine:base.py:1904 [raw sql] ()\nINFO     sqlalchemy.engine.Engine:base.py:1899 \nDROP TABLE booking\nINFO     sqlalchemy.engine.Engine:base.py:1904 [no key 0.00010s] ()\nINFO     sqlalchemy.engine.Engine:base.py:1899 \nDROP TABLE multi_pk\nINFO     sqlalchemy.engine.Engine:base.py:1904 [no key 0.00011s] ()\nINFO     sqlalchemy.engine.Engine:base.py:1899 \nDROP TABLE projects_participants_association\nINFO     sqlalchemy.engine.Engine:base.py:1904 [no key 0.00010s] ()\nINFO     sqlalchemy.engine.Engine:base.py:1899 \nDROP TABLE model_test_with_timestamp\nINFO     sqlalchemy.engine.Engine:base.py:1904 [no key 0.00009s] ()\nINFO     sqlalchemy.engine.Engine:base.py:1899 \nDROP TABLE test\nINFO     sqlalchemy.engine.Engine:base.py:1904 [no key 0.00009s] ()\nINFO     sqlalchemy.engine.Engine:base.py:1899 \nDROP TABLE participants\nINFO     sqlalchemy.engine.Engine:base.py:1904 [no key 0.00009s] ()\nINFO     sqlalchemy.engine.Engine:base.py:1899 \nDROP TABLE projects\nINFO     sqlalchemy.engine.Engine:base.py:1904 [no key 0.00010s] ()\nINFO     sqlalchemy.engine.Engine:base.py:1899 \nDROP TABLE tier\nINFO     sqlalchemy.engine.Engine:base.py:1904 [no key 0.00009s] ()\nINFO     sqlalchemy.engine.Engine:base.py:1899 \nDROP TABLE category\nINFO     sqlalchemy.engine.Engine:base.py:1904 [no key 0.00010s] ()\nINFO     sqlalchemy.engine.Engine:base.py:1143 COMMIT\n----------- generated xml file: /opt/receipts/reports/agent1-41.xml ------------\n=========================== short test summary info ============================\nPASSED tests/sqlalchemy/crud/test_get_joined.py::test_get_joined_nested_no_prefix_provided\nPASSED tests/sqlalchemy/crud/test_get_multi_joined.py::test_get_multi_joined_no_prefix_nested\nPASSED tests/sqlmodel/crud/test_get_multi_joined.py::test_get_multi_joined_no_prefix_nested\n============================== 3 passed in 0.22s ===============================\n","stderr_tail":"","stdout_sha256":"42bc296974d215a361ac2a5e40ad9bfc48ac06234c312e8c1edc7592f7271b39","log_path":"~/dev/nebius-hackathon/pilot/v2-P/igorbenav__fastcrud-69/runs/pilot-igorbenav__fastcrud-69-e8d0d0ccb6/logs/agent1/agent1-41.log","tree_digest":"0dc7451e4a87b959b7c36d52e44af5609db304c2ec5a51ff6b0e054c2f71cd22","tree_download_s":2.605739374877885,"started_at":"2026-10-03T17:56:11.412225Z","duration_s":1.9508539999999999,"timed_out":false,"image_before":"6a9aeb2f-38da-416e-8093-374c098752c4","image_after":"1fcefa75-11d3-49e4-82f3-10ba5d70ff17","junit":{"passed":["tests/sqlalchemy/crud/test_get_joined.py::test_get_joined_nested_no_prefix_provided","tests/sqlalchemy/crud/test_get_multi_joined.py::test_get_multi_joined_no_prefix_nested","tests/sqlmodel/crud/test_get_multi_joined.py::test_get_multi_joined_no_prefix_nested"],"failed":[],"errors":[],"skipped":[],"collection_errors":[],"failure_text":{}},"diff":null,"patch_sha256":null,"dropped_paths":[],"snapshot_sha":null}
{"receipt_id":"agent1-42","seq":42,"branch_id":"agent1","kind":"command","cmd":"/opt/receipts-5bae07c280a24dbc9a6c225a5ea34acb/bin/busybox mkdir -p /opt/receipts/reports && python -I /opt/receipts-5bae07c280a24dbc9a6c225a5ea34acb/receipts_pytest.py tests/sqlalchemy/crud/test_get_joined.py::test_get_joined_no_prefix_no_nesting -xvs -o junit_family=xunit1 -p no:cacheprovider -rA --continue-on-collection-errors --junitxml=/opt/receipts/reports/agent1-42.xml","path":null,"exit_code":1,"stdout_tail":"\n\tdeleted_at DATETIME, \n\tupdated_at DATETIME NOT NULL, \n\tPRIMARY KEY (id), \n\tFOREIGN KEY(tier_id) REFERENCES tier (id), \n\tFOREIGN KEY(category_id) REFERENCES category (id)\n)\n\n\nINFO     sqlalchemy.engine.Engine:base.py:1904 [no key 0.00005s] ()\nINFO     sqlalchemy.engine.Engine:base.py:1899 \nCREATE TABLE projects_participants_association (\n\tproject_id INTEGER NOT NULL, \n\tparticipant_id INTEGER NOT NULL, \n\tPRIMARY KEY (project_id, participant_id), \n\tFOREIGN KEY(project_id) REFERENCES projects (id), \n\tFOREIGN KEY(participant_id) REFERENCES participants (id)\n)\n\n\nINFO     sqlalchemy.engine.Engine:base.py:1904 [no key 0.00005s] ()\nINFO     sqlalchemy.engine.Engine:base.py:1899 \nCREATE TABLE multi_pk (\n\tid INTEGER NOT NULL, \n\tuuid VARCHAR(32) NOT NULL, \n\tname VARCHAR, \n\ttest_id INTEGER, \n\tPRIMARY KEY (id, uuid), \n\tUNIQUE (name), \n\tFOREIGN KEY(test_id) REFERENCES test (id)\n)\n\n\nINFO     sqlalchemy.engine.Engine:base.py:1904 [no key 0.00006s] ()\nINFO     sqlalchemy.engine.Engine:base.py:1899 \nCREATE TABLE booking (\n\tid INTEGER NOT NULL, \n\towner_id INTEGER NOT NULL, \n\tuser_id INTEGER NOT NULL, \n\tbooking_date DATETIME NOT NULL, \n\tPRIMARY KEY (id), \n\tFOREIGN KEY(owner_id) REFERENCES test (id), \n\tFOREIGN KEY(user_id) REFERENCES test (id)\n)\n\n\nINFO     sqlalchemy.engine.Engine:base.py:1904 [no key 0.00006s] ()\nINFO     sqlalchemy.engine.Engine:base.py:1143 COMMIT\n------------------------------ Captured log call -------------------------------\nINFO     sqlalchemy.engine.Engine:base.py:1094 BEGIN (implicit)\nINFO     sqlalchemy.engine.Engine:base.py:1899 INSERT INTO tier (id, name) VALUES (?, ?)\nINFO     sqlalchemy.engine.Engine:base.py:1904 [generated in 0.00013s] [(1, 'Premium'), (2, 'Basic')]\nINFO     sqlalchemy.engine.Engine:base.py:1143 COMMIT\nINFO     sqlalchemy.engine.Engine:base.py:1094 BEGIN (implicit)\nINFO     sqlalchemy.engine.Engine:base.py:1899 INSERT INTO test (id, name, tier_id, category_id, is_deleted, deleted_at) VALUES (?, ?, ?, ?, ?, ?)\nINFO     sqlalchemy.engine.Engine:base.py:1904 [generated in 0.00018s] [(1, 'Charlie', 1, 1, 0, None), (2, 'Alice', 2, 1, 0, None), (3, 'Bob', 1, 2, 0, None), (4, 'David', 2, 1, 0, None), (5, 'Eve', 1, 1, 0, None), (6, 'Frank', 2, 2, 0, None), (7, 'Grace', 1, 2, 0, None), (8, 'Hannah', 2, 1, 0, None)  ... displaying 10 of 11 total bound parameter sets ...  (10, 'Judy', 2, 2, 0, None), (11, 'Alice', 1, 1, 0, None)]\nINFO     sqlalchemy.engine.Engine:base.py:1143 COMMIT\nINFO     sqlalchemy.engine.Engine:base.py:1094 BEGIN (implicit)\nINFO     sqlalchemy.engine.Engine:base.py:1899 SELECT test.name, test.tier_id, test.category_id, tier.name AS tier_name \nFROM test LEFT OUTER JOIN tier ON tier.id = test.tier_id\nINFO     sqlalchemy.engine.Engine:base.py:1904 [generated in 0.00009s] ()\n---------------------------- Captured log teardown -----------------------------\nINFO     sqlalchemy.engine.Engine:base.py:1126 ROLLBACK\nINFO     sqlalchemy.engine.Engine:base.py:1094 BEGIN (implicit)\nINFO     sqlalchemy.engine.Engine:base.py:1899 PRAGMA main.table_info(\"multi_pk\")\nINFO     sqlalchemy.engine.Engine:base.py:1904 [raw sql] ()\nINFO     sqlalchemy.engine.Engine:base.py:1899 PRAGMA main.table_info(\"category\")\nINFO     sqlalchemy.engine.Engine:base.py:1904 [raw sql] ()\nINFO     sqlalchemy.engine.Engine:base.py:1899 PRAGMA main.table_info(\"test\")\nINFO     sqlalchemy.engine.Engine:base.py:1904 [raw sql] ()\nINFO     sqlalchemy.engine.Engine:base.py:1899 PRAGMA main.table_info(\"model_test_with_timestamp\")\nINFO     sqlalchemy.engine.Engine:base.py:1904 [raw sql] ()\nINFO     sqlalchemy.engine.Engine:base.py:1899 PRAGMA main.table_info(\"tier\")\nINFO     sqlalchemy.engine.Engine:base.py:1904 [raw sql] ()\nINFO     sqlalchemy.engine.Engine:base.py:1899 PRAGMA main.table_info(\"booking\")\nINFO     sqlalchemy.engine.Engine:base.py:1904 [raw sql] ()\nINFO     sqlalchemy.engine.Engine:base.py:1899 PRAGMA main.table_info(\"projects\")\nINFO     sqlalchemy.engine.Engine:base.py:1904 [raw sql] ()\nINFO     sqlalchemy.engine.Engine:base.py:1899 PRAGMA main.table_info(\"participants\")\nINFO     sqlalchemy.engine.Engine:base.py:1904 [raw sql] ()\nINFO     sqlalchemy.engine.Engine:base.py:1899 PRAGMA main.table_info(\"projects_participants_association\")\nINFO     sqlalchemy.engine.Engine:base.py:1904 [raw sql] ()\nINFO     sqlalchemy.engine.Engine:base.py:1899 \nDROP TABLE booking\nINFO     sqlalchemy.engine.Engine:base.py:1904 [no key 0.00006s] ()\nINFO     sqlalchemy.engine.Engine:base.py:1899 \nDROP TABLE multi_pk\nINFO     sqlalchemy.engine.Engine:base.py:1904 [no key 0.00005s] ()\nINFO     sqlalchemy.engine.Engine:base.py:1899 \nDROP TABLE projects_participants_association\nINFO     sqlalchemy.engine.Engine:base.py:1904 [no key 0.00005s] ()\nINFO     sqlalchemy.engine.Engine:base.py:1899 \nDROP TABLE model_test_with_timestamp\nINFO     sqlalchemy.engine.Engine:base.py:1904 [no key 0.00005s] ()\nINFO     sqlalchemy.engine.Engine:base.py:1899 \nDROP TABLE test\nINFO     sqlalchemy.engine.Engine:base.py:1904 [no key 0.00005s] ()\nINFO     sqlalchemy.engine.Engine:base.py:1899 \nDROP TABLE participants\nINFO     sqlalchemy.engine.Engine:base.py:1904 [no key 0.00005s] ()\nINFO     sqlalchemy.engine.Engine:base.py:1899 \nDROP TABLE projects\nINFO     sqlalchemy.engine.Engine:base.py:1904 [no key 0.00005s] ()\nINFO     sqlalchemy.engine.Engine:base.py:1899 \nDROP TABLE tier\nINFO     sqlalchemy.engine.Engine:base.py:1904 [no key 0.00005s] ()\nINFO     sqlalchemy.engine.Engine:base.py:1899 \nDROP TABLE category\nINFO     sqlalchemy.engine.Engine:base.py:1904 [no key 0.00005s] ()\nINFO     sqlalchemy.engine.Engine:base.py:1143 COMMIT\n----------- generated xml file: /opt/receipts/reports/agent1-42.xml ------------\n=========================== short test summary info ============================\nFAILED tests/sqlalchemy/crud/test_get_joined.py::test_get_joined_no_prefix_no_nesting\n!!!!!!!!!!!!!!!!!!!!!!!!!! stopping after 1 failures !!!!!!!!!!!!!!!!!!!!!!!!!!!\n============================== 1 failed in 0.11s ===============================\n","stderr_tail":"","stdout_sha256":"a462646859237032d7fbf179cbbe489b8e23071ffcc772c5c8881b8a404e791f","log_path":"~/dev/nebius-hackathon/pilot/v2-P/igorbenav__fastcrud-69/runs/pilot-igorbenav__fastcrud-69-e8d0d0ccb6/logs/agent1/agent1-42.log","tree_digest":"0dc7451e4a87b959b7c36d52e44af5609db304c2ec5a51ff6b0e054c2f71cd22","tree_download_s":2.580564707983285,"started_at":"2026-10-03T17:56:22.272556Z","duration_s":1.773625,"timed_out":false,"image_before":"1fcefa75-11d3-49e4-82f3-10ba5d70ff17","image_after":"a5e0a7aa-6deb-41b3-988d-f5d1fb5331e3","junit":{"passed":[],"failed":["tests/sqlalchemy/crud/test_get_joined.py::test_get_joined_no_prefix_no_nesting"],"errors":[],"skipped":[],"collection_errors":[],"failure_text":{"tests/sqlalchemy/crud/test_get_joined.py::test_get_joined_no_prefix_no_nesting":"AssertionError: Field 'tier_name' should not exist unless specifically prefixed or nested.\nassert 'tier_name' not in {'category_id': 1, 'name': 'Charlie', 'tier_id': 1, 'tier_name': 'Premium'}\nasync_session = <sqlalchemy.orm.session.AsyncSession object at 0x7ffff44ab310>\ntest_data = [{'category_id': 1, 'id': 1, 'name': 'Charlie', 'tier_id': 1}, {'category_id': 1, 'id': 2, 'name': 'Alice', 'tier_id':...ategory_id': 1, 'id': 5, 'name': 'Eve', 'tier_id': 1}, {'category_id': 2, 'id': 6, 'name': 'Frank', 'tier_id': 2}, ...]\ntest_data_tier = [{'id': 1, 'name': 'Premium'}, {'id': 2, 'name': 'Basic'}]\n\n    @pytest.mark.asyncio\n    async def test_get_joined_no_prefix_no_nesting(\n        async_session, test_data, test_data_tier\n    ):\n        for tier_item in test_data_tier:\n            async_session.add(TierModel(**tier_item))\n        await async_session.commit()\n    \n        for user_item in test_data:\n            async_session.add(ModelTest(**user_item))\n        await async_session.commit()\n    \n        crud = FastCRUD(ModelTest)\n    \n        result = await crud.get_joined(\n            db=async_session,\n            join_model=TierModel,\n            schema_to_select=CreateSchemaTest,\n            join_schema_to_select=TierSchemaTest,\n        )\n    \n        assert result is not None, \"Expected to retrieve a result from joined query.\"\n        assert (\n            \"name\" in result\n        ), \"Expected 'name' field from the primary model in the result.\"\n        assert \"tier_id\" in result, \"Expected 'tier_id' (foreign key) in the result.\"\n>       assert (\n            \"tier_name\" not in result\n        ), \"Field 'tier_name' should not exist unless specifically prefixed or nested.\"\nE       AssertionError: Field 'tier_name' should not exist unless specifically prefixed or nested.\nE       assert 'tier_name' not in {'category_id': 1, 'name': 'Charlie', 'tier_id': 1, 'tier_name': 'Premium'}\n\ntests/sqlalchemy/crud/test_get_joined.py:524: AssertionError"}},"diff":null,"patch_sha256":null,"dropped_paths":[],"snapshot_sha":null}
{"receipt_id":"agent1-43","seq":43,"branch_id":"agent1","kind":"diff","cmd":"compute patch in executor staging agent1-6f4a210e9dd54b6fb6dcf8591774c8a5: /opt/homebrew/Cellar/git/2.53.0/bin/git -c core.hooksPath=/dev/null -c core.attributesFile=/dev/null -c diff.external= -c core.quotePath=false add -A && /opt/homebrew/Cellar/git/2.53.0/bin/git -c core.hooksPath=/dev/null -c core.attributesFile=/dev/null -c diff.external= -c core.quotePath=false diff --cached --binary --no-ext-diff --no-textconv --no-renames eb5d8bdbf3757f6219fbabe9f9af778ad39458bb","path":null,"exit_code":0,"stdout_tail":"diff --git a/fastcrud/crud/fast_crud.py b/fastcrud/crud/fast_crud.py\nindex f813407..e2cc37b 100644\n--- a/fastcrud/crud/fast_crud.py\n+++ b/fastcrud/crud/fast_crud.py\n@@ -918,10 +918,16 @@ class FastCRUD(\n                 else None\n             )\n \n+            # Determine effective prefix for column selection to avoid conflicts\n+            # If no explicit prefix provided, use table name + \"_\" to ensure uniqueness\n+            effective_prefix = join.join_prefix\n+            if effective_prefix is None:\n+                effective_prefix = join.model.__tablename__ + \"_\"\n+            \n             join_select = _extract_matching_columns_from_schema(\n                 model=join.model,\n                 schema=join.schema_to_select,\n-                prefix=join.join_prefix,\n+                prefix=effective_prefix,\n                 alias=join.alias,\n             )\n \n@@ -1240,10 +1246,16 @@ class FastCRUD(\n                 else None\n             )\n \n+            # Determine effective prefix for column selection to avoid conflicts\n+            # If no explicit prefix provided, use table name + \"_\" to ensure uniqueness\n+            effective_prefix = join.join_prefix\n+            if effective_prefix is None:\n+                effective_prefix = join.model.__tablename__ + \"_\"\n+            \n             join_select = _extract_matching_columns_from_schema(\n                 model=join.model,\n                 schema=join.schema_to_select,\n-                prefix=join.join_prefix,\n+                prefix=effective_prefix,\n                 alias=join.alias,\n             )\n \ndiff --git a/fastcrud/crud/helper.py b/fastcrud/crud/helper.py\nindex ad25fbf..c8f0449 100644\n--- a/fastcrud/crud/helper.py\n+++ b/fastcrud/crud/helper.py\n@@ -108,9 +108,18 @@ def _nest_join_data(\n     for key, value in data.items():\n         nested = False\n         for join in join_definitions:\n-            if join.join_prefix and key.startswith(join.join_prefix):\n-                nested_key = join.join_prefix.rstrip(\"_\")\n-                nested_field = key[len(join.join_prefix) :]\n+            # Determine what prefix was used for this join during column selection\n+            if join.join_prefix is not None:\n+                # Explicit prefix was provided\n+                prefix_to_check = join.join_prefix\n+                nested_key = join.join_prefix.rstrip(\"_\") if join.join_prefix else join.model.__tablename__\n+            else:\n+                # No explicit prefix, we used table_name + \"_\" as effective prefix\n+                prefix_to_check = join.model.__tablename__ + \"_\"\n+                nested_key = join.model.__tablename__\n+                \n+            if prefix_to_check and key.startswith(prefix_to_check):\n+                nested_field = key[len(prefix_to_check) :]\n                 if nested_key not in nested_data:\n                     nested_data[nested_key] = {}\n                 nested_data[nested_key][nested_field] = value\n","stderr_tail":"","stdout_sha256":"f9cae9b232c735405a4f749c202f5ea7da5439a3ed63be94691735d3267dc83a","log_path":null,"tree_digest":"0dc7451e4a87b959b7c36d52e44af5609db304c2ec5a51ff6b0e054c2f71cd22","tree_download_s":8.407542957924306,"started_at":"2026-10-03T17:56:47.349546Z","duration_s":0.052048583049327135,"timed_out":false,"image_before":"a5e0a7aa-6deb-41b3-988d-f5d1fb5331e3","image_after":"a5e0a7aa-6deb-41b3-988d-f5d1fb5331e3","junit":null,"diff":{"files":[{"path":"fastcrud/crud/fast_crud.py","added":14,"deleted":2,"category":"source","status":"modified"},{"path":"fastcrud/crud/helper.py","added":12,"deleted":3,"category":"source","status":"modified"}],"patch_sha256":"f9cae9b232c735405a4f749c202f5ea7da5439a3ed63be94691735d3267dc83a","patch_path":"~/dev/nebius-hackathon/pilot/v2-P/igorbenav__fastcrud-69/runs/pilot-igorbenav__fastcrud-69-e8d0d0ccb6/artifacts/agent1/agent1-43.patch"},"patch_sha256":"f9cae9b232c735405a4f749c202f5ea7da5439a3ed63be94691735d3267dc83a","dropped_paths":[],"snapshot_sha":"eb5d8bdbf3757f6219fbabe9f9af778ad39458bb"}
