{"receipt_id":"agent1-1","seq":1,"branch_id":"agent1","kind":"command","cmd":"git ls-files -z","path":null,"exit_code":0,"stdout_tail":".py\u0000tests/ens/conftest.py\u0000tests/ens/test_get_registry.py\u0000tests/ens/test_nameprep.py\u0000tests/ens/test_setup_address.py\u0000tests/ens/test_setup_name.py\u0000tests/ens/test_utils.py\u0000tests/ethpm/_utils/test_backend_utils.py\u0000tests/ethpm/_utils/test_cache_utils.py\u0000tests/ethpm/_utils/test_chain_utils.py\u0000tests/ethpm/_utils/test_contract_utils.py\u0000tests/ethpm/_utils/test_ipfs_utils.py\u0000tests/ethpm/_utils/test_registry_utils.py\u0000tests/ethpm/backends/test_http_backends.py\u0000tests/ethpm/backends/test_ipfs_backends.py\u0000tests/ethpm/backends/test_registry_backend.py\u0000tests/ethpm/conftest.py\u0000tests/ethpm/integration/test_escrow_manifest.py\u0000tests/ethpm/integration/test_ipfs_integration.py\u0000tests/ethpm/test_contract.py\u0000tests/ethpm/test_dependencies.py\u0000tests/ethpm/test_deployments.py\u0000tests/ethpm/test_get_build_dependencies.py\u0000tests/ethpm/test_get_deployments.py\u0000tests/ethpm/test_package.py\u0000tests/ethpm/test_package_init.py\u0000tests/ethpm/test_uri.py\u0000tests/ethpm/tools/test_builder.py\u0000tests/ethpm/tools/test_checker.py\u0000tests/ethpm/validation/test_manifest.py\u0000tests/ethpm/validation/test_manifest_assets_are_valid.py\u0000tests/ethpm/validation/test_misc.py\u0000tests/integration/README.md\u0000tests/integration/common.py\u0000tests/integration/conftest.py\u0000tests/integration/generate_fixtures/common.py\u0000tests/integration/generate_fixtures/go_ethereum.py\u0000tests/integration/generate_fixtures/parity.py\u0000tests/integration/geth-1.10.3-fixture.zip\u0000tests/integration/go_ethereum/__init__.py\u0000tests/integration/go_ethereum/common.py\u0000tests/integration/go_ethereum/conftest.py\u0000tests/integration/go_ethereum/test_goethereum_http.py\u0000tests/integration/go_ethereum/test_goethereum_ipc.py\u0000tests/integration/go_ethereum/test_goethereum_ws.py\u0000tests/integration/go_ethereum/utils.py\u0000tests/integration/parity-2.5.13-fixture.zip\u0000tests/integration/parity/__init__.py\u0000tests/integration/parity/common.py\u0000tests/integration/parity/conftest.py\u0000tests/integration/parity/install_parity.py\u0000tests/integration/parity/test_parity_http.py\u0000tests/integration/parity/test_parity_ipc.py\u0000tests/integration/parity/test_parity_ws.py\u0000tests/integration/parity/utils.py\u0000tests/integration/test_ethereum_tester.py\u0000tests/utils.py\u0000tox.ini\u0000web3/__init__.py\u0000web3/_utils/__init__.py\u0000web3/_utils/abi.py\u0000web3/_utils/admin.py\u0000web3/_utils/async_transactions.py\u0000web3/_utils/blocks.py\u0000web3/_utils/caching.py\u0000web3/_utils/compat/__init__.py\u0000web3/_utils/compat/compat_py2.py\u0000web3/_utils/compat/compat_py3.py\u0000web3/_utils/contracts.py\u0000web3/_utils/datatypes.py\u0000web3/_utils/decorators.py\u0000web3/_utils/empty.py\u0000web3/_utils/encoding.py\u0000web3/_utils/ens.py\u0000web3/_utils/events.py\u0000web3/_utils/filters.py\u0000web3/_utils/formatters.py\u0000web3/_utils/function_identifiers.py\u0000web3/_utils/http.py\u0000web3/_utils/hypothesis.py\u0000web3/_utils/math.py\u0000web3/_utils/method_formatters.py\u0000web3/_utils/miner.py\u0000web3/_utils/module.py\u0000web3/_utils/module_testing/__init__.py\u0000web3/_utils/module_testing/emitter_contract.py\u0000web3/_utils/module_testing/eth_module.py\u0000web3/_utils/module_testing/event_contract.py\u0000web3/_utils/module_testing/fallback_contract.py\u0000web3/_utils/module_testing/go_ethereum_admin_module.py\u0000web3/_utils/module_testing/indexed_event_contract.py\u0000web3/_utils/module_testing/math_contract.py\u0000web3/_utils/module_testing/net_module.py\u0000web3/_utils/module_testing/no_receive_contract.py\u0000web3/_utils/module_testing/parity_module.py\u0000web3/_utils/module_testing/personal_module.py\u0000web3/_utils/module_testing/receive_contract.py\u0000web3/_utils/module_testing/revert_contract.py\u0000web3/_utils/module_testing/version_module.py\u0000web3/_utils/module_testing/web3_module.py\u0000web3/_utils/net.py\u0000web3/_utils/normalizers.py\u0000web3/_utils/personal.py\u0000web3/_utils/request.py\u0000web3/_utils/rpc_abi.py\u0000web3/_utils/threads.py\u0000web3/_utils/transactions.py\u0000web3/_utils/txpool.py\u0000web3/_utils/validation.py\u0000web3/_utils/windows.py\u0000web3/auto/__init__.py\u0000web3/auto/gethdev.py\u0000web3/auto/http.py\u0000web3/auto/infura/__init__.py\u0000web3/auto/infura/endpoints.py\u0000web3/auto/infura/goerli.py\u0000web3/auto/infura/kovan.py\u0000web3/auto/infura/mainnet.py\u0000web3/auto/infura/rinkeby.py\u0000web3/auto/infura/ropsten.py\u0000web3/auto/ipc.py\u0000web3/auto/websocket.py\u0000web3/beacon/__init__.py\u0000web3/beacon/main.py\u0000web3/contract.py\u0000web3/datastructures.py\u0000web3/eth.py\u0000web3/exceptions.py\u0000web3/gas_strategies/__init__.py\u0000web3/gas_strategies/rpc.py\u0000web3/gas_strategies/time_based.py\u0000web3/geth.py\u0000web3/iban.py\u0000web3/logs.py\u0000web3/main.py\u0000web3/manager.py\u0000web3/method.py\u0000web3/middleware/__init__.py\u0000web3/middleware/abi.py\u0000web3/middleware/attrdict.py\u0000web3/middleware/buffered_gas_estimate.py\u0000web3/middleware/cache.py\u0000web3/middleware/exception_handling.py\u0000web3/middleware/exception_retry_request.py\u0000web3/middleware/filter.py\u0000web3/middleware/fixture.py\u0000web3/middleware/formatting.py\u0000web3/middleware/gas_price_strategy.py\u0000web3/middleware/geth_poa.py\u0000web3/middleware/names.py\u0000web3/middleware/normalize_errors.py\u0000web3/middleware/normalize_request_parameters.py\u0000web3/middleware/pythonic.py\u0000web3/middleware/signing.py\u0000web3/middleware/simulate_unmined_transaction.py\u0000web3/middleware/stalecheck.py\u0000web3/middleware/validation.py\u0000web3/module.py\u0000web3/net.py\u0000web3/parity.py\u0000web3/pm.py\u0000web3/providers/__init__.py\u0000web3/providers/async_base.py\u0000web3/providers/async_rpc.py\u0000web3/providers/auto.py\u0000web3/providers/base.py\u0000web3/providers/eth_tester/__init__.py\u0000web3/providers/eth_tester/defaults.py\u0000web3/providers/eth_tester/main.py\u0000web3/providers/eth_tester/middleware.py\u0000web3/providers/ipc.py\u0000web3/providers/rpc.py\u0000web3/providers/websocket.py\u0000web3/py.typed\u0000web3/scripts/__init__.py\u0000web3/scripts/release/__init__.py\u0000web3/scripts/release/test_package.py\u0000web3/testing.py\u0000web3/tools/__init__.py\u0000web3/tools/benchmark/__init__.py\u0000web3/tools/benchmark/main.py\u0000web3/tools/benchmark/node.py\u0000web3/tools/benchmark/reporting.py\u0000web3/tools/benchmark/utils.py\u0000web3/tools/pytest_ethereum/README.md\u0000web3/tools/pytest_ethereum/__init__.py\u0000web3/tools/pytest_ethereum/_utils.py\u0000web3/tools/pytest_ethereum/deployer.py\u0000web3/tools/pytest_ethereum/exceptions.py\u0000web3/tools/pytest_ethereum/linker.py\u0000web3/tools/pytest_ethereum/plugins.py\u0000web3/types.py\u0000web3/version.py\u0000","stderr_tail":"","stdout_sha256":"75c1c05330f32290460afd438bbd2842d382d45b43b6977b78a562b6b263434f","log_path":"~/dev/nebius-hackathon/pilot/v2-P/ethereum__web3.py-2023/runs/pilot-ethereum__web3.py-2023-09fbbfb992/logs/agent1/agent1-1.log","tree_digest":null,"tree_download_s":null,"started_at":"2026-10-03T20:05:42.795972Z","duration_s":0.0039959999999999996,"timed_out":false,"image_before":"64be9c9c-2747-4fd8-809e-89e1ee944a4c","image_after":"e05b00bc-7692-48f1-9e3e-20ccc134112d","junit":null,"diff":null,"patch_sha256":null,"dropped_paths":[],"snapshot_sha":null}
{"receipt_id":"agent1-2","seq":2,"branch_id":"agent1","kind":"command","cmd":"/opt/receipts-b675a82bdf91459ba67c18c28c0d0b6a/bin/busybox mkdir -p /opt/receipts/reports && python -I /opt/receipts-b675a82bdf91459ba67c18c28c0d0b6a/receipts_pytest.py tests/core/providers/test_auto_provider.py::test_get_dev_ipc_path -v -o junit_family=xunit1 -p no:cacheprovider -rA --continue-on-collection-errors --junitxml=/opt/receipts/reports/agent1-2.xml","path":null,"exit_code":1,"stdout_tail":"============================= test session starts ==============================\nplatform linux -- Python 3.10.19, pytest-9.0.2, pluggy-1.6.0 -- /usr/local/bin/python\nrootdir: /web3.py\nconfigfile: pytest.ini\nplugins: web3-5.20.0\ncollecting ... collected 1 item\n\ntests/core/providers/test_auto_provider.py::test_get_dev_ipc_path FAILED [100%]\n\n=================================== FAILURES ===================================\n____________________________ test_get_dev_ipc_path _____________________________\n\nmonkeypatch = <_pytest.monkeypatch.MonkeyPatch object at 0x7ffff52dd840>\ntmp_path = PosixPath('/tmp/pytest-of-root/pytest-2/test_get_dev_ipc_path0')\n\n    def test_get_dev_ipc_path(monkeypatch, tmp_path):\n        uri = str(tmp_path)\n        monkeypatch.setenv('WEB3_PROVIDER_URI', uri)\n        path = get_dev_ipc_path()\n>       assert path == uri\nE       AssertionError: assert None == '/tmp/pytest-of-root/pytest-2/test_get_dev_ipc_path0'\n\nmonkeypatch = <_pytest.monkeypatch.MonkeyPatch object at 0x7ffff52dd840>\npath       = None\ntmp_path   = PosixPath('/tmp/pytest-of-root/pytest-2/test_get_dev_ipc_path0')\nuri        = '/tmp/pytest-of-root/pytest-2/test_get_dev_ipc_path0'\n\ntests/core/providers/test_auto_provider.py:61: AssertionError\n=============================== warnings summary ===============================\n../usr/local/lib/python3.10/site-packages/_pytest/config/__init__.py:1428\n  /usr/local/lib/python3.10/site-packages/_pytest/config/__init__.py:1428: PytestConfigWarning: Unknown config option: python_paths\n  \n    self._warn_or_fail_if_strict(f\"Unknown config option: {key}\\n\")\n\n-- Docs: https://docs.pytest.org/en/stable/how-to/capture-warnings.html\n------------ generated xml file: /opt/receipts/reports/agent1-2.xml ------------\n============================= slowest 10 durations =============================\n0.00s setup    tests/core/providers/test_auto_provider.py::test_get_dev_ipc_path\n0.00s teardown tests/core/providers/test_auto_provider.py::test_get_dev_ipc_path\n0.00s call     tests/core/providers/test_auto_provider.py::test_get_dev_ipc_path\n=========================== short test summary info ============================\nFAILED tests/core/providers/test_auto_provider.py::test_get_dev_ipc_path - AssertionError: assert None == '/tmp/pytest-of-root/pytest-2/test_get_dev_ipc_path0'\n========================= 1 failed, 1 warning in 0.08s =========================\n","stderr_tail":"/web3.py/web3/__init__.py:4: UserWarning: pkg_resources is deprecated as an API. See https://setuptools.pypa.io/en/latest/pkg_resources.html. The pkg_resources package is slated for removal as early as 2025-11-30. Refrain from using this package or pin to Setuptools<81.\n  import pkg_resources\n","stdout_sha256":"53bbb32d33dc41455a65dfc6038c36d578ec3fac63b15e9efab7a506ea66223e","log_path":"~/dev/nebius-hackathon/pilot/v2-P/ethereum__web3.py-2023/runs/pilot-ethereum__web3.py-2023-09fbbfb992/logs/agent1/agent1-2.log","tree_digest":"18bb5eb2233116f07718a6b489cfd95b32562d177d1bbdd079753004ccea5b8a","tree_download_s":4.35664387489669,"started_at":"2026-10-03T20:05:52.995394Z","duration_s":1.4365459999999999,"timed_out":false,"image_before":"e05b00bc-7692-48f1-9e3e-20ccc134112d","image_after":"01e815ef-3d2a-4222-94e9-b462ff176d8d","junit":{"passed":[],"failed":["tests/core/providers/test_auto_provider.py::test_get_dev_ipc_path"],"errors":[],"skipped":[],"collection_errors":[],"failure_text":{"tests/core/providers/test_auto_provider.py::test_get_dev_ipc_path":"AssertionError: assert None == '/tmp/pytest-of-root/pytest-2/test_get_dev_ipc_path0'\nmonkeypatch = <_pytest.monkeypatch.MonkeyPatch object at 0x7ffff52dd840>\ntmp_path = PosixPath('/tmp/pytest-of-root/pytest-2/test_get_dev_ipc_path0')\n\n    def test_get_dev_ipc_path(monkeypatch, tmp_path):\n        uri = str(tmp_path)\n        monkeypatch.setenv('WEB3_PROVIDER_URI', uri)\n        path = get_dev_ipc_path()\n>       assert path == uri\nE       AssertionError: assert None == '/tmp/pytest-of-root/pytest-2/test_get_dev_ipc_path0'\n\nmonkeypatch = <_pytest.monkeypatch.MonkeyPatch object at 0x7ffff52dd840>\npath       = None\ntmp_path   = PosixPath('/tmp/pytest-of-root/pytest-2/test_get_dev_ipc_path0')\nuri        = '/tmp/pytest-of-root/pytest-2/test_get_dev_ipc_path0'\n\ntests/core/providers/test_auto_provider.py:61: AssertionError"}},"diff":null,"patch_sha256":null,"dropped_paths":[],"snapshot_sha":null}
{"receipt_id":"agent1-3","seq":3,"branch_id":"agent1","kind":"command","cmd":"grep -r \"WEB3_PROVIDER_URI\" web3/ --include=\"*.py\" | head -20","path":null,"exit_code":0,"stdout_tail":"web3/providers/auto.py:    uri_string = URI(os.environ.get('WEB3_PROVIDER_URI', ''))\n","stderr_tail":"","stdout_sha256":"27d014193afe50a6bf80ca147077b85419e616f5c9c59d6abd097f56f8470d1b","log_path":"~/dev/nebius-hackathon/pilot/v2-P/ethereum__web3.py-2023/runs/pilot-ethereum__web3.py-2023-09fbbfb992/logs/agent1/agent1-3.log","tree_digest":null,"tree_download_s":null,"started_at":"2026-10-03T20:06:07.250677Z","duration_s":0.007465,"timed_out":false,"image_before":"01e815ef-3d2a-4222-94e9-b462ff176d8d","image_after":"7199afec-517f-4e00-a485-0f4aca2c40b1","junit":null,"diff":null,"patch_sha256":null,"dropped_paths":[],"snapshot_sha":null}
{"receipt_id":"agent1-4","seq":4,"branch_id":"agent1","kind":"command","cmd":"grep -n \"def get_dev_ipc_path\" web3/providers/ipc.py","path":null,"exit_code":0,"stdout_tail":"159:def get_dev_ipc_path() -> str:  # type: ignore\n","stderr_tail":"","stdout_sha256":"422e95b5695be52e249fab2ad3400c7675a7a3316c574270c127ced32b627e24","log_path":"~/dev/nebius-hackathon/pilot/v2-P/ethereum__web3.py-2023/runs/pilot-ethereum__web3.py-2023-09fbbfb992/logs/agent1/agent1-4.log","tree_digest":null,"tree_download_s":null,"started_at":"2026-10-03T20:06:21.519631Z","duration_s":0.002676,"timed_out":false,"image_before":"7199afec-517f-4e00-a485-0f4aca2c40b1","image_after":"bc25d249-7a5f-4c50-b2c8-b9400697e7f7","junit":null,"diff":null,"patch_sha256":null,"dropped_paths":[],"snapshot_sha":null}
{"receipt_id":"agent1-5","seq":5,"branch_id":"agent1","kind":"write","cmd":"/opt/receipts-eb85d0af854140faa89761e2d1ce9461/bin/busybox sh -c 'mkdir -p /web3.py/web3/providers && cp /opt/receipts-eb85d0af854140faa89761e2d1ce9461/incoming/a908ba6f14301831e58dd245c45350756eb4b6c36f2bf57b6623bbc04b7ba4f2 /web3.py/web3/providers/ipc.py'","path":"web3/providers/ipc.py","exit_code":0,"stdout_tail":"","stderr_tail":"","stdout_sha256":"a908ba6f14301831e58dd245c45350756eb4b6c36f2bf57b6623bbc04b7ba4f2","log_path":"~/dev/nebius-hackathon/pilot/v2-P/ethereum__web3.py-2023/runs/pilot-ethereum__web3.py-2023-09fbbfb992/logs/agent1/agent1-5.log","tree_digest":null,"tree_download_s":null,"started_at":"2026-10-03T20:06:41.227264Z","duration_s":0.004469,"timed_out":false,"image_before":"bc25d249-7a5f-4c50-b2c8-b9400697e7f7","image_after":"085cf4cb-36b1-4f61-a7fb-dab170e99ec6","junit":null,"diff":null,"patch_sha256":null,"dropped_paths":[],"snapshot_sha":null}
{"receipt_id":"agent1-6","seq":6,"branch_id":"agent1","kind":"command","cmd":"/opt/receipts-62ca0f746f404417b60898017b7080e4/bin/busybox mkdir -p /opt/receipts/reports && python -I /opt/receipts-62ca0f746f404417b60898017b7080e4/receipts_pytest.py tests/core/providers/test_auto_provider.py::test_get_dev_ipc_path -v -o junit_family=xunit1 -p no:cacheprovider -rA --continue-on-collection-errors --junitxml=/opt/receipts/reports/agent1-6.xml","path":null,"exit_code":0,"stdout_tail":"============================= test session starts ==============================\nplatform linux -- Python 3.10.19, pytest-9.0.2, pluggy-1.6.0 -- /usr/local/bin/python\nrootdir: /web3.py\nconfigfile: pytest.ini\nplugins: web3-5.20.0\ncollecting ... collected 1 item\n\ntests/core/providers/test_auto_provider.py::test_get_dev_ipc_path PASSED [100%]\n\n=============================== warnings summary ===============================\n../usr/local/lib/python3.10/site-packages/_pytest/config/__init__.py:1428\n  /usr/local/lib/python3.10/site-packages/_pytest/config/__init__.py:1428: PytestConfigWarning: Unknown config option: python_paths\n  \n    self._warn_or_fail_if_strict(f\"Unknown config option: {key}\\n\")\n\n-- Docs: https://docs.pytest.org/en/stable/how-to/capture-warnings.html\n==================================== PASSES ====================================\n------------ generated xml file: /opt/receipts/reports/agent1-6.xml ------------\n============================= slowest 10 durations =============================\n0.00s setup    tests/core/providers/test_auto_provider.py::test_get_dev_ipc_path\n0.00s teardown tests/core/providers/test_auto_provider.py::test_get_dev_ipc_path\n0.00s call     tests/core/providers/test_auto_provider.py::test_get_dev_ipc_path\n=========================== short test summary info ============================\nPASSED tests/core/providers/test_auto_provider.py::test_get_dev_ipc_path\n========================= 1 passed, 1 warning in 0.04s =========================\n","stderr_tail":"/web3.py/web3/__init__.py:4: UserWarning: pkg_resources is deprecated as an API. See https://setuptools.pypa.io/en/latest/pkg_resources.html. The pkg_resources package is slated for removal as early as 2025-11-30. Refrain from using this package or pin to Setuptools<81.\n  import pkg_resources\n","stdout_sha256":"5563eb0f6c4734576889630616d77a5875529b490cf19be79dddd18138e12d78","log_path":"~/dev/nebius-hackathon/pilot/v2-P/ethereum__web3.py-2023/runs/pilot-ethereum__web3.py-2023-09fbbfb992/logs/agent1/agent1-6.log","tree_digest":"2d4fe8ad3193b0ca4192dd29089d404c81a8c6e2990bb2a2adf41e3b5be60499","tree_download_s":5.478380500106141,"started_at":"2026-10-03T20:06:44.044519Z","duration_s":1.398418,"timed_out":false,"image_before":"085cf4cb-36b1-4f61-a7fb-dab170e99ec6","image_after":"36a1c5a5-60b2-4938-a58c-9d1bde0f9578","junit":{"passed":["tests/core/providers/test_auto_provider.py::test_get_dev_ipc_path"],"failed":[],"errors":[],"skipped":[],"collection_errors":[],"failure_text":{}},"diff":null,"patch_sha256":null,"dropped_paths":[],"snapshot_sha":null}
{"receipt_id":"agent1-7","seq":7,"branch_id":"agent1","kind":"write","cmd":"/opt/receipts-9393efbe55d145f4b87651a432b23a3f/bin/busybox sh -c 'mkdir -p /web3.py && cp /opt/receipts-9393efbe55d145f4b87651a432b23a3f/incoming/c698bfb9e30de25aa6784e90b6a8951e55b5fd5cc60bbe9d5348d6eae72d6f07 /web3.py/test_gethdev_fix.py'","path":"test_gethdev_fix.py","exit_code":0,"stdout_tail":"","stderr_tail":"","stdout_sha256":"c698bfb9e30de25aa6784e90b6a8951e55b5fd5cc60bbe9d5348d6eae72d6f07","log_path":"~/dev/nebius-hackathon/pilot/v2-P/ethereum__web3.py-2023/runs/pilot-ethereum__web3.py-2023-09fbbfb992/logs/agent1/agent1-7.log","tree_digest":null,"tree_download_s":null,"started_at":"2026-10-03T20:06:57.924325Z","duration_s":0.005019,"timed_out":false,"image_before":"36a1c5a5-60b2-4938-a58c-9d1bde0f9578","image_after":"dc67d807-b29f-43ba-939c-f5a8354ec34f","junit":null,"diff":null,"patch_sha256":null,"dropped_paths":[],"snapshot_sha":null}
{"receipt_id":"agent1-8","seq":8,"branch_id":"agent1","kind":"command","cmd":"python test_gethdev_fix.py","path":null,"exit_code":0,"stdout_tail":"Provider IPC path: /tmp/tmpvga3bl08\nExpected IPC path: /tmp/tmpvga3bl08\nSUCCESS: gethdev respects WEB3_PROVIDER_URI\n","stderr_tail":"/web3.py/web3/__init__.py:4: UserWarning: pkg_resources is deprecated as an API. See https://setuptools.pypa.io/en/latest/pkg_resources.html. The pkg_resources package is slated for removal as early as 2025-11-30. Refrain from using this package or pin to Setuptools<81.\n  import pkg_resources\n","stdout_sha256":"5c0437c3c425b9f5fcdd3ae0c5c037b9cd0bf19ad06b81ffbd256ad687e1d0e9","log_path":"~/dev/nebius-hackathon/pilot/v2-P/ethereum__web3.py-2023/runs/pilot-ethereum__web3.py-2023-09fbbfb992/logs/agent1/agent1-8.log","tree_digest":null,"tree_download_s":null,"started_at":"2026-10-03T20:07:01.060941Z","duration_s":0.405175,"timed_out":false,"image_before":"dc67d807-b29f-43ba-939c-f5a8354ec34f","image_after":"d16a5b16-cc6d-434e-b136-912876b0742c","junit":null,"diff":null,"patch_sha256":null,"dropped_paths":[],"snapshot_sha":null}
{"receipt_id":"agent1-9","seq":9,"branch_id":"agent1","kind":"command","cmd":"/opt/receipts-ce4c9a72fd454eb58ed0797e5af911c7/bin/busybox mkdir -p /opt/receipts/reports && python -I /opt/receipts-ce4c9a72fd454eb58ed0797e5af911c7/receipts_pytest.py tests/core/providers/test_auto_provider.py -v -o junit_family=xunit1 -p no:cacheprovider -rA --continue-on-collection-errors --junitxml=/opt/receipts/reports/agent1-9.xml","path":null,"exit_code":0,"stdout_tail":"WEB3_INFURA_API_KEY] PASSED [ 47%]\ntests/core/providers/test_auto_provider.py::test_web3_auto_infura_websocket_empty_key[WEB3_INFURA_PROJECT_ID] PASSED [ 52%]\ntests/core/providers/test_auto_provider.py::test_web3_auto_infura_websocket_deleted_key[WEB3_INFURA_API_KEY] PASSED [ 56%]\ntests/core/providers/test_auto_provider.py::test_web3_auto_infura_websocket_deleted_key[WEB3_INFURA_PROJECT_ID] PASSED [ 60%]\ntests/core/providers/test_auto_provider.py::test_web3_auto_infura[WEB3_INFURA_API_KEY] PASSED [ 65%]\ntests/core/providers/test_auto_provider.py::test_web3_auto_infura[WEB3_INFURA_PROJECT_ID] PASSED [ 69%]\ntests/core/providers/test_auto_provider.py::test_web3_auto_infura_websocket_default[WEB3_INFURA_API_KEY] PASSED [ 73%]\ntests/core/providers/test_auto_provider.py::test_web3_auto_infura_websocket_default[WEB3_INFURA_PROJECT_ID] PASSED [ 78%]\ntests/core/providers/test_auto_provider.py::test_web3_auto_infura_raises_error_with_nonexistent_scheme PASSED [ 82%]\ntests/core/providers/test_auto_provider.py::test_web3_auto_infura_websocket_with_secret[WEB3_INFURA_API_KEY] PASSED [ 86%]\ntests/core/providers/test_auto_provider.py::test_web3_auto_infura_websocket_with_secret[WEB3_INFURA_PROJECT_ID] PASSED [ 91%]\ntests/core/providers/test_auto_provider.py::test_web3_auto_infura_with_secret[WEB3_INFURA_API_KEY] PASSED [ 95%]\ntests/core/providers/test_auto_provider.py::test_web3_auto_infura_with_secret[WEB3_INFURA_PROJECT_ID] PASSED [100%]\n\n=============================== warnings summary ===============================\n../usr/local/lib/python3.10/site-packages/_pytest/config/__init__.py:1428\n  /usr/local/lib/python3.10/site-packages/_pytest/config/__init__.py:1428: PytestConfigWarning: Unknown config option: python_paths\n  \n    self._warn_or_fail_if_strict(f\"Unknown config option: {key}\\n\")\n\n-- Docs: https://docs.pytest.org/en/stable/how-to/capture-warnings.html\n==================================== PASSES ====================================\n------------ generated xml file: /opt/receipts/reports/agent1-9.xml ------------\n============================= slowest 10 durations =============================\n0.00s setup    tests/core/providers/test_auto_provider.py::test_get_dev_ipc_path\n0.00s call     tests/core/providers/test_auto_provider.py::test_web3_auto_infura_with_secret[WEB3_INFURA_API_KEY]\n0.00s call     tests/core/providers/test_auto_provider.py::test_web3_auto_infura_websocket_default[WEB3_INFURA_API_KEY]\n0.00s call     tests/core/providers/test_auto_provider.py::test_web3_auto_infura[WEB3_INFURA_API_KEY]\n0.00s call     tests/core/providers/test_auto_provider.py::test_web3_auto_infura_websocket_default[WEB3_INFURA_PROJECT_ID]\n0.00s call     tests/core/providers/test_auto_provider.py::test_web3_auto_infura_with_secret[WEB3_INFURA_PROJECT_ID]\n0.00s call     tests/core/providers/test_auto_provider.py::test_web3_auto_infura[WEB3_INFURA_PROJECT_ID]\n0.00s call     tests/core/providers/test_auto_provider.py::test_web3_auto_infura_websocket_with_secret[WEB3_INFURA_PROJECT_ID]\n0.00s call     tests/core/providers/test_auto_provider.py::test_web3_auto_infura_websocket_with_secret[WEB3_INFURA_API_KEY]\n0.00s call     tests/core/providers/test_auto_provider.py::test_web3_auto_infura_raises_error_with_nonexistent_scheme\n=========================== short test summary info ============================\nPASSED tests/core/providers/test_auto_provider.py::test_load_provider_from_env[-NoneType-expected_attrs0]\nPASSED tests/core/providers/test_auto_provider.py::test_load_provider_from_env[http://1.2.3.4:5678-HTTPProvider-expected_attrs1]\nPASSED tests/core/providers/test_auto_provider.py::test_load_provider_from_env[https://node.ontheweb.com-HTTPProvider-expected_attrs2]\nPASSED tests/core/providers/test_auto_provider.py::test_load_provider_from_env[file:///root/path/to/file.ipc-IPCProvider-expected_attrs3]\nPASSED tests/core/providers/test_auto_provider.py::test_load_provider_from_env[ws://1.2.3.4:5679-WebsocketProvider-expected_attrs4]\nPASSED tests/core/providers/test_auto_provider.py::test_get_dev_ipc_path\nPASSED tests/core/providers/test_auto_provider.py::test_web3_auto_infura_empty_key[WEB3_INFURA_API_KEY]\nPASSED tests/core/providers/test_auto_provider.py::test_web3_auto_infura_empty_key[WEB3_INFURA_PROJECT_ID]\nPASSED tests/core/providers/test_auto_provider.py::test_web3_auto_infura_deleted_key[WEB3_INFURA_API_KEY]\nPASSED tests/core/providers/test_auto_provider.py::test_web3_auto_infura_deleted_key[WEB3_INFURA_PROJECT_ID]\nPASSED tests/core/providers/test_auto_provider.py::test_web3_auto_infura_websocket_empty_key[WEB3_INFURA_API_KEY]\nPASSED tests/core/providers/test_auto_provider.py::test_web3_auto_infura_websocket_empty_key[WEB3_INFURA_PROJECT_ID]\nPASSED tests/core/providers/test_auto_provider.py::test_web3_auto_infura_websocket_deleted_key[WEB3_INFURA_API_KEY]\nPASSED tests/core/providers/test_auto_provider.py::test_web3_auto_infura_websocket_deleted_key[WEB3_INFURA_PROJECT_ID]\nPASSED tests/core/providers/test_auto_provider.py::test_web3_auto_infura[WEB3_INFURA_API_KEY]\nPASSED tests/core/providers/test_auto_provider.py::test_web3_auto_infura[WEB3_INFURA_PROJECT_ID]\nPASSED tests/core/providers/test_auto_provider.py::test_web3_auto_infura_websocket_default[WEB3_INFURA_API_KEY]\nPASSED tests/core/providers/test_auto_provider.py::test_web3_auto_infura_websocket_default[WEB3_INFURA_PROJECT_ID]\nPASSED tests/core/providers/test_auto_provider.py::test_web3_auto_infura_raises_error_with_nonexistent_scheme\nPASSED tests/core/providers/test_auto_provider.py::test_web3_auto_infura_websocket_with_secret[WEB3_INFURA_API_KEY]\nPASSED tests/core/providers/test_auto_provider.py::test_web3_auto_infura_websocket_with_secret[WEB3_INFURA_PROJECT_ID]\nPASSED tests/core/providers/test_auto_provider.py::test_web3_auto_infura_with_secret[WEB3_INFURA_API_KEY]\nPASSED tests/core/providers/test_auto_provider.py::test_web3_auto_infura_with_secret[WEB3_INFURA_PROJECT_ID]\n======================== 23 passed, 1 warning in 0.08s =========================\n","stderr_tail":"/web3.py/web3/__init__.py:4: UserWarning: pkg_resources is deprecated as an API. See https://setuptools.pypa.io/en/latest/pkg_resources.html. The pkg_resources package is slated for removal as early as 2025-11-30. Refrain from using this package or pin to Setuptools<81.\n  import pkg_resources\n","stdout_sha256":"f25bf621f1cd29c39627c639505ffa670cb887dbe260374821668324eb3830ec","log_path":"~/dev/nebius-hackathon/pilot/v2-P/ethereum__web3.py-2023/runs/pilot-ethereum__web3.py-2023-09fbbfb992/logs/agent1/agent1-9.log","tree_digest":"e559930568f61a5bb3f747a27e79ed9191d2c2907dfca3bc2a5992ab637fa491","tree_download_s":4.761364707956091,"started_at":"2026-10-03T20:07:06.032046Z","duration_s":1.440124,"timed_out":false,"image_before":"d16a5b16-cc6d-434e-b136-912876b0742c","image_after":"9dcfe10c-6a20-45d1-aebe-d0611bfeb2ff","junit":{"passed":["tests/core/providers/test_auto_provider.py::test_load_provider_from_env[-NoneType-expected_attrs0]","tests/core/providers/test_auto_provider.py::test_load_provider_from_env[http://1.2.3.4:5678-HTTPProvider-expected_attrs1]","tests/core/providers/test_auto_provider.py::test_load_provider_from_env[https://node.ontheweb.com-HTTPProvider-expected_attrs2]","tests/core/providers/test_auto_provider.py::test_load_provider_from_env[file:///root/path/to/file.ipc-IPCProvider-expected_attrs3]","tests/core/providers/test_auto_provider.py::test_load_provider_from_env[ws://1.2.3.4:5679-WebsocketProvider-expected_attrs4]","tests/core/providers/test_auto_provider.py::test_get_dev_ipc_path","tests/core/providers/test_auto_provider.py::test_web3_auto_infura_empty_key[WEB3_INFURA_API_KEY]","tests/core/providers/test_auto_provider.py::test_web3_auto_infura_empty_key[WEB3_INFURA_PROJECT_ID]","tests/core/providers/test_auto_provider.py::test_web3_auto_infura_deleted_key[WEB3_INFURA_API_KEY]","tests/core/providers/test_auto_provider.py::test_web3_auto_infura_deleted_key[WEB3_INFURA_PROJECT_ID]","tests/core/providers/test_auto_provider.py::test_web3_auto_infura_websocket_empty_key[WEB3_INFURA_API_KEY]","tests/core/providers/test_auto_provider.py::test_web3_auto_infura_websocket_empty_key[WEB3_INFURA_PROJECT_ID]","tests/core/providers/test_auto_provider.py::test_web3_auto_infura_websocket_deleted_key[WEB3_INFURA_API_KEY]","tests/core/providers/test_auto_provider.py::test_web3_auto_infura_websocket_deleted_key[WEB3_INFURA_PROJECT_ID]","tests/core/providers/test_auto_provider.py::test_web3_auto_infura[WEB3_INFURA_API_KEY]","tests/core/providers/test_auto_provider.py::test_web3_auto_infura[WEB3_INFURA_PROJECT_ID]","tests/core/providers/test_auto_provider.py::test_web3_auto_infura_websocket_default[WEB3_INFURA_API_KEY]","tests/core/providers/test_auto_provider.py::test_web3_auto_infura_websocket_default[WEB3_INFURA_PROJECT_ID]","tests/core/providers/test_auto_provider.py::test_web3_auto_infura_raises_error_with_nonexistent_scheme","tests/core/providers/test_auto_provider.py::test_web3_auto_infura_websocket_with_secret[WEB3_INFURA_API_KEY]","tests/core/providers/test_auto_provider.py::test_web3_auto_infura_websocket_with_secret[WEB3_INFURA_PROJECT_ID]","tests/core/providers/test_auto_provider.py::test_web3_auto_infura_with_secret[WEB3_INFURA_API_KEY]","tests/core/providers/test_auto_provider.py::test_web3_auto_infura_with_secret[WEB3_INFURA_PROJECT_ID]"],"failed":[],"errors":[],"skipped":[],"collection_errors":[],"failure_text":{}},"diff":null,"patch_sha256":null,"dropped_paths":[],"snapshot_sha":null}
{"receipt_id":"agent1-10","seq":10,"branch_id":"agent1","kind":"command","cmd":"rm test_gethdev_fix.py","path":null,"exit_code":0,"stdout_tail":"","stderr_tail":"","stdout_sha256":"e3b0c44298fc1c149afbf4c8996fb92427ae41e4649b934ca495991b7852b855","log_path":"~/dev/nebius-hackathon/pilot/v2-P/ethereum__web3.py-2023/runs/pilot-ethereum__web3.py-2023-09fbbfb992/logs/agent1/agent1-10.log","tree_digest":null,"tree_download_s":null,"started_at":"2026-10-03T20:07:16.950063Z","duration_s":0.0029389999999999998,"timed_out":false,"image_before":"9dcfe10c-6a20-45d1-aebe-d0611bfeb2ff","image_after":"a5221417-7da2-4f52-bd03-4f1e3f01d3a9","junit":null,"diff":null,"patch_sha256":null,"dropped_paths":[],"snapshot_sha":null}
{"receipt_id":"agent1-11","seq":11,"branch_id":"agent1","kind":"write","cmd":"/opt/receipts-268cbb96f07a45b88820e0c92f98cb91/bin/busybox sh -c 'mkdir -p /web3.py && cp /opt/receipts-268cbb96f07a45b88820e0c92f98cb91/incoming/78429f59ca51a13337f8cd4be20ea990a208bf6f1e8915e0d4530d3735ac5e89 /web3.py/test_edge_case.py'","path":"test_edge_case.py","exit_code":0,"stdout_tail":"","stderr_tail":"","stdout_sha256":"78429f59ca51a13337f8cd4be20ea990a208bf6f1e8915e0d4530d3735ac5e89","log_path":"~/dev/nebius-hackathon/pilot/v2-P/ethereum__web3.py-2023/runs/pilot-ethereum__web3.py-2023-09fbbfb992/logs/agent1/agent1-11.log","tree_digest":null,"tree_download_s":null,"started_at":"2026-10-03T20:07:21.446721Z","duration_s":0.004948,"timed_out":false,"image_before":"a5221417-7da2-4f52-bd03-4f1e3f01d3a9","image_after":"bb57f57b-517d-4add-915a-daec21c9adb7","junit":null,"diff":null,"patch_sha256":null,"dropped_paths":[],"snapshot_sha":null}
{"receipt_id":"agent1-12","seq":12,"branch_id":"agent1","kind":"command","cmd":"python test_edge_case.py","path":null,"exit_code":0,"stdout_tail":"Empty WEB3_PROVIDER_URI result: None\nUnset WEB3_PROVIDER_URI result: None\nEdge case tests completed\n","stderr_tail":"/web3.py/web3/__init__.py:4: UserWarning: pkg_resources is deprecated as an API. See https://setuptools.pypa.io/en/latest/pkg_resources.html. The pkg_resources package is slated for removal as early as 2025-11-30. Refrain from using this package or pin to Setuptools<81.\n  import pkg_resources\n","stdout_sha256":"8f8cd0e1705752723277cf088ddf1c7a37450635403cb85ab7e833acafc48f7d","log_path":"~/dev/nebius-hackathon/pilot/v2-P/ethereum__web3.py-2023/runs/pilot-ethereum__web3.py-2023-09fbbfb992/logs/agent1/agent1-12.log","tree_digest":null,"tree_download_s":null,"started_at":"2026-10-03T20:07:24.321498Z","duration_s":0.332449,"timed_out":false,"image_before":"bb57f57b-517d-4add-915a-daec21c9adb7","image_after":"ed4ac588-1a03-416a-a2f1-3fe52bd3e47d","junit":null,"diff":null,"patch_sha256":null,"dropped_paths":[],"snapshot_sha":null}
{"receipt_id":"agent1-13","seq":13,"branch_id":"agent1","kind":"command","cmd":"rm test_edge_case.py","path":null,"exit_code":0,"stdout_tail":"","stderr_tail":"","stdout_sha256":"e3b0c44298fc1c149afbf4c8996fb92427ae41e4649b934ca495991b7852b855","log_path":"~/dev/nebius-hackathon/pilot/v2-P/ethereum__web3.py-2023/runs/pilot-ethereum__web3.py-2023-09fbbfb992/logs/agent1/agent1-13.log","tree_digest":null,"tree_download_s":null,"started_at":"2026-10-03T20:07:27.814608Z","duration_s":0.002465,"timed_out":false,"image_before":"ed4ac588-1a03-416a-a2f1-3fe52bd3e47d","image_after":"07710c84-de92-4674-9d62-f677621301e7","junit":null,"diff":null,"patch_sha256":null,"dropped_paths":[],"snapshot_sha":null}
{"receipt_id":"agent1-14","seq":14,"branch_id":"agent1","kind":"command","cmd":"/opt/receipts-0e6dda3c498f41af9b31a8364f7457f6/bin/busybox mkdir -p /opt/receipts/reports && python -I /opt/receipts-0e6dda3c498f41af9b31a8364f7457f6/receipts_pytest.py tests/core/providers/test_auto_provider.py::test_get_dev_ipc_path -v -o junit_family=xunit1 -p no:cacheprovider -rA --continue-on-collection-errors --junitxml=/opt/receipts/reports/agent1-14.xml","path":null,"exit_code":0,"stdout_tail":"============================= test session starts ==============================\nplatform linux -- Python 3.10.19, pytest-9.0.2, pluggy-1.6.0 -- /usr/local/bin/python\nrootdir: /web3.py\nconfigfile: pytest.ini\nplugins: web3-5.20.0\ncollecting ... collected 1 item\n\ntests/core/providers/test_auto_provider.py::test_get_dev_ipc_path PASSED [100%]\n\n=============================== warnings summary ===============================\n../usr/local/lib/python3.10/site-packages/_pytest/config/__init__.py:1428\n  /usr/local/lib/python3.10/site-packages/_pytest/config/__init__.py:1428: PytestConfigWarning: Unknown config option: python_paths\n  \n    self._warn_or_fail_if_strict(f\"Unknown config option: {key}\\n\")\n\n-- Docs: https://docs.pytest.org/en/stable/how-to/capture-warnings.html\n==================================== PASSES ====================================\n----------- generated xml file: /opt/receipts/reports/agent1-14.xml ------------\n============================= slowest 10 durations =============================\n0.00s setup    tests/core/providers/test_auto_provider.py::test_get_dev_ipc_path\n0.00s teardown tests/core/providers/test_auto_provider.py::test_get_dev_ipc_path\n0.00s call     tests/core/providers/test_auto_provider.py::test_get_dev_ipc_path\n=========================== short test summary info ============================\nPASSED tests/core/providers/test_auto_provider.py::test_get_dev_ipc_path\n========================= 1 passed, 1 warning in 0.04s =========================\n","stderr_tail":"/web3.py/web3/__init__.py:4: UserWarning: pkg_resources is deprecated as an API. See https://setuptools.pypa.io/en/latest/pkg_resources.html. The pkg_resources package is slated for removal as early as 2025-11-30. Refrain from using this package or pin to Setuptools<81.\n  import pkg_resources\n","stdout_sha256":"686cff6fba396162fd75c7fc6e0fa8e50bacdb6fcc75d5159e9413de5af86517","log_path":"~/dev/nebius-hackathon/pilot/v2-P/ethereum__web3.py-2023/runs/pilot-ethereum__web3.py-2023-09fbbfb992/logs/agent1/agent1-14.log","tree_digest":"2d4fe8ad3193b0ca4192dd29089d404c81a8c6e2990bb2a2adf41e3b5be60499","tree_download_s":8.537968083983287,"started_at":"2026-10-03T20:07:32.699198Z","duration_s":1.429191,"timed_out":false,"image_before":"07710c84-de92-4674-9d62-f677621301e7","image_after":"fa83185d-22ec-482e-8f77-4d97b21839e1","junit":{"passed":["tests/core/providers/test_auto_provider.py::test_get_dev_ipc_path"],"failed":[],"errors":[],"skipped":[],"collection_errors":[],"failure_text":{}},"diff":null,"patch_sha256":null,"dropped_paths":[],"snapshot_sha":null}
{"receipt_id":"agent1-15","seq":15,"branch_id":"agent1","kind":"diff","cmd":"compute patch in executor staging agent1-822abf004c89498fa5e09dfe58d822b6: /opt/homebrew/Cellar/git/2.53.0/bin/git -c core.hooksPath=/dev/null -c core.attributesFile=/dev/null -c diff.external= -c core.quotePath=false add -A && /opt/homebrew/Cellar/git/2.53.0/bin/git -c core.hooksPath=/dev/null -c core.attributesFile=/dev/null -c diff.external= -c core.quotePath=false diff --cached --binary --no-ext-diff --no-textconv --no-renames f8824a384888438a009e36908a2420113d908fa6","path":null,"exit_code":0,"stdout_tail":"diff --git a/web3/providers/ipc.py b/web3/providers/ipc.py\nindex 57a2998a..0b75a9fd 100644\n--- a/web3/providers/ipc.py\n+++ b/web3/providers/ipc.py\n@@ -157,6 +157,11 @@ def get_default_ipc_path() -> str:  # type: ignore\n \n # type ignored b/c missing return statement is by design here\n def get_dev_ipc_path() -> str:  # type: ignore\n+    # Check if WEB3_PROVIDER_URI is set and return it if so\n+    env_uri = os.environ.get('WEB3_PROVIDER_URI')\n+    if env_uri:\n+        return env_uri\n+        \n     if sys.platform == 'darwin':\n         tmpdir = os.environ.get('TMPDIR', '')\n         ipc_path = os.path.expanduser(os.path.join(\n@@ -269,4 +274,4 @@ def has_valid_json_rpc_ending(raw_response: bytes) -> bool:\n         if stripped_raw_response.endswith(valid_ending):\n             return True\n     else:\n-        return False\n+        return False\n\\ No newline at end of file\n","stderr_tail":"","stdout_sha256":"01600641e90cf405b69740950b731650804d63c87af7108d2a3d86795ec4f3fa","log_path":null,"tree_digest":"2d4fe8ad3193b0ca4192dd29089d404c81a8c6e2990bb2a2adf41e3b5be60499","tree_download_s":4.385066708084196,"started_at":"2026-10-03T20:08:01.064000Z","duration_s":0.1157092081848532,"timed_out":false,"image_before":"fa83185d-22ec-482e-8f77-4d97b21839e1","image_after":"fa83185d-22ec-482e-8f77-4d97b21839e1","junit":null,"diff":{"files":[{"path":"web3/providers/ipc.py","added":6,"deleted":1,"category":"source","status":"modified"}],"patch_sha256":"01600641e90cf405b69740950b731650804d63c87af7108d2a3d86795ec4f3fa","patch_path":"~/dev/nebius-hackathon/pilot/v2-P/ethereum__web3.py-2023/runs/pilot-ethereum__web3.py-2023-09fbbfb992/artifacts/agent1/agent1-15.patch"},"patch_sha256":"01600641e90cf405b69740950b731650804d63c87af7108d2a3d86795ec4f3fa","dropped_paths":[],"snapshot_sha":"f8824a384888438a009e36908a2420113d908fa6"}
