{"receipt_id":"base-1","seq":1,"branch_id":"base","kind":"command","cmd":"python -c 'import base64; from pathlib import Path; Path('\"'\"'/tmp/receipts-dask__dask-5861-test.patch'\"'\"').write_bytes(base64.b64decode('\"'\"'ZGlmZiAtLWdpdCBhL2Rhc2svdGVzdHMvdGVzdF9kYXRhc2V0cy5weSBiL2Rhc2svdGVzdHMvdGVzdF9kYXRhc2V0cy5weQppbmRleCBiZmI5MTQxN2IuLjA5MDcyN2U1NiAxMDA2NDQKLS0tIGEvZGFzay90ZXN0cy90ZXN0X2RhdGFzZXRzLnB5CisrKyBiL2Rhc2svdGVzdHMvdGVzdF9kYXRhc2V0cy5weQpAQCAtMjQsNyArMjQsNyBAQCBkZWYgdGVzdF9ub19taW1lc2lzKCk6CiAgICAgICAgIHdpdGggcHl0ZXN0LnJhaXNlcyhFeGNlcHRpb24pIGFzIGluZm86CiAgICAgICAgICAgICBkYXNrLmRhdGFzZXRzLm1ha2VfcGVvcGxlKCkKIAotICAgICAgICBhc3NlcnQgInBpcCBpbnN0YWxsIG1pbWVzaXMiIGluIHN0cihpbmZvLnZhbHVlKQorICAgICAgICBhc3NlcnQgInB5dGhvbiAtbSBwaXAgaW5zdGFsbCBtaW1lc2lzIiBpbiBzdHIoaW5mby52YWx1ZSkKIAogCiBkZWYgdGVzdF9kZXRlcm1pbmlzdGljKCk6Cg=='\"'\"'))'","path":null,"exit_code":0,"stdout_tail":"","stderr_tail":"","stdout_sha256":"e3b0c44298fc1c149afbf4c8996fb92427ae41e4649b934ca495991b7852b855","log_path":"~/dev/nebius-hackathon/pilot/v2-P/dask__dask-5861/runs/pilot-dask__dask-5861-afdf49683a/logs/base/base-1.log","tree_digest":null,"tree_download_s":null,"started_at":"2026-10-03T17:14:06.514119Z","duration_s":0.023254,"timed_out":false,"image_before":"cb677cea-ddc3-3628-ada5-a8bbe6a22994","image_after":"49fc9ade-ce03-4a6f-a365-b2673a335232","junit":null,"diff":null,"patch_sha256":null,"dropped_paths":[],"snapshot_sha":null}
{"receipt_id":"base-2","seq":2,"branch_id":"base","kind":"command","cmd":"git apply /tmp/receipts-dask__dask-5861-test.patch","path":null,"exit_code":0,"stdout_tail":"","stderr_tail":"","stdout_sha256":"e3b0c44298fc1c149afbf4c8996fb92427ae41e4649b934ca495991b7852b855","log_path":"~/dev/nebius-hackathon/pilot/v2-P/dask__dask-5861/runs/pilot-dask__dask-5861-afdf49683a/logs/base/base-2.log","tree_digest":null,"tree_download_s":null,"started_at":"2026-10-03T17:14:08.368206Z","duration_s":0.0036880000000000003,"timed_out":false,"image_before":"49fc9ade-ce03-4a6f-a365-b2673a335232","image_after":"08744f42-e53d-43ae-b00d-410d003cc451","junit":null,"diff":null,"patch_sha256":null,"dropped_paths":[],"snapshot_sha":null}
{"receipt_id":"base-3","seq":3,"branch_id":"base","kind":"command","cmd":"/opt/receipts-9c66f236bb5f41fca95764e4e48f060c/bin/busybox mkdir -p /opt/receipts/reports && python -I /opt/receipts-9c66f236bb5f41fca95764e4e48f060c/receipts_pytest.py --no-header -rA --tb=line --color=no -p no:cacheprovider -W ignore::DeprecationWarning dask/tests/test_datasets.py -o junit_family=xunit1 -p no:cacheprovider -rA --continue-on-collection-errors --junitxml=/opt/receipts/reports/base-3.xml","path":null,"exit_code":1,"stdout_tail":"============================= test session starts ==============================\ncollected 4 items\n\ndask/tests/test_datasets.py ssFs                                         [100%]\n\n=================================== FAILURES ===================================\nE   ModuleNotFoundError: No module named 'mimesis'\n\nDuring handling of the above exception, another exception occurred:\nE   AssertionError: assert 'python -m pip install mimesis' in 'The mimesis module is required for this function.  Try:\\n  pip install mimesis'\n     +  where 'The mimesis module is required for this function.  Try:\\n  pip install mimesis' = str(RuntimeError('The mimesis module is required for this function.  Try:\\n  pip install mimesis'))\n     +    where RuntimeError('The mimesis module is required for this function.  Try:\\n  pip install mimesis') = <ExceptionInfo RuntimeError('The mimesis module is required for this function.  Try:\\n  pip install mimesis') tblen=3>.value\n/dask/dask/tests/test_datasets.py:27: AssertionError: assert 'python -m pip install mimesis' in 'The mimesis module is required for this function.  Try:\\n  pip install mimesis'\n------------- generated xml file: /opt/receipts/reports/base-3.xml -------------\n============================= slowest 10 durations =============================\n\n(10 durations < 0.005s hidden.  Use -vv to show these durations.)\n=========================== short test summary info ============================\nSKIPPED [1] dask/tests/test_datasets.py:6: could not import 'mimesis': No module named 'mimesis'\nSKIPPED [1] dask/tests/test_datasets.py:15: could not import 'mimesis': No module named 'mimesis'\nSKIPPED [1] dask/tests/test_datasets.py:31: could not import 'mimesis': No module named 'mimesis'\nFAILED dask/tests/test_datasets.py::test_no_mimesis - AssertionError: assert ...\n========================= 1 failed, 3 skipped in 0.59s =========================\n","stderr_tail":"","stdout_sha256":"b265f65f80276c0fafc94d56951d72d00f8bb8c4f2a99a23e2f5256d1a87a8ff","log_path":"~/dev/nebius-hackathon/pilot/v2-P/dask__dask-5861/runs/pilot-dask__dask-5861-afdf49683a/logs/base/base-3.log","tree_digest":"4b196cdb29342db69b77f8ff0feeb169d04b7ede2fb1b66b893d5dab3f9ab359","tree_download_s":3.9852706668898463,"started_at":"2026-10-03T17:14:10.181453Z","duration_s":0.9490609999999999,"timed_out":false,"image_before":"08744f42-e53d-43ae-b00d-410d003cc451","image_after":"c4abddc1-f52b-40bb-8b81-e321f66706d4","junit":{"passed":[],"failed":["dask/tests/test_datasets.py::test_no_mimesis"],"errors":[],"skipped":["dask/tests/test_datasets.py::test_mimesis","dask/tests/test_datasets.py::test_full_dataset","dask/tests/test_datasets.py::test_deterministic"],"collection_errors":[],"failure_text":{"dask/tests/test_datasets.py::test_no_mimesis":"AssertionError: assert 'python -m pip install mimesis' in 'The mimesis module is required for this function.  Try:\\n  pip install mimesis'\n +  where 'The mimesis module is required for this function.  Try:\\n  pip install mimesis' = str(RuntimeError('The mimesis module is required for this function.  Try:\\n  pip install mimesis'))\n +    where RuntimeError('The mimesis module is required for this function.  Try:\\n  pip install mimesis') = <ExceptionInfo RuntimeError('The mimesis module is required for this function.  Try:\\n  pip install mimesis') tblen=3>.value\nE   ModuleNotFoundError: No module named 'mimesis'\n\nDuring handling of the above exception, another exception occurred:\nE   AssertionError: assert 'python -m pip install mimesis' in 'The mimesis module is required for this function.  Try:\\n  pip install mimesis'\n     +  where 'The mimesis module is required for this function.  Try:\\n  pip install mimesis' = str(RuntimeError('The mimesis module is required for this function.  Try:\\n  pip install mimesis'))\n     +    where RuntimeError('The mimesis module is required for this function.  Try:\\n  pip install mimesis') = <ExceptionInfo RuntimeError('The mimesis module is required for this function.  Try:\\n  pip install mimesis') tblen=3>.value"}},"diff":null,"patch_sha256":null,"dropped_paths":[],"snapshot_sha":null}
{"receipt_id":"base-4","seq":4,"branch_id":"base","kind":"command","cmd":"/opt/receipts-3a03398543074f97818bf798c3d2b672/bin/busybox mkdir -p /opt/receipts/reports && python -I /opt/receipts-3a03398543074f97818bf798c3d2b672/receipts_pytest.py --no-header -rA --tb=line --color=no -p no:cacheprovider -W ignore::DeprecationWarning dask/tests/test_datasets.py -o junit_family=xunit1 -p no:cacheprovider -rA --continue-on-collection-errors --junitxml=/opt/receipts/reports/base-4.xml","path":null,"exit_code":1,"stdout_tail":"============================= test session starts ==============================\ncollected 4 items\n\ndask/tests/test_datasets.py ssFs                                         [100%]\n\n=================================== FAILURES ===================================\nE   ModuleNotFoundError: No module named 'mimesis'\n\nDuring handling of the above exception, another exception occurred:\nE   AssertionError: assert 'python -m pip install mimesis' in 'The mimesis module is required for this function.  Try:\\n  pip install mimesis'\n     +  where 'The mimesis module is required for this function.  Try:\\n  pip install mimesis' = str(RuntimeError('The mimesis module is required for this function.  Try:\\n  pip install mimesis'))\n     +    where RuntimeError('The mimesis module is required for this function.  Try:\\n  pip install mimesis') = <ExceptionInfo RuntimeError('The mimesis module is required for this function.  Try:\\n  pip install mimesis') tblen=3>.value\n/dask/dask/tests/test_datasets.py:27: AssertionError: assert 'python -m pip install mimesis' in 'The mimesis module is required for this function.  Try:\\n  pip install mimesis'\n------------- generated xml file: /opt/receipts/reports/base-4.xml -------------\n============================= slowest 10 durations =============================\n\n(10 durations < 0.005s hidden.  Use -vv to show these durations.)\n=========================== short test summary info ============================\nSKIPPED [1] dask/tests/test_datasets.py:6: could not import 'mimesis': No module named 'mimesis'\nSKIPPED [1] dask/tests/test_datasets.py:15: could not import 'mimesis': No module named 'mimesis'\nSKIPPED [1] dask/tests/test_datasets.py:31: could not import 'mimesis': No module named 'mimesis'\nFAILED dask/tests/test_datasets.py::test_no_mimesis - AssertionError: assert ...\n========================= 1 failed, 3 skipped in 0.48s =========================\n","stderr_tail":"","stdout_sha256":"1d57ca03a5760ed79a859d8eec62855c55d679156dd41521e28d72991ceed7dd","log_path":"~/dev/nebius-hackathon/pilot/v2-P/dask__dask-5861/runs/pilot-dask__dask-5861-afdf49683a/logs/base/base-4.log","tree_digest":"4b196cdb29342db69b77f8ff0feeb169d04b7ede2fb1b66b893d5dab3f9ab359","tree_download_s":3.9955051250290126,"started_at":"2026-10-03T17:14:17.441407Z","duration_s":0.842253,"timed_out":false,"image_before":"c4abddc1-f52b-40bb-8b81-e321f66706d4","image_after":"08c136ef-76d1-4b57-bd6f-52c8772c7c8f","junit":{"passed":[],"failed":["dask/tests/test_datasets.py::test_no_mimesis"],"errors":[],"skipped":["dask/tests/test_datasets.py::test_mimesis","dask/tests/test_datasets.py::test_full_dataset","dask/tests/test_datasets.py::test_deterministic"],"collection_errors":[],"failure_text":{"dask/tests/test_datasets.py::test_no_mimesis":"AssertionError: assert 'python -m pip install mimesis' in 'The mimesis module is required for this function.  Try:\\n  pip install mimesis'\n +  where 'The mimesis module is required for this function.  Try:\\n  pip install mimesis' = str(RuntimeError('The mimesis module is required for this function.  Try:\\n  pip install mimesis'))\n +    where RuntimeError('The mimesis module is required for this function.  Try:\\n  pip install mimesis') = <ExceptionInfo RuntimeError('The mimesis module is required for this function.  Try:\\n  pip install mimesis') tblen=3>.value\nE   ModuleNotFoundError: No module named 'mimesis'\n\nDuring handling of the above exception, another exception occurred:\nE   AssertionError: assert 'python -m pip install mimesis' in 'The mimesis module is required for this function.  Try:\\n  pip install mimesis'\n     +  where 'The mimesis module is required for this function.  Try:\\n  pip install mimesis' = str(RuntimeError('The mimesis module is required for this function.  Try:\\n  pip install mimesis'))\n     +    where RuntimeError('The mimesis module is required for this function.  Try:\\n  pip install mimesis') = <ExceptionInfo RuntimeError('The mimesis module is required for this function.  Try:\\n  pip install mimesis') tblen=3>.value"}},"diff":null,"patch_sha256":null,"dropped_paths":[],"snapshot_sha":null}
{"receipt_id":"base-5","seq":5,"branch_id":"base","kind":"command","cmd":"python -c 'import base64\nimport hashlib\nimport json\nimport os\nfrom pathlib import Path\n\npayload = json.loads(base64.b64decode('\"'\"'eyJ0ZXN0X2ZpbGVzIjpbImRhc2svdGVzdHMvdGVzdF9kYXRhc2V0cy5weSJdLCJ0ZXN0X3Jvb3RzIjpbImRhc2svdGVzdHMiXSwiY29uZmlnX25hbWVzIjpbIi5weXRlc3QudG9tbCIsImNvbmZ0ZXN0LnB5IiwicHlwcm9qZWN0LnRvbWwiLCJweXRlc3QuaW5pIiwicHl0ZXN0LnRvbWwiLCJzZXR1cC5jZmciLCJ0b3guaW5pIl19'\"'\"'))\nexcluded = {'\"'\"'.git'\"'\"', '\"'\"'.venv'\"'\"', '\"'\"'__pycache__'\"'\"', '\"'\"'site-packages'\"'\"'}\n\ndef digest(path):\n    return hashlib.sha256(path.read_bytes()).hexdigest()\n\ntests = {}\nfor item in payload['\"'\"'test_files'\"'\"']:\n    path = Path(item)\n    if path.is_file():\n        tests[path.as_posix()] = digest(path)\nfor item in payload['\"'\"'test_roots'\"'\"']:\n    root = Path(item)\n    if not root.is_dir():\n        continue\n    for directory, names, filenames in os.walk(root, followlinks=False):\n        names[:] = sorted(name for name in names if name not in excluded)\n        for filename in sorted(filenames):\n            path = Path(directory, filename)\n            if path.is_file():\n                tests[path.as_posix()] = digest(path)\n\nconfigs = {}\nfor directory, names, filenames in os.walk('\"'\"'.'\"'\"', followlinks=False):\n    names[:] = sorted(name for name in names if name not in excluded)\n    for filename in sorted(filenames):\n        if filename not in payload['\"'\"'config_names'\"'\"']:\n            continue\n        path = Path(directory, filename)\n        rendered = path.as_posix()\n        rendered = rendered[2:] if rendered.startswith('\"'\"'./'\"'\"') else rendered\n        configs[rendered] = digest(path)\n\nprint(json.dumps({'\"'\"'test_digests'\"'\"': tests, '\"'\"'pytest_config_digests'\"'\"': configs}, sort_keys=True))\n'","path":null,"exit_code":0,"stdout_tail":"{\"pytest_config_digests\": {\"conftest.py\": \"16b90a0a1464abe2fb0fdcede97f5173ddc445fc3db6ddc49aa7287ea284b6d7\", \"setup.cfg\": \"1f8716248e53914b76774d01624f34d06fb211e713e44f0e5efa9f0dc93b6f06\"}, \"test_digests\": {\"dask/tests/__init__.py\": \"e3b0c44298fc1c149afbf4c8996fb92427ae41e4649b934ca495991b7852b855\", \"dask/tests/test_base.py\": \"b329f43678deb25c65113f01afd1102f13470ff3591c61b6c89b942c59604655\", \"dask/tests/test_cache.py\": \"5ecd2b919b8a3482be117ed2cccb8ae97cb0fe5a39c3741d3f9cf53c9007a00f\", \"dask/tests/test_callbacks.py\": \"e7213f2931872d72ffe885758f9df2c93754219a24735075e2331c9fd9719f5d\", \"dask/tests/test_config.py\": \"4623f44cec7eb7f83bffaf547943e4a9adb27a33bcadf3666c6450213c17f3b2\", \"dask/tests/test_context.py\": \"2444e54cebfd2ed801c31dfd4b1767f6df032b4d5c381ebc6a63d4dd89548cb2\", \"dask/tests/test_core.py\": \"50ea109737d88d06462c6c74b308d10a0bc52a75e3c5c2a3697bfceb2cbfc37f\", \"dask/tests/test_datasets.py\": \"8568574468f8fe534bc19780d4a5f19b2708e553a765178f84775934ab20f2f9\", \"dask/tests/test_delayed.py\": \"03efcc1c11a6ec32e1bf2d250bb4d3f817b0d149497226125750c92761a47f45\", \"dask/tests/test_distributed.py\": \"484badbcd4ff60399e5c89868b8b13fa6ee287d88348eacb23f827766649468a\", \"dask/tests/test_dot.py\": \"f13d5cd9265c4e10878fff6507763072fd121c9ea031f029fb6c5bf35936f85f\", \"dask/tests/test_hashing.py\": \"e1b5069da74ad2cc486df2089a65a886a7dd919c5ce51fb4580888b10013bb12\", \"dask/tests/test_highgraph.py\": \"943d61df4e01ea2a08338bc45ea77ca819d054a0fa0a9f48f035d14a9266d895\", \"dask/tests/test_local.py\": \"0699fa99793f5b9239aa0fe4b8a36f5c3c1ca1bd4eb307af9b91afdc62ac2136\", \"dask/tests/test_multiprocessing.py\": \"2e18c7023961b09753b44f8766d89f9eb7bdf6e2d0e14472585529ed299f7384\", \"dask/tests/test_optimization.py\": \"e45e15a008be5c8b96afd1f09d32fae9a81a727d9203f35a208ed191bc1e7c59\", \"dask/tests/test_order.py\": \"b6fb29b202521b0a311aff53565e9a1df80bc2dd5a42b2533729e1ae5f70d0a2\", \"dask/tests/test_rewrite.py\": \"181222832c858e1879a7d49cc9467bb9f4087db2fe9c69afd12e43de723bd42e\", \"dask/tests/test_sizeof.py\": \"8e2eb592ccb5972533ee53c61d1630601cdd925ca1b05cbfcfb6c09bddbb9fd5\", \"dask/tests/test_system.py\": \"6d107d420cc11a72375395c7f3dbe8235d8ff6adba4a7ded5df2c6b91b897900\", \"dask/tests/test_threaded.py\": \"80379597707abaee34e40cc141dba6efc3cdbffe6f9d44b914a2d10f2d4995f0\", \"dask/tests/test_utils.py\": \"f1c28af713d69172b33897e63a1de66218c78a64b4a965da175a24c083c25476\"}}\n","stderr_tail":"","stdout_sha256":"62be68fdf30ebfd82d5e361c3b8241640019676b8c6edf5c8df478ad6b42398c","log_path":"~/dev/nebius-hackathon/pilot/v2-P/dask__dask-5861/runs/pilot-dask__dask-5861-afdf49683a/logs/base/base-5.log","tree_digest":null,"tree_download_s":null,"started_at":"2026-10-03T17:14:24.777601Z","duration_s":0.032559000000000005,"timed_out":false,"image_before":"08c136ef-76d1-4b57-bd6f-52c8772c7c8f","image_after":"808850e5-4583-46f3-baa5-c7e2e3af6357","junit":null,"diff":null,"patch_sha256":null,"dropped_paths":[],"snapshot_sha":null}
{"receipt_id":"base-6","seq":6,"branch_id":"base","kind":"command","cmd":"python -c '# Runs inside the task sandbox, so it must work on Python 3.7.\npackages = set()\ntry:\n    import importlib.metadata as metadata\nexcept ImportError:\n    import pkg_resources\n\n    for dist in pkg_resources.working_set:\n        packages.add(dist.project_name + \"==\" + dist.version)\nelse:\n    for distribution in metadata.distributions():\n        name = distribution.metadata.get(\"Name\")\n        if name:\n            packages.add(name + \"==\" + distribution.version)\nprint(\"\\n\".join(sorted(packages, key=str.casefold)))\n'","path":null,"exit_code":0,"stdout_tail":"bokeh==3.8.2\nclick==8.3.1\ncloudpickle==3.1.2\ncontourpy==1.3.2\ndask==2.10.1+4.gf0b8bd477\ndistributed==2.30.1\nexceptiongroup==1.3.1\nfsspec==2026.2.0\niniconfig==2.3.0\nJinja2==3.1.6\nlocket==1.0.0\nMarkupSafe==3.0.3\nmsgpack==1.1.2\nnarwhals==2.16.0\nnumpy==2.2.6\npackaging==25.0\npandas==2.3.3\npartd==1.4.2\npillow==12.1.1\npip==25.3\npluggy==1.6.0\npsutil==7.2.2\nPygments==2.19.2\npytest==9.0.2\npython-dateutil==2.9.0.post0\npytz==2025.2\nPyYAML==6.0.3\nsetuptools==80.9.0\nsix==1.17.0\nsortedcontainers==2.4.0\ntblib==3.2.2\ntomli==2.3.0\ntoolz==1.1.0\ntornado==6.5.4\ntyping_extensions==4.15.0\ntzdata==2025.3\nwheel==0.45.1\nxyzservices==2025.11.0\nzict==3.0.0\n","stderr_tail":"","stdout_sha256":"7d6e197d2eb279bf2f58828cd87f56d0ee25aae8e4822e0f882a5a732d3a3fce","log_path":"~/dev/nebius-hackathon/pilot/v2-P/dask__dask-5861/runs/pilot-dask__dask-5861-afdf49683a/logs/base/base-6.log","tree_digest":null,"tree_download_s":null,"started_at":"2026-10-03T17:14:26.649008Z","duration_s":0.073919,"timed_out":false,"image_before":"808850e5-4583-46f3-baa5-c7e2e3af6357","image_after":"8aacbf23-185b-4c08-a68c-d9d6f7ac1a3d","junit":null,"diff":null,"patch_sha256":null,"dropped_paths":[],"snapshot_sha":null}
{"receipt_id":"base-7","seq":7,"branch_id":"base","kind":"command","cmd":"git add -A && git -c user.name=receipts -c user.email=receipts@localhost commit -q --allow-empty -m \"receipts snapshot\" && git rev-parse HEAD","path":null,"exit_code":0,"stdout_tail":"c9ecb16f0b3d94ddd8eb823129ab384f18a4eb02\n","stderr_tail":"","stdout_sha256":"4ee8804d2d17038e8ee16566cd4e3f4d38a3e48f5aa9b1053e726f308301d719","log_path":"~/dev/nebius-hackathon/pilot/v2-P/dask__dask-5861/runs/pilot-dask__dask-5861-afdf49683a/logs/base/base-7.log","tree_digest":null,"tree_download_s":null,"started_at":"2026-10-03T17:14:28.532839Z","duration_s":0.01601,"timed_out":false,"image_before":"8aacbf23-185b-4c08-a68c-d9d6f7ac1a3d","image_after":"9d728d5c-4fca-43b7-a805-a54af9e6485a","junit":null,"diff":null,"patch_sha256":null,"dropped_paths":[],"snapshot_sha":"c9ecb16f0b3d94ddd8eb823129ab384f18a4eb02"}
{"receipt_id":"base-8","seq":8,"branch_id":"base","kind":"command","cmd":"git -c core.quotePath=false ls-tree -z --name-only c9ecb16f0b3d94ddd8eb823129ab384f18a4eb02","path":null,"exit_code":0,"stdout_tail":".codecov.yml\u0000.coveragerc\u0000.github\u0000.gitignore\u0000.pre-commit-config.yaml\u0000.travis.yml\u0000CONTRIBUTING.md\u0000LICENSE.txt\u0000MANIFEST.in\u0000README.rst\u0000appveyor.yml\u0000conftest.py\u0000continuous_integration\u0000dask\u0000docs\u0000setup.cfg\u0000setup.py\u0000versioneer.py\u0000","stderr_tail":"","stdout_sha256":"5fdacdb6f4c4c381cd918fe7d4439f2fbff4c00d939e39e3b19ed46cdfd91342","log_path":"~/dev/nebius-hackathon/pilot/v2-P/dask__dask-5861/runs/pilot-dask__dask-5861-afdf49683a/logs/base/base-8.log","tree_digest":null,"tree_download_s":null,"started_at":"2026-10-03T17:14:30.434580Z","duration_s":0.0046,"timed_out":false,"image_before":"9d728d5c-4fca-43b7-a805-a54af9e6485a","image_after":"4228dcd6-9c43-4db6-b2de-a670aaa79880","junit":null,"diff":null,"patch_sha256":null,"dropped_paths":[],"snapshot_sha":null}
{"receipt_id":"base-9","seq":9,"branch_id":"base","kind":"command","cmd":"git -c core.quotePath=false ls-tree -z --name-only c9ecb16f0b3d94ddd8eb823129ab384f18a4eb02:src","path":null,"exit_code":128,"stdout_tail":"","stderr_tail":"fatal: Not a valid object name c9ecb16f0b3d94ddd8eb823129ab384f18a4eb02:src\n","stdout_sha256":"9be1fc81123d3d79a34592a48798536ac03c4fecb75a1a1bc046e4b6b6adade5","log_path":"~/dev/nebius-hackathon/pilot/v2-P/dask__dask-5861/runs/pilot-dask__dask-5861-afdf49683a/logs/base/base-9.log","tree_digest":null,"tree_download_s":null,"started_at":"2026-10-03T17:14:32.204494Z","duration_s":0.004221,"timed_out":false,"image_before":"4228dcd6-9c43-4db6-b2de-a670aaa79880","image_after":"fe3107cd-0686-4c32-9086-abbdaad7e43a","junit":null,"diff":null,"patch_sha256":null,"dropped_paths":[],"snapshot_sha":null}
