{"receipt_id":"agent1-1","seq":1,"branch_id":"agent1","kind":"command","cmd":"git ls-files -z","path":null,"exit_code":0,"stdout_tail":"lib/storage.py\u0000lib/testdata.py\u0000lib/tests.py\u0000lib/typing.py\u0000lib/validators.py\u0000lib/viewbase.py\u0000lib/widgets.py\u0000lint.sh\u0000locale/en/LC_MESSAGES/django.po\u0000locale/fi/LC_MESSAGES/django.po\u0000lti_tool/__init__.py\u0000lti_tool/templates/lti_tool/course_list.html\u0000lti_tool/templates/lti_tool/exercise_list.html\u0000lti_tool/templates/lti_tool/lti_base.html\u0000lti_tool/templates/lti_tool/lti_course.html\u0000lti_tool/templates/lti_tool/lti_exercise.html\u0000lti_tool/templates/lti_tool/lti_module.html\u0000lti_tool/templates/lti_tool/lti_submission.html\u0000lti_tool/templates/lti_tool/module_list.html\u0000lti_tool/urls.py\u0000lti_tool/utils.py\u0000lti_tool/views.py\u0000manage.py\u0000news/__init__.py\u0000news/admin.py\u0000news/cache.py\u0000news/forms.py\u0000news/migrations/0001_initial.py\u0000news/migrations/0002_remove_news_alert.py\u0000news/migrations/0003_alter_news_audience.py\u0000news/migrations/0004_auto_20210812_1536.py\u0000news/migrations/0005_news_language.py\u0000news/migrations/__init__.py\u0000news/models.py\u0000news/templates/news/edit.html\u0000news/templates/news/list.html\u0000news/templates/news/user_news.html\u0000news/templatetags/__init__.py\u0000news/templatetags/news.py\u0000news/urls.py\u0000news/views.py\u0000notification/__init__.py\u0000notification/admin.py\u0000notification/cache.py\u0000notification/management/commands/delete_notifications.py\u0000notification/migrations/0001_initial.py\u0000notification/migrations/0002_auto_20160912_1341.py\u0000notification/migrations/0003_auto_20160914_1051.py\u0000notification/migrations/0004_auto_20190426_1731.py\u0000notification/migrations/0005_auto_20210812_1536.py\u0000notification/migrations/__init__.py\u0000notification/models.py\u0000notification/templates/notification/_notification_menu.html\u0000notification/templates/notification/_notification_messages.html\u0000notification/templatetags/__init__.py\u0000notification/templatetags/notification.py\u0000notification/tests.py\u0000notification/urls.py\u0000notification/views.py\u0000pytest.ini\u0000redirect_old_urls/__init__.py\u0000redirect_old_urls/tests.py\u0000redirect_old_urls/urls.py\u0000redirect_old_urls/views.py\u0000requirements.txt\u0000requirements_prod.txt\u0000requirements_testing.txt\u0000selenium_test/README.md\u0000selenium_test/add_users.py\u0000selenium_test/grader/exercises/__init__.py\u0000selenium_test/grader/exercises/templates/exercises/ajax_exercise.html\u0000selenium_test/grader/exercises/templates/exercises/file_exercise.html\u0000selenium_test/grader/exercises/templates/exercises/file_result.html\u0000selenium_test/grader/exercises/templates/exercises/first_exercise.html\u0000selenium_test/grader/exercises/templates/exercises/first_result.html\u0000selenium_test/grader/exercises/views.py\u0000selenium_test/grader/grader/__init__.py\u0000selenium_test/grader/grader/settings.py\u0000selenium_test/grader/grader/urls.py\u0000selenium_test/grader/grader/wsgi.py\u0000selenium_test/grader/manage.py\u0000selenium_test/kill_servers.sh\u0000selenium_test/run_servers.sh\u0000selenium_test/run_servers_and_tests.sh\u0000selenium_test/test/edit_exercise_page_test.py\u0000selenium_test/test/edit_module_page_test.py\u0000selenium_test/test/file_upload_grader_test.py\u0000selenium_test/test/home_page_test.py\u0000selenium_test/test/locators.py\u0000selenium_test/test/login_test.py\u0000selenium_test/test/main_navigation_test.py\u0000selenium_test/test/my_ajax_exercise_grader_test.py\u0000selenium_test/test/my_first_exercise_test.py\u0000selenium_test/test/page_objects.py\u0000selenium_test/test/submissions_page_test.py\u0000selenium_test/test/teacher_feedback_test.py\u0000selenium_test/test/teacher_list_test.py\u0000selenium_test/test/test_initializer.py\u0000selenium_test/test/user_permissions_test.py\u0000selenium_test/test_data.json\u0000shibboleth_login/__init__.py\u0000shibboleth_login/apps.py\u0000shibboleth_login/auth_backend.py\u0000shibboleth_login/parser.py\u0000shibboleth_login/templates/shibboleth/meta.html\u0000shibboleth_login/tests.py\u0000shibboleth_login/urls.py\u0000shibboleth_login/views.py\u0000site_alert/__init__.py\u0000site_alert/admin.py\u0000site_alert/apps.py\u0000site_alert/migrations/0001_initial.py\u0000site_alert/migrations/__init__.py\u0000site_alert/models.py\u0000templates/403.html\u0000templates/404.html\u0000templates/500.html\u0000templates/_messages.html\u0000templates/accessibility_issues_en.html\u0000templates/accessibility_issues_fi.html\u0000templates/ajax_search_select.html\u0000templates/base.html\u0000templates/institution_accessibility_text_en.html\u0000templates/institution_accessibility_text_fi.html\u0000templates/privacy_notice_en.html\u0000templates/privacy_notice_fi.html\u0000templates/support_channels.html\u0000threshold/__init__.py\u0000threshold/admin.py\u0000threshold/migrations/0001_initial.py\u0000threshold/migrations/0002_alter_threshold_consume_harder_points.py\u0000threshold/migrations/0003_auto_20210812_1536.py\u0000threshold/migrations/__init__.py\u0000threshold/models.py\u0000threshold/tests.py\u0000threshold/views.py\u0000userprofile/__init__.py\u0000userprofile/admin.py\u0000userprofile/api/__init__.py\u0000userprofile/api/full_serializers.py\u0000userprofile/api/serializers.py\u0000userprofile/api/tests.py\u0000userprofile/api/views.py\u0000userprofile/management/__init__.py\u0000userprofile/management/commands/__init__.py\u0000userprofile/management/commands/count_active_users.py\u0000userprofile/management/commands/delete_users.py\u0000userprofile/management/commands/set_superuser.py\u0000userprofile/migrations/0001_initial.py\u0000userprofile/migrations/0002_auto_20150427_1717.py\u0000userprofile/migrations/0003_auto_20160728_1139.py\u0000userprofile/migrations/0004_auto_20200721_1422.py\u0000userprofile/migrations/0005_userprofile_organization.py\u0000userprofile/migrations/0006_auto_20210812_1536.py\u0000userprofile/migrations/__init__.py\u0000userprofile/models.py\u0000userprofile/permissions.py\u0000userprofile/pseudonymize.py\u0000userprofile/sitemaps.py\u0000userprofile/static/userprofile/copy_token.js\u0000userprofile/static/userprofile/extra_logins.js\u0000userprofile/static/userprofile/local_storage_external_services.js\u0000userprofile/static/userprofile/login.css\u0000userprofile/static/userprofile/teachers.js\u0000userprofile/templates/userprofile/accessibility.html\u0000userprofile/templates/userprofile/login.html\u0000userprofile/templates/userprofile/logout.html\u0000userprofile/templates/userprofile/privacy.html\u0000userprofile/templates/userprofile/profile.html\u0000userprofile/templates/userprofile/support.html\u0000userprofile/templates/userprofile/teachers.html\u0000userprofile/tests.py\u0000userprofile/urls.py\u0000userprofile/viewbase.py\u0000userprofile/views.py\u0000","stderr_tail":"","stdout_sha256":"29182c39dd6fdc39c27ac16f03fed9f5840ac14b9f93aee204da96f90b8bc3e5","log_path":"~/dev/nebius-hackathon/pilot/v2-P/apluslms__a-plus-1199/runs/pilot-apluslms__a-plus-1199-4caba45e35/logs/agent1/agent1-1.log","tree_digest":null,"tree_download_s":null,"started_at":"2026-10-03T18:59:00.423443Z","duration_s":0.0034720000000000003,"timed_out":false,"image_before":"d2c69433-5114-450c-89f1-b385aaadc323","image_after":"eadf590d-c762-4210-8686-f0d60df2b949","junit":null,"diff":null,"patch_sha256":null,"dropped_paths":[],"snapshot_sha":null}
{"receipt_id":"agent1-2","seq":2,"branch_id":"agent1","kind":"command","cmd":"grep -n \"test_next_unassessed_submitter_view\" exercise/tests.py","path":null,"exit_code":0,"stdout_tail":"1517:    def test_next_unassessed_submitter_view(self):\n","stderr_tail":"","stdout_sha256":"f8f2d339f40daff34dc102c341ff4a310fb2fa6f87842945df10f54b88cf188c","log_path":"~/dev/nebius-hackathon/pilot/v2-P/apluslms__a-plus-1199/runs/pilot-apluslms__a-plus-1199-4caba45e35/logs/agent1/agent1-2.log","tree_digest":null,"tree_download_s":null,"started_at":"2026-10-03T18:59:14.857724Z","duration_s":0.002835,"timed_out":false,"image_before":"eadf590d-c762-4210-8686-f0d60df2b949","image_after":"3dbbec9c-1e90-47c6-a5a6-e5ee3f88a5d5","junit":null,"diff":null,"patch_sha256":null,"dropped_paths":[],"snapshot_sha":null}
{"receipt_id":"agent1-3","seq":3,"branch_id":"agent1","kind":"command","cmd":"grep -n \"class NextUnassessedSubmitterView\" exercise/staff_views.py","path":null,"exit_code":0,"stdout_tail":"336:class NextUnassessedSubmitterView(ExerciseBaseView, BaseRedirectView):\n","stderr_tail":"","stdout_sha256":"bec6a73652443441521bd78550a68438ad6fcd8e33e1ca07c3f7515c44f97490","log_path":"~/dev/nebius-hackathon/pilot/v2-P/apluslms__a-plus-1199/runs/pilot-apluslms__a-plus-1199-4caba45e35/logs/agent1/agent1-3.log","tree_digest":null,"tree_download_s":null,"started_at":"2026-10-03T18:59:20.624746Z","duration_s":0.0031520000000000003,"timed_out":false,"image_before":"3dbbec9c-1e90-47c6-a5a6-e5ee3f88a5d5","image_after":"bfef1f82-86aa-4d07-9fe9-737cb15deb14","junit":null,"diff":null,"patch_sha256":null,"dropped_paths":[],"snapshot_sha":null}
{"receipt_id":"agent1-4","seq":4,"branch_id":"agent1","kind":"write","cmd":"/opt/receipts-e9952989cbf7400b97d84af43d4eff32/bin/busybox sh -c 'mkdir -p /a-plus/exercise && cp /opt/receipts-e9952989cbf7400b97d84af43d4eff32/incoming/61a5828827fd15ab1e9b257458454246edde164d9d4f5ebcdbf92f82a2930826 /a-plus/exercise/staff_views.py'","path":"exercise/staff_views.py","exit_code":0,"stdout_tail":"","stderr_tail":"","stdout_sha256":"61a5828827fd15ab1e9b257458454246edde164d9d4f5ebcdbf92f82a2930826","log_path":"~/dev/nebius-hackathon/pilot/v2-P/apluslms__a-plus-1199/runs/pilot-apluslms__a-plus-1199-4caba45e35/logs/agent1/agent1-4.log","tree_digest":null,"tree_download_s":null,"started_at":"2026-10-03T18:59:29.700680Z","duration_s":0.004428,"timed_out":false,"image_before":"bfef1f82-86aa-4d07-9fe9-737cb15deb14","image_after":"f39edb98-f136-4f94-ad27-eab4e308e339","junit":null,"diff":null,"patch_sha256":null,"dropped_paths":[],"snapshot_sha":null}
{"receipt_id":"agent1-5","seq":5,"branch_id":"agent1","kind":"command","cmd":"cd /tmp && python -m exercise.tests ExerciseTest.test_next_unassessed_submitter_view","path":null,"exit_code":1,"stdout_tail":"","stderr_tail":"/usr/local/bin/python: Error while finding module specification for 'exercise.tests' (ModuleNotFoundError: No module named 'exercise')\n","stdout_sha256":"2d9f4255455142a4f0bee2543494e6a9e42b8f4bfc7a22db089e6b37c685b6bf","log_path":"~/dev/nebius-hackathon/pilot/v2-P/apluslms__a-plus-1199/runs/pilot-apluslms__a-plus-1199-4caba45e35/logs/agent1/agent1-5.log","tree_digest":null,"tree_download_s":null,"started_at":"2026-10-03T18:59:33.763643Z","duration_s":0.016797,"timed_out":false,"image_before":"f39edb98-f136-4f94-ad27-eab4e308e339","image_after":"0486ed3d-2e71-44fa-b79c-da56de4e8abf","junit":null,"diff":null,"patch_sha256":null,"dropped_paths":[],"snapshot_sha":null}
{"receipt_id":"agent1-6","seq":6,"branch_id":"agent1","kind":"command","cmd":"cd /app && python -m pytest exercise/tests.py::ExerciseTest::test_next_unassessed_submitter_view -v","path":null,"exit_code":2,"stdout_tail":"","stderr_tail":"/bin/sh: 1: cd: can't cd to /app\n","stdout_sha256":"db1fdcac91536841f223e634a3107f3890ca8e21145172d6cb7746e3eeeb453c","log_path":"~/dev/nebius-hackathon/pilot/v2-P/apluslms__a-plus-1199/runs/pilot-apluslms__a-plus-1199-4caba45e35/logs/agent1/agent1-6.log","tree_digest":null,"tree_download_s":null,"started_at":"2026-10-03T18:59:35.910802Z","duration_s":0.001531,"timed_out":false,"image_before":"0486ed3d-2e71-44fa-b79c-da56de4e8abf","image_after":"c607235c-db6a-46a0-9e21-baf340a64ecc","junit":null,"diff":null,"patch_sha256":null,"dropped_paths":[],"snapshot_sha":null}
{"receipt_id":"agent1-7","seq":7,"branch_id":"agent1","kind":"command","cmd":"pwd && ls -la","path":null,"exit_code":0,"stdout_tail":"/a-plus\ntotal 92\ndrwxrwxrwx 1 root root   926 Oct  3 18:57 .\ndrwxr-xr-x 1 root root   162 Apr 29 22:45 ..\n-rw-r--r-- 1 root root   531 Feb 22  2026 .drone.yml\n-rw-r--r-- 1 root root   839 Feb 22  2026 .editorconfig\ndrwxrwxrwx 1 root root   184 Oct  3 18:58 .git\ndrwxrwxrwx 1 root root    18 Apr 29 22:45 .github\n-rw-r--r-- 1 root root   505 Feb 22  2026 .gitignore\n-rw-r--r-- 1 root root   583 Feb 22  2026 .prospector.yaml\n-rw-r--r-- 1 root root 35179 Feb 22  2026 LICENSE.md\n-rw-r--r-- 1 root root  3114 Feb 22  2026 README.md\nlrwxrwxrwx 1 root root     5 Apr 29 22:45 a-plus -> aplus\ndrwxrwxrwx 1 root root    42 Apr 29 22:45 api\ndrwxrwxrwx 1 root root   224 Oct  3 18:57 aplus\ndrwxrwxrwx 1 root root   196 Apr 29 22:45 apps\ndrwxrwxrwx 1 root root   134 Apr 29 22:45 assets\ndrwxrwxrwx 1 root root    66 Apr 29 22:45 assets_src\ndrwxrwxrwx 1 root root   178 Apr 29 22:45 authorization\ndrwxrwxrwx 1 root root   482 Apr 29 22:45 course\n-rwxr-xr-x 1 root root   561 Feb 22  2026 dev_assets_run_npm.sh\n-rwxr-xr-x 1 root root   283 Feb 22  2026 dev_assets_watch_sass.sh\ndrwxrwxrwx 1 root root   202 Apr 29 22:45 deviations\ndrwxrwxrwx 1 root root   192 Apr 29 22:45 diploma\ndrwxrwxrwx 1 root root   696 Apr 29 22:45 doc\ndrwxrwxrwx 1 root root   210 Apr 29 22:45 e2e_tests\ndrwxrwxrwx 1 root root   294 Apr 29 22:45 edit_course\ndrwxrwxrwx 1 root root   612 Oct  3 18:57 exercise\ndrwxrwxrwx 1 root root   292 Apr 29 22:45 external_services\ndrwxrwxrwx 1 root root    60 Apr 29 22:45 inheritance\ndrwxrwxrwx 1 root root   552 Apr 29 22:45 lib\n-rwxr-xr-x 1 root root   163 Feb 22  2026 lint.sh\ndrwxrwxrwx 1 root root     8 Apr 29 22:45 locale\ndrwxrwxrwx 1 root root    86 Apr 29 22:45 lti_tool\n-rwxrwxrwx 1 root root   617 Feb 22  2026 manage.py\ndrwxr-xr-x 1 root root    34 Oct  3 18:57 media\ndrwxrwxrwx 1 root root   180 Apr 29 22:45 news\ndrwxrwxrwx 1 root root   200 Apr 29 22:45 notification\n-rw-r--r-- 1 root root   351 Feb 22  2026 pytest.ini\ndrwxrwxrwx 1 root root    68 Apr 29 22:45 redirect_old_urls\n-rw-r--r-- 1 root root  1229 Feb 22  2026 requirements.txt\n-rw-r--r-- 1 root root   359 Feb 22  2026 requirements_prod.txt\n-rw-r--r-- 1 root root   198 Feb 22  2026 requirements_testing.txt\ndrwxrwxrwx 1 root root   196 Apr 29 22:45 selenium_test\ndrwxrwxrwx 1 root root   148 Apr 29 22:45 shibboleth_login\ndrwxrwxrwx 1 root root    90 Apr 29 22:45 site_alert\ndrwxrwxrwx 1 root root   534 Apr 29 22:45 templates\ndrwxrwxrwx 1 root root   108 Apr 29 22:45 threshold\ndrwxrwxrwx 1 root root   280 Apr 29 22:45 userprofile\n","stderr_tail":"","stdout_sha256":"a9886cf7cbf5fed6931828328d74a5f8bdd5b8d604dcd36507faacf96a8c3448","log_path":"~/dev/nebius-hackathon/pilot/v2-P/apluslms__a-plus-1199/runs/pilot-apluslms__a-plus-1199-4caba45e35/logs/agent1/agent1-7.log","tree_digest":null,"tree_download_s":null,"started_at":"2026-10-03T18:59:38.263399Z","duration_s":0.004078,"timed_out":false,"image_before":"c607235c-db6a-46a0-9e21-baf340a64ecc","image_after":"32c25187-ae37-494e-a453-9f700013341c","junit":null,"diff":null,"patch_sha256":null,"dropped_paths":[],"snapshot_sha":null}
{"receipt_id":"agent1-8","seq":8,"branch_id":"agent1","kind":"command","cmd":"/opt/receipts-6372a3a8867b46acb154e64c56b85625/bin/busybox mkdir -p /opt/receipts/reports && python -I /opt/receipts-6372a3a8867b46acb154e64c56b85625/receipts_pytest.py exercise/tests.py::ExerciseTest::test_next_unassessed_submitter_view -v --no-header -rA --tb=line --color=no -p no:cacheprovider -W ignore::DeprecationWarning -o junit_family=xunit1 -p no:cacheprovider -rA --continue-on-collection-errors --junitxml=/opt/receipts/reports/agent1-8.xml","path":null,"exit_code":1,"stdout_tail":"============================= test session starts ==============================\ncollecting ... collected 1 item\n\nexercise/tests.py::ExerciseTest::test_next_unassessed_submitter_view FAILED [100%]\n\n=================================== FAILURES ===================================\nE   AssertionError: 8 != 7\n---------------------------- Captured stderr setup -----------------------------\nCreating test database for alias 'default'...\n----------------------------- Captured stdout call -----------------------------\n[2026-10-03 21:59:53,034: INFO/logging] CEF:0|Aalto|aplus|1.23.1|login||5|\n------------------------------ Captured log call -------------------------------\nINFO     aplus.security:logging.py:46 CEF:0|Aalto|aplus|1.23.1|login||5|\n/usr/local/lib/python3.10/unittest/case.py:838: AssertionError: 8 != 7\n=============================== warnings summary ===============================\n../usr/local/lib/python3.10/site-packages/requests/__init__.py:113\n  /usr/local/lib/python3.10/site-packages/requests/__init__.py:113: RequestsDependencyWarning: urllib3 (2.6.3) or chardet (6.0.0dev0)/charset_normalizer (3.4.4) doesn't match a supported version!\n    warnings.warn(\n\n../usr/local/lib/python3.10/site-packages/model_utils/__init__.py:1\n  /usr/local/lib/python3.10/site-packages/model_utils/__init__.py:1: UserWarning: pkg_resources is deprecated as an API. See https://setuptools.pypa.io/en/latest/pkg_resources.html. The pkg_resources package is slated for removal as early as 2025-11-30. Refrain from using this package or pin to Setuptools<81.\n    from pkg_resources import DistributionNotFound, get_distribution\n\nexercise/tests.py: 225 warnings\n  /usr/local/lib/python3.10/site-packages/django/db/models/options.py:210: RemovedInDjango51Warning: 'index_together' is deprecated. Use 'Meta.indexes' in 'course.UserTagging' instead.\n    warnings.warn(\n\n-- Docs: https://docs.pytest.org/en/stable/how-to/capture-warnings.html\n------------ generated xml file: /opt/receipts/reports/agent1-8.xml ------------\n=========================== short test summary info ============================\nFAILED exercise/tests.py::ExerciseTest::test_next_unassessed_submitter_view\n======================= 1 failed, 227 warnings in 9.04s ========================\n","stderr_tail":"","stdout_sha256":"1f60134c909a5baa70be1624e313e725fdcd3a5a82ffc1203c74877a687c43a7","log_path":"~/dev/nebius-hackathon/pilot/v2-P/apluslms__a-plus-1199/runs/pilot-apluslms__a-plus-1199-4caba45e35/logs/agent1/agent1-8.log","tree_digest":"727f29520b0980affd6c6114656b9592e18e203047b2582d4d79d9eaa9923afa","tree_download_s":21.177540082950145,"started_at":"2026-10-03T18:59:40.762221Z","duration_s":12.221521,"timed_out":false,"image_before":"32c25187-ae37-494e-a453-9f700013341c","image_after":"fc8ea314-7a1d-4fbd-8651-18487b6d0374","junit":{"passed":[],"failed":["exercise/tests.py::ExerciseTest::test_next_unassessed_submitter_view"],"errors":[],"skipped":[],"collection_errors":[],"failure_text":{"exercise/tests.py::ExerciseTest::test_next_unassessed_submitter_view":"AssertionError: 8 != 7\nE   AssertionError: 8 != 7"}},"diff":null,"patch_sha256":null,"dropped_paths":[],"snapshot_sha":null}
{"receipt_id":"agent1-9","seq":9,"branch_id":"agent1","kind":"write","cmd":"/opt/receipts-2de4de4f09a44b6a864a01a45ffb48d8/bin/busybox sh -c 'mkdir -p /a-plus/exercise && cp /opt/receipts-2de4de4f09a44b6a864a01a45ffb48d8/incoming/47ebebf2d7a2f12ddc422f8b5555daabd5abe76c337ed7fa51eac12c599fc362 /a-plus/exercise/staff_views.py'","path":"exercise/staff_views.py","exit_code":0,"stdout_tail":"","stderr_tail":"","stdout_sha256":"47ebebf2d7a2f12ddc422f8b5555daabd5abe76c337ed7fa51eac12c599fc362","log_path":"~/dev/nebius-hackathon/pilot/v2-P/apluslms__a-plus-1199/runs/pilot-apluslms__a-plus-1199-4caba45e35/logs/agent1/agent1-9.log","tree_digest":null,"tree_download_s":null,"started_at":"2026-10-03T19:00:29.853806Z","duration_s":0.004667,"timed_out":false,"image_before":"fc8ea314-7a1d-4fbd-8651-18487b6d0374","image_after":"8d3c2782-3003-4966-8cf3-6b2e1fd8cd87","junit":null,"diff":null,"patch_sha256":null,"dropped_paths":[],"snapshot_sha":null}
{"receipt_id":"agent1-10","seq":10,"branch_id":"agent1","kind":"write","cmd":"/opt/receipts-a96deabd81bd42dab6034998e3ca6725/bin/busybox sh -c 'mkdir -p /a-plus/exercise && cp /opt/receipts-a96deabd81bd42dab6034998e3ca6725/incoming/a4bef85fc6b94a088b95dd10cc212e27d9476dab8e970ca815a6f7fa3bfdce69 /a-plus/exercise/staff_views.py'","path":"exercise/staff_views.py","exit_code":0,"stdout_tail":"","stderr_tail":"","stdout_sha256":"a4bef85fc6b94a088b95dd10cc212e27d9476dab8e970ca815a6f7fa3bfdce69","log_path":"~/dev/nebius-hackathon/pilot/v2-P/apluslms__a-plus-1199/runs/pilot-apluslms__a-plus-1199-4caba45e35/logs/agent1/agent1-10.log","tree_digest":null,"tree_download_s":null,"started_at":"2026-10-03T19:00:52.684236Z","duration_s":0.004639,"timed_out":false,"image_before":"8d3c2782-3003-4966-8cf3-6b2e1fd8cd87","image_after":"a89d7737-2f2f-4d77-9133-70d512e603cc","junit":null,"diff":null,"patch_sha256":null,"dropped_paths":[],"snapshot_sha":null}
{"receipt_id":"agent1-11","seq":11,"branch_id":"agent1","kind":"command","cmd":"/opt/receipts-f033d9f3ba5141a5800e40af241da4f7/bin/busybox mkdir -p /opt/receipts/reports && python -I /opt/receipts-f033d9f3ba5141a5800e40af241da4f7/receipts_pytest.py exercise/tests.py::ExerciseTest::test_next_unassessed_submitter_view -v --no-header -rA --tb=line --color=no -p no:cacheprovider -W ignore::DeprecationWarning -o junit_family=xunit1 -p no:cacheprovider -rA --continue-on-collection-errors --junitxml=/opt/receipts/reports/agent1-11.xml","path":null,"exit_code":1,"stdout_tail":"============================= test session starts ==============================\ncollecting ... collected 1 item\n\nexercise/tests.py::ExerciseTest::test_next_unassessed_submitter_view FAILED [100%]\n\n=================================== FAILURES ===================================\nE   AssertionError: 8 != 7\n---------------------------- Captured stderr setup -----------------------------\nCreating test database for alias 'default'...\n----------------------------- Captured stdout call -----------------------------\n[2026-10-03 22:01:09,199: INFO/logging] CEF:0|Aalto|aplus|1.23.1|login||5|\n------------------------------ Captured log call -------------------------------\nINFO     aplus.security:logging.py:46 CEF:0|Aalto|aplus|1.23.1|login||5|\n/usr/local/lib/python3.10/unittest/case.py:838: AssertionError: 8 != 7\n=============================== warnings summary ===============================\n../usr/local/lib/python3.10/site-packages/requests/__init__.py:113\n  /usr/local/lib/python3.10/site-packages/requests/__init__.py:113: RequestsDependencyWarning: urllib3 (2.6.3) or chardet (6.0.0dev0)/charset_normalizer (3.4.4) doesn't match a supported version!\n    warnings.warn(\n\n../usr/local/lib/python3.10/site-packages/model_utils/__init__.py:1\n  /usr/local/lib/python3.10/site-packages/model_utils/__init__.py:1: UserWarning: pkg_resources is deprecated as an API. See https://setuptools.pypa.io/en/latest/pkg_resources.html. The pkg_resources package is slated for removal as early as 2025-11-30. Refrain from using this package or pin to Setuptools<81.\n    from pkg_resources import DistributionNotFound, get_distribution\n\nexercise/tests.py: 225 warnings\n  /usr/local/lib/python3.10/site-packages/django/db/models/options.py:210: RemovedInDjango51Warning: 'index_together' is deprecated. Use 'Meta.indexes' in 'course.UserTagging' instead.\n    warnings.warn(\n\n-- Docs: https://docs.pytest.org/en/stable/how-to/capture-warnings.html\n----------- generated xml file: /opt/receipts/reports/agent1-11.xml ------------\n=========================== short test summary info ============================\nFAILED exercise/tests.py::ExerciseTest::test_next_unassessed_submitter_view\n======================= 1 failed, 227 warnings in 9.13s ========================\n","stderr_tail":"","stdout_sha256":"4aba9393da04ee1f61ac9c3932ea411014ccdc734b5b9b90584aa0f75b39caa3","log_path":"~/dev/nebius-hackathon/pilot/v2-P/apluslms__a-plus-1199/runs/pilot-apluslms__a-plus-1199-4caba45e35/logs/agent1/agent1-11.log","tree_digest":"6c86ef87c62cc34f30a49585d219fbd51a34d6977927404776e0464c470ef5f7","tree_download_s":4.345590125070885,"started_at":"2026-10-03T19:00:56.448359Z","duration_s":12.345327000000001,"timed_out":false,"image_before":"a89d7737-2f2f-4d77-9133-70d512e603cc","image_after":"0f7f1f39-2fcd-417d-832f-7a65cb34117b","junit":{"passed":[],"failed":["exercise/tests.py::ExerciseTest::test_next_unassessed_submitter_view"],"errors":[],"skipped":[],"collection_errors":[],"failure_text":{"exercise/tests.py::ExerciseTest::test_next_unassessed_submitter_view":"AssertionError: 8 != 7\nE   AssertionError: 8 != 7"}},"diff":null,"patch_sha256":null,"dropped_paths":[],"snapshot_sha":null}
{"receipt_id":"agent1-12","seq":12,"branch_id":"agent1","kind":"write","cmd":"/opt/receipts-7f6a6753757c4321acb82213ed195f16/bin/busybox sh -c 'mkdir -p /a-plus/exercise && cp /opt/receipts-7f6a6753757c4321acb82213ed195f16/incoming/027e36ba9bcf54149f39d85826a0d4ede47a140c5b85296887e3834f4e378f77 /a-plus/exercise/staff_views.py'","path":"exercise/staff_views.py","exit_code":0,"stdout_tail":"","stderr_tail":"","stdout_sha256":"027e36ba9bcf54149f39d85826a0d4ede47a140c5b85296887e3834f4e378f77","log_path":"~/dev/nebius-hackathon/pilot/v2-P/apluslms__a-plus-1199/runs/pilot-apluslms__a-plus-1199-4caba45e35/logs/agent1/agent1-12.log","tree_digest":null,"tree_download_s":null,"started_at":"2026-10-03T19:01:28.934563Z","duration_s":0.004723,"timed_out":false,"image_before":"0f7f1f39-2fcd-417d-832f-7a65cb34117b","image_after":"4835f7fc-f97c-42ea-8236-eaf3363c51af","junit":null,"diff":null,"patch_sha256":null,"dropped_paths":[],"snapshot_sha":null}
{"receipt_id":"agent1-13","seq":13,"branch_id":"agent1","kind":"command","cmd":"/opt/receipts-532e7e0a63ab4d27a8c62cc897d013e3/bin/busybox mkdir -p /opt/receipts/reports && python -I /opt/receipts-532e7e0a63ab4d27a8c62cc897d013e3/receipts_pytest.py exercise/tests.py::ExerciseTest::test_next_unassessed_submitter_view -v --no-header -rA --tb=line --color=no -p no:cacheprovider -W ignore::DeprecationWarning -o junit_family=xunit1 -p no:cacheprovider -rA --continue-on-collection-errors --junitxml=/opt/receipts/reports/agent1-13.xml","path":null,"exit_code":1,"stdout_tail":"============================= test session starts ==============================\ncollecting ... collected 1 item\n\nexercise/tests.py::ExerciseTest::test_next_unassessed_submitter_view FAILED [100%]\n\n=================================== FAILURES ===================================\nE   django.core.exceptions.FieldError: Cannot resolve keyword 'submitter' into field. Choices are: assistant_feedback, exercise, exercise_id, feedback, files, force_exercise_points, grade, grader, grader_id, grading_data, grading_time, hash, id, late_penalty_applied, meta_data, notifications, pendingsubmission, service_max_points, service_points, status, submission_data, submission_time, submitters, unofficial_submission_type\n\nDuring handling of the above exception, another exception occurred:\nE   KeyError: 'request'\n\nDuring handling of the above exception, another exception occurred:\nE   KeyError: 'request'\n\nDuring handling of the above exception, another exception occurred:\nE   KeyError: 'request'\n\nDuring handling of the above exception, another exception occurred:\nE   KeyError: 'request'\n\nDuring handling of the above exception, another exception occurred:\nE   KeyError: 'request'\n\nDuring handling of the above exception, another exception occurred:\nE   KeyError: 'request'\n\nDuring handling of the above exception, another exception occurred:\nE   KeyError: 'request'\n\nDuring handling of the above exception, another exception occurred:\nE   KeyError: 'request'\n\nDuring handling of the above exception, another exception occurred:\nE   KeyError: 'request'\n\nDuring handling of the above exception, another exception occurred:\nE   KeyError: 'request'\n\nDuring handling of the above exception, another exception occurred:\nE   KeyError: 'request'\n---------------------------- Captured stderr setup -----------------------------\nCreating test database for alias 'default'...\n----------------------------- Captured stdout call -----------------------------\n[2026-10-03 22:01:44,040: INFO/logging] CEF:0|Aalto|aplus|1.23.1|login||5|\n------------------------------ Captured log call -------------------------------\nINFO     aplus.security:logging.py:46 CEF:0|Aalto|aplus|1.23.1|login||5|\n/usr/local/lib/python3.10/site-packages/django/template/context.py:83: KeyError: 'request'\n=============================== warnings summary ===============================\n../usr/local/lib/python3.10/site-packages/requests/__init__.py:113\n  /usr/local/lib/python3.10/site-packages/requests/__init__.py:113: RequestsDependencyWarning: urllib3 (2.6.3) or chardet (6.0.0dev0)/charset_normalizer (3.4.4) doesn't match a supported version!\n    warnings.warn(\n\n../usr/local/lib/python3.10/site-packages/model_utils/__init__.py:1\n  /usr/local/lib/python3.10/site-packages/model_utils/__init__.py:1: UserWarning: pkg_resources is deprecated as an API. See https://setuptools.pypa.io/en/latest/pkg_resources.html. The pkg_resources package is slated for removal as early as 2025-11-30. Refrain from using this package or pin to Setuptools<81.\n    from pkg_resources import DistributionNotFound, get_distribution\n\nexercise/tests.py: 225 warnings\n  /usr/local/lib/python3.10/site-packages/django/db/models/options.py:210: RemovedInDjango51Warning: 'index_together' is deprecated. Use 'Meta.indexes' in 'course.UserTagging' instead.\n    warnings.warn(\n\n-- Docs: https://docs.pytest.org/en/stable/how-to/capture-warnings.html\n----------- generated xml file: /opt/receipts/reports/agent1-13.xml ------------\n=========================== short test summary info ============================\nFAILED exercise/tests.py::ExerciseTest::test_next_unassessed_submitter_view\n======================= 1 failed, 227 warnings in 8.93s ========================\n","stderr_tail":"","stdout_sha256":"afb48c7eeef4d9312447197dd7fc62b5137c11289ff875c13d03cbc15caa864d","log_path":"~/dev/nebius-hackathon/pilot/v2-P/apluslms__a-plus-1199/runs/pilot-apluslms__a-plus-1199-4caba45e35/logs/agent1/agent1-13.log","tree_digest":"bc7f645ab38a9f3ce8fddd0d625ae6c77a9aecade1c1a2f33d00ae16dffee6c6","tree_download_s":3.141518333926797,"started_at":"2026-10-03T19:01:31.846331Z","duration_s":12.134242,"timed_out":false,"image_before":"4835f7fc-f97c-42ea-8236-eaf3363c51af","image_after":"8a555cc8-4632-4f05-ae9e-687e4dc07925","junit":{"passed":[],"failed":["exercise/tests.py::ExerciseTest::test_next_unassessed_submitter_view"],"errors":[],"skipped":[],"collection_errors":[],"failure_text":{"exercise/tests.py::ExerciseTest::test_next_unassessed_submitter_view":"KeyError: 'request'\nE   django.core.exceptions.FieldError: Cannot resolve keyword 'submitter' into field. Choices are: assistant_feedback, exercise, exercise_id, feedback, files, force_exercise_points, grade, grader, grader_id, grading_data, grading_time, hash, id, late_penalty_applied, meta_data, notifications, pendingsubmission, service_max_points, service_points, status, submission_data, submission_time, submitters, unofficial_submission_type\n\nDuring handling of the above exception, another exception occurred:\nE   KeyError: 'request'\n\nDuring handling of the above exception, another exception occurred:\nE   KeyError: 'request'\n\nDuring handling of the above exception, another exception occurred:\nE   KeyError: 'request'\n\nDuring handling of the above exception, another exception occurred:\nE   KeyError: 'request'\n\nDuring handling of the above exception, another exception occurred:\nE   KeyError: 'request'\n\nDuring handling of the above exception, another exception occurred:\nE   KeyError: 'request'\n\nDuring handling of the above exception, another exception occurred:\nE   KeyError: 'request'\n\nDuring handling of the above exception, another exception occurred:\nE   KeyError: 'request'\n\nDuring handling of the above exception, another exception occurred:\nE   KeyError: 'request'\n\nDuring handling of the above exception, another exception occurred:\nE   KeyError: 'request'\n\nDuring handling of the above exception, another exception occurred:\nE   KeyError: 'request'"}},"diff":null,"patch_sha256":null,"dropped_paths":[],"snapshot_sha":null}
{"receipt_id":"agent1-14","seq":14,"branch_id":"agent1","kind":"write","cmd":"/opt/receipts-c6913a8c4a5f4a33bdfd91cfd6f76d33/bin/busybox sh -c 'mkdir -p /a-plus/exercise && cp /opt/receipts-c6913a8c4a5f4a33bdfd91cfd6f76d33/incoming/41627dfb2981eb225d8901ce95403b4f8ffbbc463edc2f0eaf8e530c39ab8c4a /a-plus/exercise/staff_views.py'","path":"exercise/staff_views.py","exit_code":0,"stdout_tail":"","stderr_tail":"","stdout_sha256":"41627dfb2981eb225d8901ce95403b4f8ffbbc463edc2f0eaf8e530c39ab8c4a","log_path":"~/dev/nebius-hackathon/pilot/v2-P/apluslms__a-plus-1199/runs/pilot-apluslms__a-plus-1199-4caba45e35/logs/agent1/agent1-14.log","tree_digest":null,"tree_download_s":null,"started_at":"2026-10-03T19:01:57.431576Z","duration_s":0.0069830000000000005,"timed_out":false,"image_before":"8a555cc8-4632-4f05-ae9e-687e4dc07925","image_after":"aa7225bf-1102-46fb-ac38-486c1d181096","junit":null,"diff":null,"patch_sha256":null,"dropped_paths":[],"snapshot_sha":null}
{"receipt_id":"agent1-15","seq":15,"branch_id":"agent1","kind":"command","cmd":"/opt/receipts-e1cd22503a5d412e8c363669b973c78c/bin/busybox mkdir -p /opt/receipts/reports && python -I /opt/receipts-e1cd22503a5d412e8c363669b973c78c/receipts_pytest.py exercise/tests.py::ExerciseTest::test_next_unassessed_submitter_view -v --no-header -rA --tb=line --color=no -p no:cacheprovider -W ignore::DeprecationWarning -o junit_family=xunit1 -p no:cacheprovider -rA --continue-on-collection-errors --junitxml=/opt/receipts/reports/agent1-15.xml","path":null,"exit_code":1,"stdout_tail":"============================= test session starts ==============================\ncollecting ... collected 1 item\n\nexercise/tests.py::ExerciseTest::test_next_unassessed_submitter_view FAILED [100%]\n\n=================================== FAILURES ===================================\nE   AssertionError: 8 != 7\n---------------------------- Captured stderr setup -----------------------------\nCreating test database for alias 'default'...\n----------------------------- Captured stdout call -----------------------------\n[2026-10-03 22:02:13,129: INFO/logging] CEF:0|Aalto|aplus|1.23.1|login||5|\n------------------------------ Captured log call -------------------------------\nINFO     aplus.security:logging.py:46 CEF:0|Aalto|aplus|1.23.1|login||5|\n/usr/local/lib/python3.10/unittest/case.py:838: AssertionError: 8 != 7\n=============================== warnings summary ===============================\n../usr/local/lib/python3.10/site-packages/requests/__init__.py:113\n  /usr/local/lib/python3.10/site-packages/requests/__init__.py:113: RequestsDependencyWarning: urllib3 (2.6.3) or chardet (6.0.0dev0)/charset_normalizer (3.4.4) doesn't match a supported version!\n    warnings.warn(\n\n../usr/local/lib/python3.10/site-packages/model_utils/__init__.py:1\n  /usr/local/lib/python3.10/site-packages/model_utils/__init__.py:1: UserWarning: pkg_resources is deprecated as an API. See https://setuptools.pypa.io/en/latest/pkg_resources.html. The pkg_resources package is slated for removal as early as 2025-11-30. Refrain from using this package or pin to Setuptools<81.\n    from pkg_resources import DistributionNotFound, get_distribution\n\nexercise/tests.py: 225 warnings\n  /usr/local/lib/python3.10/site-packages/django/db/models/options.py:210: RemovedInDjango51Warning: 'index_together' is deprecated. Use 'Meta.indexes' in 'course.UserTagging' instead.\n    warnings.warn(\n\n-- Docs: https://docs.pytest.org/en/stable/how-to/capture-warnings.html\n----------- generated xml file: /opt/receipts/reports/agent1-15.xml ------------\n=========================== short test summary info ============================\nFAILED exercise/tests.py::ExerciseTest::test_next_unassessed_submitter_view\n======================= 1 failed, 227 warnings in 8.99s ========================\n","stderr_tail":"","stdout_sha256":"fabc5b168c5618bf1869b445fc0314bdbc457c163f5a0dabd052ed8133cfaf76","log_path":"~/dev/nebius-hackathon/pilot/v2-P/apluslms__a-plus-1199/runs/pilot-apluslms__a-plus-1199-4caba45e35/logs/agent1/agent1-15.log","tree_digest":"6aedf8d0c73229a2b15cabb5d7d9ea8933ea3e800ce21562ed129de155f88a9e","tree_download_s":3.704313667025417,"started_at":"2026-10-03T19:02:00.840893Z","duration_s":12.191367,"timed_out":false,"image_before":"aa7225bf-1102-46fb-ac38-486c1d181096","image_after":"099fcb01-45e6-46be-b1b2-aab865b3b2ac","junit":{"passed":[],"failed":["exercise/tests.py::ExerciseTest::test_next_unassessed_submitter_view"],"errors":[],"skipped":[],"collection_errors":[],"failure_text":{"exercise/tests.py::ExerciseTest::test_next_unassessed_submitter_view":"AssertionError: 8 != 7\nE   AssertionError: 8 != 7"}},"diff":null,"patch_sha256":null,"dropped_paths":[],"snapshot_sha":null}
{"receipt_id":"agent1-16","seq":16,"branch_id":"agent1","kind":"write","cmd":"/opt/receipts-c4ebdb25ddb74913aa2437a66b6e1e25/bin/busybox sh -c 'mkdir -p /a-plus/exercise && cp /opt/receipts-c4ebdb25ddb74913aa2437a66b6e1e25/incoming/35bada3b8746526dc25769eb35b68eadce575335cd58553e707854fa4be6d9cb /a-plus/exercise/staff_views.py'","path":"exercise/staff_views.py","exit_code":0,"stdout_tail":"","stderr_tail":"","stdout_sha256":"35bada3b8746526dc25769eb35b68eadce575335cd58553e707854fa4be6d9cb","log_path":"~/dev/nebius-hackathon/pilot/v2-P/apluslms__a-plus-1199/runs/pilot-apluslms__a-plus-1199-4caba45e35/logs/agent1/agent1-16.log","tree_digest":null,"tree_download_s":null,"started_at":"2026-10-03T19:02:34.249145Z","duration_s":0.004462,"timed_out":false,"image_before":"099fcb01-45e6-46be-b1b2-aab865b3b2ac","image_after":"0ae2bb09-a6d1-490a-99b2-0571ee588ac8","junit":null,"diff":null,"patch_sha256":null,"dropped_paths":[],"snapshot_sha":null}
{"receipt_id":"agent1-17","seq":17,"branch_id":"agent1","kind":"command","cmd":"/opt/receipts-298a421a527d4a60b82534fd558c0a47/bin/busybox mkdir -p /opt/receipts/reports && python -I /opt/receipts-298a421a527d4a60b82534fd558c0a47/receipts_pytest.py exercise/tests.py::ExerciseTest::test_next_unassessed_submitter_view -v --no-header -rA --tb=line --color=no -p no:cacheprovider -W ignore::DeprecationWarning -o junit_family=xunit1 -p no:cacheprovider -rA --continue-on-collection-errors --junitxml=/opt/receipts/reports/agent1-17.xml","path":null,"exit_code":1,"stdout_tail":"============================= test session starts ==============================\ncollecting ... collected 1 item\n\nexercise/tests.py::ExerciseTest::test_next_unassessed_submitter_view FAILED [100%]\n\n=================================== FAILURES ===================================\nE   AssertionError: 8 != 7\n---------------------------- Captured stderr setup -----------------------------\nCreating test database for alias 'default'...\n----------------------------- Captured stdout call -----------------------------\n[2026-10-03 22:02:51,047: INFO/logging] CEF:0|Aalto|aplus|1.23.1|login||5|\n------------------------------ Captured log call -------------------------------\nINFO     aplus.security:logging.py:46 CEF:0|Aalto|aplus|1.23.1|login||5|\n/usr/local/lib/python3.10/unittest/case.py:838: AssertionError: 8 != 7\n=============================== warnings summary ===============================\n../usr/local/lib/python3.10/site-packages/requests/__init__.py:113\n  /usr/local/lib/python3.10/site-packages/requests/__init__.py:113: RequestsDependencyWarning: urllib3 (2.6.3) or chardet (6.0.0dev0)/charset_normalizer (3.4.4) doesn't match a supported version!\n    warnings.warn(\n\n../usr/local/lib/python3.10/site-packages/model_utils/__init__.py:1\n  /usr/local/lib/python3.10/site-packages/model_utils/__init__.py:1: UserWarning: pkg_resources is deprecated as an API. See https://setuptools.pypa.io/en/latest/pkg_resources.html. The pkg_resources package is slated for removal as early as 2025-11-30. Refrain from using this package or pin to Setuptools<81.\n    from pkg_resources import DistributionNotFound, get_distribution\n\nexercise/tests.py: 225 warnings\n  /usr/local/lib/python3.10/site-packages/django/db/models/options.py:210: RemovedInDjango51Warning: 'index_together' is deprecated. Use 'Meta.indexes' in 'course.UserTagging' instead.\n    warnings.warn(\n\n-- Docs: https://docs.pytest.org/en/stable/how-to/capture-warnings.html\n----------- generated xml file: /opt/receipts/reports/agent1-17.xml ------------\n=========================== short test summary info ============================\nFAILED exercise/tests.py::ExerciseTest::test_next_unassessed_submitter_view\n======================= 1 failed, 227 warnings in 9.27s ========================\n","stderr_tail":"","stdout_sha256":"8cc601f50b911034d3a4e2008150f224cab1858e46723286bebe89966f5d9876","log_path":"~/dev/nebius-hackathon/pilot/v2-P/apluslms__a-plus-1199/runs/pilot-apluslms__a-plus-1199-4caba45e35/logs/agent1/agent1-17.log","tree_digest":"b7b00452610a5672bbb54cbf82458f9c497d0c0ad22de9e1d6bbb497a2680a87","tree_download_s":21.83080583298579,"started_at":"2026-10-03T19:02:38.192661Z","duration_s":12.475589,"timed_out":false,"image_before":"0ae2bb09-a6d1-490a-99b2-0571ee588ac8","image_after":"e097b767-fa94-4d68-939a-1db75c2fff90","junit":{"passed":[],"failed":["exercise/tests.py::ExerciseTest::test_next_unassessed_submitter_view"],"errors":[],"skipped":[],"collection_errors":[],"failure_text":{"exercise/tests.py::ExerciseTest::test_next_unassessed_submitter_view":"AssertionError: 8 != 7\nE   AssertionError: 8 != 7"}},"diff":null,"patch_sha256":null,"dropped_paths":[],"snapshot_sha":null}
{"receipt_id":"agent1-18","seq":18,"branch_id":"agent1","kind":"write","cmd":"/opt/receipts-9a57e444a1a74623a16b79894c69f221/bin/busybox sh -c 'mkdir -p /a-plus/exercise && cp /opt/receipts-9a57e444a1a74623a16b79894c69f221/incoming/99ff68bc9af402f6fd83dfca84ecfb87008478fe2d2cc1d2cf59f4cab32bef24 /a-plus/exercise/staff_views.py'","path":"exercise/staff_views.py","exit_code":0,"stdout_tail":"","stderr_tail":"","stdout_sha256":"99ff68bc9af402f6fd83dfca84ecfb87008478fe2d2cc1d2cf59f4cab32bef24","log_path":"~/dev/nebius-hackathon/pilot/v2-P/apluslms__a-plus-1199/runs/pilot-apluslms__a-plus-1199-4caba45e35/logs/agent1/agent1-18.log","tree_digest":null,"tree_download_s":null,"started_at":"2026-10-03T19:03:51.680410Z","duration_s":0.004355,"timed_out":false,"image_before":"e097b767-fa94-4d68-939a-1db75c2fff90","image_after":"15b09c52-e18e-4a9b-8c14-3f14eac8c0f3","junit":null,"diff":null,"patch_sha256":null,"dropped_paths":[],"snapshot_sha":null}
{"receipt_id":"agent1-19","seq":19,"branch_id":"agent1","kind":"command","cmd":"/opt/receipts-b4a54310a56a4923b2d338d993969bc6/bin/busybox mkdir -p /opt/receipts/reports && python -I /opt/receipts-b4a54310a56a4923b2d338d993969bc6/receipts_pytest.py exercise/tests.py::ExerciseTest::test_next_unassessed_submitter_view -v --no-header -rA --tb=line --color=no -p no:cacheprovider -W ignore::DeprecationWarning -o junit_family=xunit1 -p no:cacheprovider -rA --continue-on-collection-errors --junitxml=/opt/receipts/reports/agent1-19.xml","path":null,"exit_code":1,"stdout_tail":"============================= test session starts ==============================\ncollecting ... collected 1 item\n\nexercise/tests.py::ExerciseTest::test_next_unassessed_submitter_view FAILED [100%]\n\n=================================== FAILURES ===================================\nE   AssertionError: 8 != 7\n---------------------------- Captured stderr setup -----------------------------\nCreating test database for alias 'default'...\n----------------------------- Captured stdout call -----------------------------\n[2026-10-03 22:04:08,048: INFO/logging] CEF:0|Aalto|aplus|1.23.1|login||5|\n------------------------------ Captured log call -------------------------------\nINFO     aplus.security:logging.py:46 CEF:0|Aalto|aplus|1.23.1|login||5|\n/usr/local/lib/python3.10/unittest/case.py:838: AssertionError: 8 != 7\n=============================== warnings summary ===============================\n../usr/local/lib/python3.10/site-packages/requests/__init__.py:113\n  /usr/local/lib/python3.10/site-packages/requests/__init__.py:113: RequestsDependencyWarning: urllib3 (2.6.3) or chardet (6.0.0dev0)/charset_normalizer (3.4.4) doesn't match a supported version!\n    warnings.warn(\n\n../usr/local/lib/python3.10/site-packages/model_utils/__init__.py:1\n  /usr/local/lib/python3.10/site-packages/model_utils/__init__.py:1: UserWarning: pkg_resources is deprecated as an API. See https://setuptools.pypa.io/en/latest/pkg_resources.html. The pkg_resources package is slated for removal as early as 2025-11-30. Refrain from using this package or pin to Setuptools<81.\n    from pkg_resources import DistributionNotFound, get_distribution\n\nexercise/tests.py: 225 warnings\n  /usr/local/lib/python3.10/site-packages/django/db/models/options.py:210: RemovedInDjango51Warning: 'index_together' is deprecated. Use 'Meta.indexes' in 'course.UserTagging' instead.\n    warnings.warn(\n\n-- Docs: https://docs.pytest.org/en/stable/how-to/capture-warnings.html\n----------- generated xml file: /opt/receipts/reports/agent1-19.xml ------------\n=========================== short test summary info ============================\nFAILED exercise/tests.py::ExerciseTest::test_next_unassessed_submitter_view\n======================= 1 failed, 227 warnings in 9.25s ========================\n","stderr_tail":"","stdout_sha256":"32cf834bac745a8aab3c7504195aa25b6ede10ce442b9851eacaada0d21dd481","log_path":"~/dev/nebius-hackathon/pilot/v2-P/apluslms__a-plus-1199/runs/pilot-apluslms__a-plus-1199-4caba45e35/logs/agent1/agent1-19.log","tree_digest":"562b69389092f722e0930d3188bbaeed9d70821776694581bf7fb825943d1617","tree_download_s":6.002322624903172,"started_at":"2026-10-03T19:03:55.439782Z","duration_s":12.491057,"timed_out":false,"image_before":"15b09c52-e18e-4a9b-8c14-3f14eac8c0f3","image_after":"1aac8a59-11f3-4a8a-ba77-bf82c9e00f6c","junit":{"passed":[],"failed":["exercise/tests.py::ExerciseTest::test_next_unassessed_submitter_view"],"errors":[],"skipped":[],"collection_errors":[],"failure_text":{"exercise/tests.py::ExerciseTest::test_next_unassessed_submitter_view":"AssertionError: 8 != 7\nE   AssertionError: 8 != 7"}},"diff":null,"patch_sha256":null,"dropped_paths":[],"snapshot_sha":null}
{"receipt_id":"agent1-20","seq":20,"branch_id":"agent1","kind":"write","cmd":"/opt/receipts-f157b275a53a485b93a2d5e4a5a720c7/bin/busybox sh -c 'mkdir -p /a-plus/exercise && cp /opt/receipts-f157b275a53a485b93a2d5e4a5a720c7/incoming/3fbfdc2d916ffbbdb93b5d8b5d8c7c56f7f6dc9720df211b36eb50a6c45d28f8 /a-plus/exercise/staff_views.py'","path":"exercise/staff_views.py","exit_code":0,"stdout_tail":"","stderr_tail":"","stdout_sha256":"3fbfdc2d916ffbbdb93b5d8b5d8c7c56f7f6dc9720df211b36eb50a6c45d28f8","log_path":"~/dev/nebius-hackathon/pilot/v2-P/apluslms__a-plus-1199/runs/pilot-apluslms__a-plus-1199-4caba45e35/logs/agent1/agent1-20.log","tree_digest":null,"tree_download_s":null,"started_at":"2026-10-03T19:04:24.878818Z","duration_s":0.004864,"timed_out":false,"image_before":"1aac8a59-11f3-4a8a-ba77-bf82c9e00f6c","image_after":"65d3d686-1dc6-487b-b2aa-562c22ba535d","junit":null,"diff":null,"patch_sha256":null,"dropped_paths":[],"snapshot_sha":null}
{"receipt_id":"agent1-21","seq":21,"branch_id":"agent1","kind":"command","cmd":"/opt/receipts-c880e6059a7d46b9b5180df8ad9737a7/bin/busybox mkdir -p /opt/receipts/reports && python -I /opt/receipts-c880e6059a7d46b9b5180df8ad9737a7/receipts_pytest.py exercise/tests.py::ExerciseTest::test_next_unassessed_submitter_view -v --no-header -rA --tb=line --color=no -p no:cacheprovider -W ignore::DeprecationWarning -o junit_family=xunit1 -p no:cacheprovider -rA --continue-on-collection-errors --junitxml=/opt/receipts/reports/agent1-21.xml","path":null,"exit_code":1,"stdout_tail":"============================= test session starts ==============================\ncollecting ... collected 1 item\n\nexercise/tests.py::ExerciseTest::test_next_unassessed_submitter_view FAILED [100%]\n\n=================================== FAILURES ===================================\nE   AssertionError: 7 != '/Course-Url/T-00.1000_d1/test-module/unassessed/submissions/'\n---------------------------- Captured stderr setup -----------------------------\nCreating test database for alias 'default'...\n----------------------------- Captured stdout call -----------------------------\n[2026-10-03 22:04:40,395: INFO/logging] CEF:0|Aalto|aplus|1.23.1|login||5|\n------------------------------ Captured log call -------------------------------\nINFO     aplus.security:logging.py:46 CEF:0|Aalto|aplus|1.23.1|login||5|\n/usr/local/lib/python3.10/unittest/case.py:838: AssertionError: 7 != '/Course-Url/T-00.1000_d1/test-module/unassessed/submissions/'\n=============================== warnings summary ===============================\n../usr/local/lib/python3.10/site-packages/requests/__init__.py:113\n  /usr/local/lib/python3.10/site-packages/requests/__init__.py:113: RequestsDependencyWarning: urllib3 (2.6.3) or chardet (6.0.0dev0)/charset_normalizer (3.4.4) doesn't match a supported version!\n    warnings.warn(\n\n../usr/local/lib/python3.10/site-packages/model_utils/__init__.py:1\n  /usr/local/lib/python3.10/site-packages/model_utils/__init__.py:1: UserWarning: pkg_resources is deprecated as an API. See https://setuptools.pypa.io/en/latest/pkg_resources.html. The pkg_resources package is slated for removal as early as 2025-11-30. Refrain from using this package or pin to Setuptools<81.\n    from pkg_resources import DistributionNotFound, get_distribution\n\nexercise/tests.py: 225 warnings\n  /usr/local/lib/python3.10/site-packages/django/db/models/options.py:210: RemovedInDjango51Warning: 'index_together' is deprecated. Use 'Meta.indexes' in 'course.UserTagging' instead.\n    warnings.warn(\n\n-- Docs: https://docs.pytest.org/en/stable/how-to/capture-warnings.html\n----------- generated xml file: /opt/receipts/reports/agent1-21.xml ------------\n=========================== short test summary info ============================\nFAILED exercise/tests.py::ExerciseTest::test_next_unassessed_submitter_view\n======================= 1 failed, 227 warnings in 8.89s ========================\n","stderr_tail":"","stdout_sha256":"3e6792de12b98cecb01f5e415d20649eddfac55d72765be3d3ad0a289ab1233c","log_path":"~/dev/nebius-hackathon/pilot/v2-P/apluslms__a-plus-1199/runs/pilot-apluslms__a-plus-1199-4caba45e35/logs/agent1/agent1-21.log","tree_digest":"b45bd96e376b6aef1a39779310e52f906a5c6f32b2736a604eff5975fc88a034","tree_download_s":3.155649167019874,"started_at":"2026-10-03T19:04:28.089456Z","duration_s":12.069514999999999,"timed_out":false,"image_before":"65d3d686-1dc6-487b-b2aa-562c22ba535d","image_after":"b3e91940-a0a2-4010-929d-15eb1cfce2c3","junit":{"passed":[],"failed":["exercise/tests.py::ExerciseTest::test_next_unassessed_submitter_view"],"errors":[],"skipped":[],"collection_errors":[],"failure_text":{"exercise/tests.py::ExerciseTest::test_next_unassessed_submitter_view":"AssertionError: 7 != '/Course-Url/T-00.1000_d1/test-module/unassessed/submissions/'\nE   AssertionError: 7 != '/Course-Url/T-00.1000_d1/test-module/unassessed/submissions/'"}},"diff":null,"patch_sha256":null,"dropped_paths":[],"snapshot_sha":null}
{"receipt_id":"agent1-22","seq":22,"branch_id":"agent1","kind":"write","cmd":"/opt/receipts-d6b807cd10bc46b98a310dbde22f1c6e/bin/busybox sh -c 'mkdir -p /a-plus/exercise && cp /opt/receipts-d6b807cd10bc46b98a310dbde22f1c6e/incoming/1ceb70d1bb8dbf55a80040703c92c7d0670bfc2ed76fdc29535bd7712554c6ac /a-plus/exercise/staff_views.py'","path":"exercise/staff_views.py","exit_code":0,"stdout_tail":"","stderr_tail":"","stdout_sha256":"1ceb70d1bb8dbf55a80040703c92c7d0670bfc2ed76fdc29535bd7712554c6ac","log_path":"~/dev/nebius-hackathon/pilot/v2-P/apluslms__a-plus-1199/runs/pilot-apluslms__a-plus-1199-4caba45e35/logs/agent1/agent1-22.log","tree_digest":null,"tree_download_s":null,"started_at":"2026-10-03T19:04:55.643736Z","duration_s":0.0044,"timed_out":false,"image_before":"b3e91940-a0a2-4010-929d-15eb1cfce2c3","image_after":"9d07abd7-7866-4533-9e51-cb973ba7a1a9","junit":null,"diff":null,"patch_sha256":null,"dropped_paths":[],"snapshot_sha":null}
{"receipt_id":"agent1-23","seq":23,"branch_id":"agent1","kind":"command","cmd":"/opt/receipts-9f7946051bbb4469ab727fd1f46ab04f/bin/busybox mkdir -p /opt/receipts/reports && python -I /opt/receipts-9f7946051bbb4469ab727fd1f46ab04f/receipts_pytest.py exercise/tests.py::ExerciseTest::test_next_unassessed_submitter_view -v --no-header -rA --tb=line --color=no -p no:cacheprovider -W ignore::DeprecationWarning -o junit_family=xunit1 -p no:cacheprovider -rA --continue-on-collection-errors --junitxml=/opt/receipts/reports/agent1-23.xml","path":null,"exit_code":1,"stdout_tail":"============================= test session starts ==============================\ncollecting ... collected 1 item\n\nexercise/tests.py::ExerciseTest::test_next_unassessed_submitter_view FAILED [100%]\n\n=================================== FAILURES ===================================\nE   AssertionError: 8 != 7\n---------------------------- Captured stderr setup -----------------------------\nCreating test database for alias 'default'...\n----------------------------- Captured stdout call -----------------------------\n[2026-10-03 22:05:12,546: INFO/logging] CEF:0|Aalto|aplus|1.23.1|login||5|\n------------------------------ Captured log call -------------------------------\nINFO     aplus.security:logging.py:46 CEF:0|Aalto|aplus|1.23.1|login||5|\n/usr/local/lib/python3.10/unittest/case.py:838: AssertionError: 8 != 7\n=============================== warnings summary ===============================\n../usr/local/lib/python3.10/site-packages/requests/__init__.py:113\n  /usr/local/lib/python3.10/site-packages/requests/__init__.py:113: RequestsDependencyWarning: urllib3 (2.6.3) or chardet (6.0.0dev0)/charset_normalizer (3.4.4) doesn't match a supported version!\n    warnings.warn(\n\n../usr/local/lib/python3.10/site-packages/model_utils/__init__.py:1\n  /usr/local/lib/python3.10/site-packages/model_utils/__init__.py:1: UserWarning: pkg_resources is deprecated as an API. See https://setuptools.pypa.io/en/latest/pkg_resources.html. The pkg_resources package is slated for removal as early as 2025-11-30. Refrain from using this package or pin to Setuptools<81.\n    from pkg_resources import DistributionNotFound, get_distribution\n\nexercise/tests.py: 225 warnings\n  /usr/local/lib/python3.10/site-packages/django/db/models/options.py:210: RemovedInDjango51Warning: 'index_together' is deprecated. Use 'Meta.indexes' in 'course.UserTagging' instead.\n    warnings.warn(\n\n-- Docs: https://docs.pytest.org/en/stable/how-to/capture-warnings.html\n----------- generated xml file: /opt/receipts/reports/agent1-23.xml ------------\n=========================== short test summary info ============================\nFAILED exercise/tests.py::ExerciseTest::test_next_unassessed_submitter_view\n======================= 1 failed, 227 warnings in 9.19s ========================\n","stderr_tail":"","stdout_sha256":"2b7dc28aff489c8965cea3f41506bf82c7d2c88f6590a10b4c10965bf28d64fa","log_path":"~/dev/nebius-hackathon/pilot/v2-P/apluslms__a-plus-1199/runs/pilot-apluslms__a-plus-1199-4caba45e35/logs/agent1/agent1-23.log","tree_digest":"893bd0b79fe1d9ad05cbd9ef7b46b0cb95e0e598acb04e29e59c3caaf5b5774b","tree_download_s":17.07667320780456,"started_at":"2026-10-03T19:04:59.850132Z","duration_s":12.410798,"timed_out":false,"image_before":"9d07abd7-7866-4533-9e51-cb973ba7a1a9","image_after":"9678b7e2-7a17-4885-8467-ffe23fbad9ff","junit":{"passed":[],"failed":["exercise/tests.py::ExerciseTest::test_next_unassessed_submitter_view"],"errors":[],"skipped":[],"collection_errors":[],"failure_text":{"exercise/tests.py::ExerciseTest::test_next_unassessed_submitter_view":"AssertionError: 8 != 7\nE   AssertionError: 8 != 7"}},"diff":null,"patch_sha256":null,"dropped_paths":[],"snapshot_sha":null}
{"receipt_id":"agent1-24","seq":24,"branch_id":"agent1","kind":"write","cmd":"/opt/receipts-c065a4a4b67f46ec8fa7d54f0b8def8b/bin/busybox sh -c 'mkdir -p /a-plus/exercise && cp /opt/receipts-c065a4a4b67f46ec8fa7d54f0b8def8b/incoming/a9f8ba12c2990e5a8bf365dc9b2af5dbaa2617011b23f4778458fd4619e3b4d9 /a-plus/exercise/staff_views.py'","path":"exercise/staff_views.py","exit_code":0,"stdout_tail":"","stderr_tail":"","stdout_sha256":"a9f8ba12c2990e5a8bf365dc9b2af5dbaa2617011b23f4778458fd4619e3b4d9","log_path":"~/dev/nebius-hackathon/pilot/v2-P/apluslms__a-plus-1199/runs/pilot-apluslms__a-plus-1199-4caba45e35/logs/agent1/agent1-24.log","tree_digest":null,"tree_download_s":null,"started_at":"2026-10-03T19:05:43.566928Z","duration_s":0.004594,"timed_out":false,"image_before":"9678b7e2-7a17-4885-8467-ffe23fbad9ff","image_after":"000452b4-90df-4e2f-a2be-35097ce36e83","junit":null,"diff":null,"patch_sha256":null,"dropped_paths":[],"snapshot_sha":null}
{"receipt_id":"agent1-25","seq":25,"branch_id":"agent1","kind":"command","cmd":"/opt/receipts-aa84e98ec97042afbf4caffafe5c4288/bin/busybox mkdir -p /opt/receipts/reports && python -I /opt/receipts-aa84e98ec97042afbf4caffafe5c4288/receipts_pytest.py exercise/tests.py::ExerciseTest::test_next_unassessed_submitter_view -v --no-header -rA --tb=line --color=no -p no:cacheprovider -W ignore::DeprecationWarning -o junit_family=xunit1 -p no:cacheprovider -rA --continue-on-collection-errors --junitxml=/opt/receipts/reports/agent1-25.xml","path":null,"exit_code":1,"stdout_tail":"============================= test session starts ==============================\ncollecting ... collected 1 item\n\nexercise/tests.py::ExerciseTest::test_next_unassessed_submitter_view FAILED [100%]\n\n=================================== FAILURES ===================================\nE   AssertionError: 8 != 7\n---------------------------- Captured stderr setup -----------------------------\nCreating test database for alias 'default'...\n----------------------------- Captured stdout call -----------------------------\n[2026-10-03 22:05:59,464: INFO/logging] CEF:0|Aalto|aplus|1.23.1|login||5|\n------------------------------ Captured log call -------------------------------\nINFO     aplus.security:logging.py:46 CEF:0|Aalto|aplus|1.23.1|login||5|\n/usr/local/lib/python3.10/unittest/case.py:838: AssertionError: 8 != 7\n=============================== warnings summary ===============================\n../usr/local/lib/python3.10/site-packages/requests/__init__.py:113\n  /usr/local/lib/python3.10/site-packages/requests/__init__.py:113: RequestsDependencyWarning: urllib3 (2.6.3) or chardet (6.0.0dev0)/charset_normalizer (3.4.4) doesn't match a supported version!\n    warnings.warn(\n\n../usr/local/lib/python3.10/site-packages/model_utils/__init__.py:1\n  /usr/local/lib/python3.10/site-packages/model_utils/__init__.py:1: UserWarning: pkg_resources is deprecated as an API. See https://setuptools.pypa.io/en/latest/pkg_resources.html. The pkg_resources package is slated for removal as early as 2025-11-30. Refrain from using this package or pin to Setuptools<81.\n    from pkg_resources import DistributionNotFound, get_distribution\n\nexercise/tests.py: 225 warnings\n  /usr/local/lib/python3.10/site-packages/django/db/models/options.py:210: RemovedInDjango51Warning: 'index_together' is deprecated. Use 'Meta.indexes' in 'course.UserTagging' instead.\n    warnings.warn(\n\n-- Docs: https://docs.pytest.org/en/stable/how-to/capture-warnings.html\n----------- generated xml file: /opt/receipts/reports/agent1-25.xml ------------\n=========================== short test summary info ============================\nFAILED exercise/tests.py::ExerciseTest::test_next_unassessed_submitter_view\n======================= 1 failed, 227 warnings in 9.07s ========================\n","stderr_tail":"","stdout_sha256":"0c6c77a8f894bc0ba38f9ff6b6d183bd62e66c2401e9d8b0befa523bf386bd3a","log_path":"~/dev/nebius-hackathon/pilot/v2-P/apluslms__a-plus-1199/runs/pilot-apluslms__a-plus-1199-4caba45e35/logs/agent1/agent1-25.log","tree_digest":"34fcd37d2b82457e08efbe65fe2d8649c796411f63468b00b0f21aa99ab695c7","tree_download_s":3.9558688749093562,"started_at":"2026-10-03T19:05:47.062421Z","duration_s":12.273802,"timed_out":false,"image_before":"000452b4-90df-4e2f-a2be-35097ce36e83","image_after":"d8b817bc-2b11-48ba-9536-5f522148ab04","junit":{"passed":[],"failed":["exercise/tests.py::ExerciseTest::test_next_unassessed_submitter_view"],"errors":[],"skipped":[],"collection_errors":[],"failure_text":{"exercise/tests.py::ExerciseTest::test_next_unassessed_submitter_view":"AssertionError: 8 != 7\nE   AssertionError: 8 != 7"}},"diff":null,"patch_sha256":null,"dropped_paths":[],"snapshot_sha":null}
{"receipt_id":"agent1-26","seq":26,"branch_id":"agent1","kind":"write","cmd":"/opt/receipts-c5f70b6b9ba342c5b056cab75a7e4907/bin/busybox sh -c 'mkdir -p /a-plus/exercise && cp /opt/receipts-c5f70b6b9ba342c5b056cab75a7e4907/incoming/8af4d44bd4417c573ca8a83561c9c7fd20bc38c1413d4b6bb5d1b93e19e91ec3 /a-plus/exercise/staff_views.py'","path":"exercise/staff_views.py","exit_code":0,"stdout_tail":"","stderr_tail":"","stdout_sha256":"8af4d44bd4417c573ca8a83561c9c7fd20bc38c1413d4b6bb5d1b93e19e91ec3","log_path":"~/dev/nebius-hackathon/pilot/v2-P/apluslms__a-plus-1199/runs/pilot-apluslms__a-plus-1199-4caba45e35/logs/agent1/agent1-26.log","tree_digest":null,"tree_download_s":null,"started_at":"2026-10-03T19:06:21.115479Z","duration_s":0.004757,"timed_out":false,"image_before":"d8b817bc-2b11-48ba-9536-5f522148ab04","image_after":"f08c79e4-8936-4378-bf3d-9dca7e09f652","junit":null,"diff":null,"patch_sha256":null,"dropped_paths":[],"snapshot_sha":null}
{"receipt_id":"agent1-27","seq":27,"branch_id":"agent1","kind":"command","cmd":"/opt/receipts-36be7b258a7242ec9610164dd3b2923e/bin/busybox mkdir -p /opt/receipts/reports && python -I /opt/receipts-36be7b258a7242ec9610164dd3b2923e/receipts_pytest.py exercise/tests.py::ExerciseTest::test_next_unassessed_submitter_view -v --no-header -rA --tb=line --color=no -p no:cacheprovider -W ignore::DeprecationWarning -o junit_family=xunit1 -p no:cacheprovider -rA --continue-on-collection-errors --junitxml=/opt/receipts/reports/agent1-27.xml","path":null,"exit_code":1,"stdout_tail":"============================= test session starts ==============================\ncollecting ... collected 1 item\n\nexercise/tests.py::ExerciseTest::test_next_unassessed_submitter_view FAILED [100%]\n\n=================================== FAILURES ===================================\nE   AssertionError: 8 != 7\n---------------------------- Captured stderr setup -----------------------------\nCreating test database for alias 'default'...\n----------------------------- Captured stdout call -----------------------------\n[2026-10-03 22:06:37,234: INFO/logging] CEF:0|Aalto|aplus|1.23.1|login||5|\n------------------------------ Captured log call -------------------------------\nINFO     aplus.security:logging.py:46 CEF:0|Aalto|aplus|1.23.1|login||5|\n/usr/local/lib/python3.10/unittest/case.py:838: AssertionError: 8 != 7\n=============================== warnings summary ===============================\n../usr/local/lib/python3.10/site-packages/requests/__init__.py:113\n  /usr/local/lib/python3.10/site-packages/requests/__init__.py:113: RequestsDependencyWarning: urllib3 (2.6.3) or chardet (6.0.0dev0)/charset_normalizer (3.4.4) doesn't match a supported version!\n    warnings.warn(\n\n../usr/local/lib/python3.10/site-packages/model_utils/__init__.py:1\n  /usr/local/lib/python3.10/site-packages/model_utils/__init__.py:1: UserWarning: pkg_resources is deprecated as an API. See https://setuptools.pypa.io/en/latest/pkg_resources.html. The pkg_resources package is slated for removal as early as 2025-11-30. Refrain from using this package or pin to Setuptools<81.\n    from pkg_resources import DistributionNotFound, get_distribution\n\nexercise/tests.py: 225 warnings\n  /usr/local/lib/python3.10/site-packages/django/db/models/options.py:210: RemovedInDjango51Warning: 'index_together' is deprecated. Use 'Meta.indexes' in 'course.UserTagging' instead.\n    warnings.warn(\n\n-- Docs: https://docs.pytest.org/en/stable/how-to/capture-warnings.html\n----------- generated xml file: /opt/receipts/reports/agent1-27.xml ------------\n=========================== short test summary info ============================\nFAILED exercise/tests.py::ExerciseTest::test_next_unassessed_submitter_view\n======================= 1 failed, 227 warnings in 8.99s ========================\n","stderr_tail":"","stdout_sha256":"d1fe8bd6a502775ed4164897265939be5b216066fb2c56b6ee3f186461562ba2","log_path":"~/dev/nebius-hackathon/pilot/v2-P/apluslms__a-plus-1199/runs/pilot-apluslms__a-plus-1199-4caba45e35/logs/agent1/agent1-27.log","tree_digest":"14281cdb90482bbe9e58eeabd5fcd781cc8cf5b368879feedc984f404563b798","tree_download_s":4.887222624849528,"started_at":"2026-10-03T19:06:24.903538Z","duration_s":12.159198,"timed_out":false,"image_before":"f08c79e4-8936-4378-bf3d-9dca7e09f652","image_after":"5c96a8f6-29d5-4df5-9624-9c6c5d3bcffd","junit":{"passed":[],"failed":["exercise/tests.py::ExerciseTest::test_next_unassessed_submitter_view"],"errors":[],"skipped":[],"collection_errors":[],"failure_text":{"exercise/tests.py::ExerciseTest::test_next_unassessed_submitter_view":"AssertionError: 8 != 7\nE   AssertionError: 8 != 7"}},"diff":null,"patch_sha256":null,"dropped_paths":[],"snapshot_sha":null}
{"receipt_id":"agent1-28","seq":28,"branch_id":"agent1","kind":"diff","cmd":"compute patch in executor staging agent1-c08fe5679a004ef2b4943748540be15b: /opt/homebrew/Cellar/git/2.53.0/bin/git -c core.hooksPath=/dev/null -c core.attributesFile=/dev/null -c diff.external= -c core.quotePath=false add -A && /opt/homebrew/Cellar/git/2.53.0/bin/git -c core.hooksPath=/dev/null -c core.attributesFile=/dev/null -c diff.external= -c core.quotePath=false diff --cached --binary --no-ext-diff --no-textconv --no-renames d2f7ea39a57eb7b5d63fe4f46dea4a116c430381","path":null,"exit_code":0,"stdout_tail":"diff --git a/exercise/staff_views.py b/exercise/staff_views.py\nindex 7c25404b..f39b6279 100644\n--- a/exercise/staff_views.py\n+++ b/exercise/staff_views.py\n@@ -342,17 +342,23 @@ class NextUnassessedSubmitterView(ExerciseBaseView, BaseRedirectView):\n \n     def get(self, request: HttpRequest, *args: Any, **kwargs: Any) -> HttpResponse:\n         # Query submitters who have not been assessed yet.\n+        # A student needs assessment if NONE of their submissions in this exercise have been graded.\n         submitter = None\n-        submitters = (UserProfile.objects\n-            .filter(submissions__exercise=self.exercise)\n-            .annotate(\n-                count_assessed=Count(\n-                    'submissions__id',\n-                    filter=(Q(submissions__grader__isnull=False)),\n-                ),\n-            )\n-            .filter(count_assessed=0)\n-            .order_by('id'))\n+        \n+        # Get all submitters who have submitted to this exercise\n+        submitters_with_submissions = UserProfile.objects.filter(\n+            submissions__exercise=self.exercise\n+        ).distinct()\n+        \n+        # Exclude submitters who have ANY assessed submissions in this exercise\n+        assessed_submitter_ids = UserProfile.objects.filter(\n+            submissions__exercise=self.exercise,\n+            submissions__grader__isnull=False\n+        ).values_list('id', flat=True).distinct()\n+        \n+        submitters = submitters_with_submissions.exclude(\n+            id__in=assessed_submitter_ids\n+        ).order_by('id')\n \n         previous_user_id = request.GET.get('prev')\n         if previous_user_id:\n","stderr_tail":"","stdout_sha256":"507e62a841032b57281050386aaacf69c55d66dcf4e0687d1e5f827ababb80f3","log_path":null,"tree_digest":"14281cdb90482bbe9e58eeabd5fcd781cc8cf5b368879feedc984f404563b798","tree_download_s":3.2334781249519438,"started_at":"2026-10-03T19:06:59.198660Z","duration_s":0.0734763341024518,"timed_out":false,"image_before":"5c96a8f6-29d5-4df5-9624-9c6c5d3bcffd","image_after":"5c96a8f6-29d5-4df5-9624-9c6c5d3bcffd","junit":null,"diff":{"files":[{"path":"exercise/staff_views.py","added":16,"deleted":10,"category":"source","status":"modified"}],"patch_sha256":"507e62a841032b57281050386aaacf69c55d66dcf4e0687d1e5f827ababb80f3","patch_path":"~/dev/nebius-hackathon/pilot/v2-P/apluslms__a-plus-1199/runs/pilot-apluslms__a-plus-1199-4caba45e35/artifacts/agent1/agent1-28.patch"},"patch_sha256":"507e62a841032b57281050386aaacf69c55d66dcf4e0687d1e5f827ababb80f3","dropped_paths":[],"snapshot_sha":"d2f7ea39a57eb7b5d63fe4f46dea4a116c430381"}
{"receipt_id":"agent1-29","seq":29,"branch_id":"agent1","kind":"write","cmd":"/opt/receipts-6fbfe40e419148f285aeed355316aeba/bin/busybox sh -c 'mkdir -p /a-plus/exercise && cp /opt/receipts-6fbfe40e419148f285aeed355316aeba/incoming/425abfba916449ab1ab7bee76ba0a4f709ca96bb464a112e0df2ac05d51ad8ab /a-plus/exercise/staff_views.py'","path":"exercise/staff_views.py","exit_code":0,"stdout_tail":"","stderr_tail":"","stdout_sha256":"425abfba916449ab1ab7bee76ba0a4f709ca96bb464a112e0df2ac05d51ad8ab","log_path":"~/dev/nebius-hackathon/pilot/v2-P/apluslms__a-plus-1199/runs/pilot-apluslms__a-plus-1199-4caba45e35/logs/agent1/agent1-29.log","tree_digest":null,"tree_download_s":null,"started_at":"2026-10-03T19:07:56.138998Z","duration_s":0.004483,"timed_out":false,"image_before":"5c96a8f6-29d5-4df5-9624-9c6c5d3bcffd","image_after":"3f34c4fa-a315-4a6a-a474-6ea6107526f0","junit":null,"diff":null,"patch_sha256":null,"dropped_paths":[],"snapshot_sha":null}
{"receipt_id":"agent1-30","seq":30,"branch_id":"agent1","kind":"command","cmd":"/opt/receipts-88528d638f0b464eb2dca6cada580485/bin/busybox mkdir -p /opt/receipts/reports && python -I /opt/receipts-88528d638f0b464eb2dca6cada580485/receipts_pytest.py exercise/tests.py::ExerciseTest::test_next_unassessed_submitter_view -v --no-header -rA --tb=line --color=no -p no:cacheprovider -W ignore::DeprecationWarning -o junit_family=xunit1 -p no:cacheprovider -rA --continue-on-collection-errors --junitxml=/opt/receipts/reports/agent1-30.xml","path":null,"exit_code":1,"stdout_tail":"============================= test session starts ==============================\ncollecting ... collected 1 item\n\nexercise/tests.py::ExerciseTest::test_next_unassessed_submitter_view FAILED [100%]\n\n=================================== FAILURES ===================================\nE   AssertionError: 7 != '/Course-Url/T-00.1000_d1/test-module/unassessed/submissions/'\n---------------------------- Captured stderr setup -----------------------------\nCreating test database for alias 'default'...\n----------------------------- Captured stdout call -----------------------------\n[2026-10-03 22:08:12,480: INFO/logging] CEF:0|Aalto|aplus|1.23.1|login||5|\n------------------------------ Captured log call -------------------------------\nINFO     aplus.security:logging.py:46 CEF:0|Aalto|aplus|1.23.1|login||5|\n/usr/local/lib/python3.10/unittest/case.py:838: AssertionError: 7 != '/Course-Url/T-00.1000_d1/test-module/unassessed/submissions/'\n=============================== warnings summary ===============================\n../usr/local/lib/python3.10/site-packages/requests/__init__.py:113\n  /usr/local/lib/python3.10/site-packages/requests/__init__.py:113: RequestsDependencyWarning: urllib3 (2.6.3) or chardet (6.0.0dev0)/charset_normalizer (3.4.4) doesn't match a supported version!\n    warnings.warn(\n\n../usr/local/lib/python3.10/site-packages/model_utils/__init__.py:1\n  /usr/local/lib/python3.10/site-packages/model_utils/__init__.py:1: UserWarning: pkg_resources is deprecated as an API. See https://setuptools.pypa.io/en/latest/pkg_resources.html. The pkg_resources package is slated for removal as early as 2025-11-30. Refrain from using this package or pin to Setuptools<81.\n    from pkg_resources import DistributionNotFound, get_distribution\n\nexercise/tests.py: 225 warnings\n  /usr/local/lib/python3.10/site-packages/django/db/models/options.py:210: RemovedInDjango51Warning: 'index_together' is deprecated. Use 'Meta.indexes' in 'course.UserTagging' instead.\n    warnings.warn(\n\n-- Docs: https://docs.pytest.org/en/stable/how-to/capture-warnings.html\n----------- generated xml file: /opt/receipts/reports/agent1-30.xml ------------\n=========================== short test summary info ============================\nFAILED exercise/tests.py::ExerciseTest::test_next_unassessed_submitter_view\n======================= 1 failed, 227 warnings in 8.91s ========================\n","stderr_tail":"","stdout_sha256":"794cd9e0a67f0511c0e5308839efb2f7c420a2f882b47fd5311d298696e76144","log_path":"~/dev/nebius-hackathon/pilot/v2-P/apluslms__a-plus-1199/runs/pilot-apluslms__a-plus-1199-4caba45e35/logs/agent1/agent1-30.log","tree_digest":"a3dda4fde966d4dc3efbc68b3c38225b93316a93a928dfc9e3c59fb660be5369","tree_download_s":6.443077542120591,"started_at":"2026-10-03T19:07:59.903296Z","duration_s":12.161263,"timed_out":false,"image_before":"3f34c4fa-a315-4a6a-a474-6ea6107526f0","image_after":"a3521d40-68b6-42d1-9034-c8ba619676e2","junit":{"passed":[],"failed":["exercise/tests.py::ExerciseTest::test_next_unassessed_submitter_view"],"errors":[],"skipped":[],"collection_errors":[],"failure_text":{"exercise/tests.py::ExerciseTest::test_next_unassessed_submitter_view":"AssertionError: 7 != '/Course-Url/T-00.1000_d1/test-module/unassessed/submissions/'\nE   AssertionError: 7 != '/Course-Url/T-00.1000_d1/test-module/unassessed/submissions/'"}},"diff":null,"patch_sha256":null,"dropped_paths":[],"snapshot_sha":null}
{"receipt_id":"agent1-31","seq":31,"branch_id":"agent1","kind":"write","cmd":"/opt/receipts-ed26d9ccf2d944d1b00c3ef84b21a65c/bin/busybox sh -c 'mkdir -p /a-plus/exercise && cp /opt/receipts-ed26d9ccf2d944d1b00c3ef84b21a65c/incoming/8af4d44bd4417c573ca8a83561c9c7fd20bc38c1413d4b6bb5d1b93e19e91ec3 /a-plus/exercise/staff_views.py'","path":"exercise/staff_views.py","exit_code":0,"stdout_tail":"","stderr_tail":"","stdout_sha256":"8af4d44bd4417c573ca8a83561c9c7fd20bc38c1413d4b6bb5d1b93e19e91ec3","log_path":"~/dev/nebius-hackathon/pilot/v2-P/apluslms__a-plus-1199/runs/pilot-apluslms__a-plus-1199-4caba45e35/logs/agent1/agent1-31.log","tree_digest":null,"tree_download_s":null,"started_at":"2026-10-03T19:08:31.405981Z","duration_s":0.004438,"timed_out":false,"image_before":"a3521d40-68b6-42d1-9034-c8ba619676e2","image_after":"ecbdbd74-4998-46a0-bd70-94b7341279b0","junit":null,"diff":null,"patch_sha256":null,"dropped_paths":[],"snapshot_sha":null}
{"receipt_id":"agent1-32","seq":32,"branch_id":"agent1","kind":"command","cmd":"/opt/receipts-10e0e5e8a8e84405be43ae43648d718b/bin/busybox mkdir -p /opt/receipts/reports && python -I /opt/receipts-10e0e5e8a8e84405be43ae43648d718b/receipts_pytest.py exercise/tests.py::ExerciseTest::test_next_unassessed_submitter_view -v --no-header -rA --tb=line --color=no -p no:cacheprovider -W ignore::DeprecationWarning -o junit_family=xunit1 -p no:cacheprovider -rA --continue-on-collection-errors --junitxml=/opt/receipts/reports/agent1-32.xml","path":null,"exit_code":1,"stdout_tail":"============================= test session starts ==============================\ncollecting ... collected 1 item\n\nexercise/tests.py::ExerciseTest::test_next_unassessed_submitter_view FAILED [100%]\n\n=================================== FAILURES ===================================\nE   AssertionError: 8 != 7\n---------------------------- Captured stderr setup -----------------------------\nCreating test database for alias 'default'...\n----------------------------- Captured stdout call -----------------------------\n[2026-10-03 22:08:47,550: INFO/logging] CEF:0|Aalto|aplus|1.23.1|login||5|\n------------------------------ Captured log call -------------------------------\nINFO     aplus.security:logging.py:46 CEF:0|Aalto|aplus|1.23.1|login||5|\n/usr/local/lib/python3.10/unittest/case.py:838: AssertionError: 8 != 7\n=============================== warnings summary ===============================\n../usr/local/lib/python3.10/site-packages/requests/__init__.py:113\n  /usr/local/lib/python3.10/site-packages/requests/__init__.py:113: RequestsDependencyWarning: urllib3 (2.6.3) or chardet (6.0.0dev0)/charset_normalizer (3.4.4) doesn't match a supported version!\n    warnings.warn(\n\n../usr/local/lib/python3.10/site-packages/model_utils/__init__.py:1\n  /usr/local/lib/python3.10/site-packages/model_utils/__init__.py:1: UserWarning: pkg_resources is deprecated as an API. See https://setuptools.pypa.io/en/latest/pkg_resources.html. The pkg_resources package is slated for removal as early as 2025-11-30. Refrain from using this package or pin to Setuptools<81.\n    from pkg_resources import DistributionNotFound, get_distribution\n\nexercise/tests.py: 225 warnings\n  /usr/local/lib/python3.10/site-packages/django/db/models/options.py:210: RemovedInDjango51Warning: 'index_together' is deprecated. Use 'Meta.indexes' in 'course.UserTagging' instead.\n    warnings.warn(\n\n-- Docs: https://docs.pytest.org/en/stable/how-to/capture-warnings.html\n----------- generated xml file: /opt/receipts/reports/agent1-32.xml ------------\n=========================== short test summary info ============================\nFAILED exercise/tests.py::ExerciseTest::test_next_unassessed_submitter_view\n======================= 1 failed, 227 warnings in 9.01s ========================\n","stderr_tail":"","stdout_sha256":"54cd786868857391930c490c880ad7443473ad64beb950b8afce8a9e4c945f85","log_path":"~/dev/nebius-hackathon/pilot/v2-P/apluslms__a-plus-1199/runs/pilot-apluslms__a-plus-1199-4caba45e35/logs/agent1/agent1-32.log","tree_digest":"14281cdb90482bbe9e58eeabd5fcd781cc8cf5b368879feedc984f404563b798","tree_download_s":3.6986015839502215,"started_at":"2026-10-03T19:08:34.967821Z","duration_s":12.216973,"timed_out":false,"image_before":"ecbdbd74-4998-46a0-bd70-94b7341279b0","image_after":"b0074682-d21f-46ad-942e-c5c4baa57150","junit":{"passed":[],"failed":["exercise/tests.py::ExerciseTest::test_next_unassessed_submitter_view"],"errors":[],"skipped":[],"collection_errors":[],"failure_text":{"exercise/tests.py::ExerciseTest::test_next_unassessed_submitter_view":"AssertionError: 8 != 7\nE   AssertionError: 8 != 7"}},"diff":null,"patch_sha256":null,"dropped_paths":[],"snapshot_sha":null}
{"receipt_id":"agent1-33","seq":33,"branch_id":"agent1","kind":"write","cmd":"/opt/receipts-e06bfdf0ad574746815edd5def31c440/bin/busybox sh -c 'mkdir -p /a-plus/exercise && cp /opt/receipts-e06bfdf0ad574746815edd5def31c440/incoming/036de6c0fe00aefcd17047d39f4cb3bcbf269ec5ca92df5e341b23c35bb4748c /a-plus/exercise/staff_views.py'","path":"exercise/staff_views.py","exit_code":0,"stdout_tail":"","stderr_tail":"","stdout_sha256":"036de6c0fe00aefcd17047d39f4cb3bcbf269ec5ca92df5e341b23c35bb4748c","log_path":"~/dev/nebius-hackathon/pilot/v2-P/apluslms__a-plus-1199/runs/pilot-apluslms__a-plus-1199-4caba45e35/logs/agent1/agent1-33.log","tree_digest":null,"tree_download_s":null,"started_at":"2026-10-03T19:09:09.705491Z","duration_s":0.004584,"timed_out":false,"image_before":"b0074682-d21f-46ad-942e-c5c4baa57150","image_after":"0debea96-ec77-4628-ba7e-ef8d3a7161d9","junit":null,"diff":null,"patch_sha256":null,"dropped_paths":[],"snapshot_sha":null}
{"receipt_id":"agent1-34","seq":34,"branch_id":"agent1","kind":"command","cmd":"/opt/receipts-d1c6221612414f8c8df0d88abf3318f1/bin/busybox mkdir -p /opt/receipts/reports && python -I /opt/receipts-d1c6221612414f8c8df0d88abf3318f1/receipts_pytest.py exercise/tests.py::ExerciseTest::test_next_unassessed_submitter_view -v --no-header -rA --tb=line --color=no -p no:cacheprovider -W ignore::DeprecationWarning -o junit_family=xunit1 -p no:cacheprovider -rA --continue-on-collection-errors --junitxml=/opt/receipts/reports/agent1-34.xml","path":null,"exit_code":1,"stdout_tail":"============================= test session starts ==============================\ncollecting ... collected 1 item\n\nexercise/tests.py::ExerciseTest::test_next_unassessed_submitter_view FAILED [100%]\n\n=================================== FAILURES ===================================\nE   AssertionError: 7 != '/Course-Url/T-00.1000_d1/test-module/unassessed/submissions/'\n---------------------------- Captured stderr setup -----------------------------\nCreating test database for alias 'default'...\n----------------------------- Captured stdout call -----------------------------\n[2026-10-03 22:09:25,845: INFO/logging] CEF:0|Aalto|aplus|1.23.1|login||5|\n------------------------------ Captured log call -------------------------------\nINFO     aplus.security:logging.py:46 CEF:0|Aalto|aplus|1.23.1|login||5|\n/usr/local/lib/python3.10/unittest/case.py:838: AssertionError: 7 != '/Course-Url/T-00.1000_d1/test-module/unassessed/submissions/'\n=============================== warnings summary ===============================\n../usr/local/lib/python3.10/site-packages/requests/__init__.py:113\n  /usr/local/lib/python3.10/site-packages/requests/__init__.py:113: RequestsDependencyWarning: urllib3 (2.6.3) or chardet (6.0.0dev0)/charset_normalizer (3.4.4) doesn't match a supported version!\n    warnings.warn(\n\n../usr/local/lib/python3.10/site-packages/model_utils/__init__.py:1\n  /usr/local/lib/python3.10/site-packages/model_utils/__init__.py:1: UserWarning: pkg_resources is deprecated as an API. See https://setuptools.pypa.io/en/latest/pkg_resources.html. The pkg_resources package is slated for removal as early as 2025-11-30. Refrain from using this package or pin to Setuptools<81.\n    from pkg_resources import DistributionNotFound, get_distribution\n\nexercise/tests.py: 225 warnings\n  /usr/local/lib/python3.10/site-packages/django/db/models/options.py:210: RemovedInDjango51Warning: 'index_together' is deprecated. Use 'Meta.indexes' in 'course.UserTagging' instead.\n    warnings.warn(\n\n-- Docs: https://docs.pytest.org/en/stable/how-to/capture-warnings.html\n----------- generated xml file: /opt/receipts/reports/agent1-34.xml ------------\n=========================== short test summary info ============================\nFAILED exercise/tests.py::ExerciseTest::test_next_unassessed_submitter_view\n======================= 1 failed, 227 warnings in 8.89s ========================\n","stderr_tail":"","stdout_sha256":"2c4c96c2d76295d0d30904b9b7b67e601e42cf77081ea6d6fd9ea4e4f5da4c6f","log_path":"~/dev/nebius-hackathon/pilot/v2-P/apluslms__a-plus-1199/runs/pilot-apluslms__a-plus-1199-4caba45e35/logs/agent1/agent1-34.log","tree_digest":"a7b1a1917ebf366334fd847631cf750fba7e53bf669a623970f9dfe8bc310545","tree_download_s":4.7782400420401245,"started_at":"2026-10-03T19:09:13.630109Z","duration_s":12.068388,"timed_out":false,"image_before":"0debea96-ec77-4628-ba7e-ef8d3a7161d9","image_after":"f806b96a-96d9-4bf6-be19-50982d279cfd","junit":{"passed":[],"failed":["exercise/tests.py::ExerciseTest::test_next_unassessed_submitter_view"],"errors":[],"skipped":[],"collection_errors":[],"failure_text":{"exercise/tests.py::ExerciseTest::test_next_unassessed_submitter_view":"AssertionError: 7 != '/Course-Url/T-00.1000_d1/test-module/unassessed/submissions/'\nE   AssertionError: 7 != '/Course-Url/T-00.1000_d1/test-module/unassessed/submissions/'"}},"diff":null,"patch_sha256":null,"dropped_paths":[],"snapshot_sha":null}
{"receipt_id":"agent1-35","seq":35,"branch_id":"agent1","kind":"write","cmd":"/opt/receipts-cd61f9b36cf24fdab36c776fdcf82f33/bin/busybox sh -c 'mkdir -p /a-plus/exercise && cp /opt/receipts-cd61f9b36cf24fdab36c776fdcf82f33/incoming/b89e31c06b1959837daf71e31100f622033c966be397d2a016a6f6a087fdde5f /a-plus/exercise/staff_views.py'","path":"exercise/staff_views.py","exit_code":0,"stdout_tail":"","stderr_tail":"","stdout_sha256":"b89e31c06b1959837daf71e31100f622033c966be397d2a016a6f6a087fdde5f","log_path":"~/dev/nebius-hackathon/pilot/v2-P/apluslms__a-plus-1199/runs/pilot-apluslms__a-plus-1199-4caba45e35/logs/agent1/agent1-35.log","tree_digest":null,"tree_download_s":null,"started_at":"2026-10-03T19:09:42.587440Z","duration_s":0.005176,"timed_out":false,"image_before":"f806b96a-96d9-4bf6-be19-50982d279cfd","image_after":"95dfa69f-f1c7-4af1-81fb-e949a522a803","junit":null,"diff":null,"patch_sha256":null,"dropped_paths":[],"snapshot_sha":null}
{"receipt_id":"agent1-36","seq":36,"branch_id":"agent1","kind":"command","cmd":"/opt/receipts-c4234514086341008a5df8f8e129f9ac/bin/busybox mkdir -p /opt/receipts/reports && python -I /opt/receipts-c4234514086341008a5df8f8e129f9ac/receipts_pytest.py exercise/tests.py::ExerciseTest::test_next_unassessed_submitter_view -v --no-header -rA --tb=line --color=no -p no:cacheprovider -W ignore::DeprecationWarning -o junit_family=xunit1 -p no:cacheprovider -rA --continue-on-collection-errors --junitxml=/opt/receipts/reports/agent1-36.xml","path":null,"exit_code":1,"stdout_tail":"============================= test session starts ==============================\ncollecting ... collected 1 item\n\nexercise/tests.py::ExerciseTest::test_next_unassessed_submitter_view FAILED [100%]\n\n=================================== FAILURES ===================================\nE   AssertionError: 7 != '/Course-Url/T-00.1000_d1/test-module/unassessed/submissions/'\n---------------------------- Captured stderr setup -----------------------------\nCreating test database for alias 'default'...\n----------------------------- Captured stdout call -----------------------------\n[2026-10-03 22:09:58,569: INFO/logging] CEF:0|Aalto|aplus|1.23.1|login||5|\n------------------------------ Captured log call -------------------------------\nINFO     aplus.security:logging.py:46 CEF:0|Aalto|aplus|1.23.1|login||5|\n/usr/local/lib/python3.10/unittest/case.py:838: AssertionError: 7 != '/Course-Url/T-00.1000_d1/test-module/unassessed/submissions/'\n=============================== warnings summary ===============================\n../usr/local/lib/python3.10/site-packages/requests/__init__.py:113\n  /usr/local/lib/python3.10/site-packages/requests/__init__.py:113: RequestsDependencyWarning: urllib3 (2.6.3) or chardet (6.0.0dev0)/charset_normalizer (3.4.4) doesn't match a supported version!\n    warnings.warn(\n\n../usr/local/lib/python3.10/site-packages/model_utils/__init__.py:1\n  /usr/local/lib/python3.10/site-packages/model_utils/__init__.py:1: UserWarning: pkg_resources is deprecated as an API. See https://setuptools.pypa.io/en/latest/pkg_resources.html. The pkg_resources package is slated for removal as early as 2025-11-30. Refrain from using this package or pin to Setuptools<81.\n    from pkg_resources import DistributionNotFound, get_distribution\n\nexercise/tests.py: 225 warnings\n  /usr/local/lib/python3.10/site-packages/django/db/models/options.py:210: RemovedInDjango51Warning: 'index_together' is deprecated. Use 'Meta.indexes' in 'course.UserTagging' instead.\n    warnings.warn(\n\n-- Docs: https://docs.pytest.org/en/stable/how-to/capture-warnings.html\n----------- generated xml file: /opt/receipts/reports/agent1-36.xml ------------\n=========================== short test summary info ============================\nFAILED exercise/tests.py::ExerciseTest::test_next_unassessed_submitter_view\n======================= 1 failed, 227 warnings in 8.92s ========================\n","stderr_tail":"","stdout_sha256":"2f154d2db824909f70f3b3b38256dc16ac622c5bd43ce52290dddc26dbb84b6b","log_path":"~/dev/nebius-hackathon/pilot/v2-P/apluslms__a-plus-1199/runs/pilot-apluslms__a-plus-1199-4caba45e35/logs/agent1/agent1-36.log","tree_digest":"56931168812a5fcfdf5c49c4b28a73b72e0048f17a8acdf5e058e3d79c32dbc4","tree_download_s":3.816800917033106,"started_at":"2026-10-03T19:09:46.381168Z","duration_s":12.105149,"timed_out":false,"image_before":"95dfa69f-f1c7-4af1-81fb-e949a522a803","image_after":"55005fc7-5596-4461-9523-91eacb595c8c","junit":{"passed":[],"failed":["exercise/tests.py::ExerciseTest::test_next_unassessed_submitter_view"],"errors":[],"skipped":[],"collection_errors":[],"failure_text":{"exercise/tests.py::ExerciseTest::test_next_unassessed_submitter_view":"AssertionError: 7 != '/Course-Url/T-00.1000_d1/test-module/unassessed/submissions/'\nE   AssertionError: 7 != '/Course-Url/T-00.1000_d1/test-module/unassessed/submissions/'"}},"diff":null,"patch_sha256":null,"dropped_paths":[],"snapshot_sha":null}
{"receipt_id":"agent1-37","seq":37,"branch_id":"agent1","kind":"diff","cmd":"compute patch in executor staging agent1-6f83e9232aed40cd9d1cae02892450fe: /opt/homebrew/Cellar/git/2.53.0/bin/git -c core.hooksPath=/dev/null -c core.attributesFile=/dev/null -c diff.external= -c core.quotePath=false add -A && /opt/homebrew/Cellar/git/2.53.0/bin/git -c core.hooksPath=/dev/null -c core.attributesFile=/dev/null -c diff.external= -c core.quotePath=false diff --cached --binary --no-ext-diff --no-textconv --no-renames d2f7ea39a57eb7b5d63fe4f46dea4a116c430381","path":null,"exit_code":0,"stdout_tail":"diff --git a/exercise/staff_views.py b/exercise/staff_views.py\nindex 7c25404b..33681109 100644\n--- a/exercise/staff_views.py\n+++ b/exercise/staff_views.py\n@@ -343,16 +343,11 @@ class NextUnassessedSubmitterView(ExerciseBaseView, BaseRedirectView):\n     def get(self, request: HttpRequest, *args: Any, **kwargs: Any) -> HttpResponse:\n         # Query submitters who have not been assessed yet.\n         submitter = None\n-        submitters = (UserProfile.objects\n-            .filter(submissions__exercise=self.exercise)\n-            .annotate(\n-                count_assessed=Count(\n-                    'submissions__id',\n-                    filter=(Q(submissions__grader__isnull=False)),\n-                ),\n-            )\n-            .filter(count_assessed=0)\n-            .order_by('id'))\n+        submitters = UserProfile.objects.filter(\n+            submissions__exercise=self.exercise\n+        ).exclude(\n+            submissions__grader__isnull=False\n+        ).distinct().order_by('id')\n \n         previous_user_id = request.GET.get('prev')\n         if previous_user_id:\n","stderr_tail":"","stdout_sha256":"e666386a7cb508a3e30e74eb34d67e363c794fc578b126cf0d50dafd4f559b49","log_path":null,"tree_digest":"56931168812a5fcfdf5c49c4b28a73b72e0048f17a8acdf5e058e3d79c32dbc4","tree_download_s":5.186963625019416,"started_at":"2026-10-03T19:10:16.480795Z","duration_s":0.08684737514704466,"timed_out":false,"image_before":"55005fc7-5596-4461-9523-91eacb595c8c","image_after":"55005fc7-5596-4461-9523-91eacb595c8c","junit":null,"diff":{"files":[{"path":"exercise/staff_views.py","added":5,"deleted":10,"category":"source","status":"modified"}],"patch_sha256":"e666386a7cb508a3e30e74eb34d67e363c794fc578b126cf0d50dafd4f559b49","patch_path":"~/dev/nebius-hackathon/pilot/v2-P/apluslms__a-plus-1199/runs/pilot-apluslms__a-plus-1199-4caba45e35/artifacts/agent1/agent1-37.patch"},"patch_sha256":"e666386a7cb508a3e30e74eb34d67e363c794fc578b126cf0d50dafd4f559b49","dropped_paths":[],"snapshot_sha":"d2f7ea39a57eb7b5d63fe4f46dea4a116c430381"}
